Quantcast

Jenkins build became unstable: Struts-JDK7-pull-request #286

classic Classic list List threaded Threaded
4 messages Options
Reply | Threaded
Open this post in threaded view
|  
Report Content as Inappropriate

Jenkins build became unstable: Struts-JDK7-pull-request #286

Apache Jenkins Server-2
See <https://builds.apache.org/job/Struts-JDK7-pull-request/286/display/redirect?page=changes>


---------------------------------------------------------------------
To unsubscribe, e-mail: [hidden email]
For additional commands, e-mail: [hidden email]

Reply | Threaded
Open this post in threaded view
|  
Report Content as Inappropriate

Build failed in Jenkins: Struts-JDK7-pull-request #287

Apache Jenkins Server-2
See <https://builds.apache.org/job/Struts-JDK7-pull-request/287/display/redirect>

------------------------------------------
[...truncated 8.54 KB...]
 > git rev-parse refs/tags/STRUTS_2_0_11_2^{commit} # timeout=10
 > git rev-parse refs/tags/STRUTS_2_1_1^{commit} # timeout=10
 > git rev-parse refs/tags/STRUTS_2_1_0^{commit} # timeout=10
 > git rev-parse refs/tags/STRUTS_2_3_14_1^{commit} # timeout=10
 > git rev-parse refs/tags/STRUTS_2_3_14_2^{commit} # timeout=10
 > git rev-parse refs/tags/STRUTS_2_1_6^{commit} # timeout=10
 > git rev-parse refs/tags/STRUTS_2_3_14_3^{commit} # timeout=10
 > git rev-parse refs/tags/STRUTS_2_5_2^{commit} # timeout=10
 > git rev-parse refs/tags/STRUTS_2_1_5^{commit} # timeout=10
 > git rev-parse refs/tags/STRUTS_2_5_1^{commit} # timeout=10
 > git rev-parse refs/tags/STRUTS_2_1_4^{commit} # timeout=10
 > git rev-parse refs/tags/STRUTS_2_1_3^{commit} # timeout=10
 > git rev-parse refs/tags/STRUTS_2_5^{commit} # timeout=10
 > git rev-parse refs/tags/changes/228^{commit} # timeout=10
 > git rev-parse refs/tags/changes/229^{commit} # timeout=10
 > git rev-parse refs/tags/STRUTS_2_2_1_1^{commit} # timeout=10
Multiple candidate revisions
Scheduling another build to catch up with Struts-JDK7-pull-request
Checking out Revision 2c0a197cea8fdc7d8cda5eeaa15a1c76507ac0a5 (refs/tags/STRUTS_2_0_0)
 > git config core.sparsecheckout # timeout=10
 > git checkout -f 2c0a197cea8fdc7d8cda5eeaa15a1c76507ac0a5
First time build. Skipping changelog.
[locks-and-latches] Checking to see if we really have the locks
[locks-and-latches] Have all the locks, build can start
Parsing POMs
Failed to transfer Could not find artifact org.apache.struts:struts-master:pom:3 in Nexus (http://repository.apache.org/snapshots)
Downloaded artifact http://repo.maven.apache.org/maven2/org/apache/struts/struts-master/3/struts-master-3.pom
Discovered a new module org.apache.struts:struts2-api Struts 2 API
Modules changed, recalculating dependency graph
Established TCP socket on 46215
maven33-agent.jar already up to date
maven33-interceptor.jar already up to date
maven3-interceptor-commons.jar already up to date
[Struts-JDK7-pull-request] $ /home/jenkins/tools/java/latest1.7/bin/java -Xms128m -Xmx768m -XX:MaxPermSize=256m -XX:PermSize=128m -cp /home/jenkins/jenkins-slave/maven33-agent.jar:/home/jenkins/tools/maven/latest3/boot/plexus-classworlds-2.5.2.jar:/home/jenkins/tools/maven/latest3/conf/logging jenkins.maven3.agent.Maven33Main /home/jenkins/tools/maven/latest3/ /home/jenkins/jenkins-slave/slave.jar /home/jenkins/jenkins-slave/maven33-interceptor.jar /home/jenkins/jenkins-slave/maven3-interceptor-commons.jar 46215
<===[JENKINS REMOTING CAPACITY]===>   channel started
Executing Maven:  -B -f <https://builds.apache.org/job/Struts-JDK7-pull-request/ws/pom.xml> -Dmaven.repo.local=/home/jenkins/jenkins-slave/maven-repositories/1 package -DskipAssembly
[INFO] Scanning for projects...
[WARNING]
[WARNING] Some problems were encountered while building the effective model for org.apache.struts:struts2-core:jar:2.0.0-SNAPSHOT
[WARNING] 'dependencies.dependency.(groupId:artifactId:type:classifier)' must be unique: commons-lang:commons-lang:jar -> version 2.0 vs 2.1 @ org.apache.struts:struts2-core:[unknown-version], <https://builds.apache.org/job/Struts-JDK7-pull-request/ws/core/pom.xml,> line 196, column 21
[WARNING] The expression ${pom.version} is deprecated. Please use ${project.version} instead.
[WARNING] 'repositories.repository.layout' for opensymphony uses the unsupported value 'legacy', artifact resolution might fail. @ org.apache.struts:struts2-parent:2.0.0-SNAPSHOT, <https://builds.apache.org/job/Struts-JDK7-pull-request/ws/pom.xml,> line 290, column 21
[WARNING]
[WARNING] Some problems were encountered while building the effective model for org.apache.struts:struts2-api:jar:2.0.0-SNAPSHOT
[WARNING] 'build.plugins.plugin.version' for org.apache.maven.plugins:maven-javadoc-plugin is missing. @ org.apache.struts:struts2-api:[unknown-version], <https://builds.apache.org/job/Struts-JDK7-pull-request/ws/api/pom.xml,> line 38, column 21
[WARNING] 'repositories.repository.layout' for opensymphony uses the unsupported value 'legacy', artifact resolution might fail. @ org.apache.struts:struts2-parent:2.0.0-SNAPSHOT, <https://builds.apache.org/job/Struts-JDK7-pull-request/ws/pom.xml,> line 290, column 21
[WARNING]
[WARNING] Some problems were encountered while building the effective model for org.apache.struts:struts2-parent:pom:2.0.0-SNAPSHOT
[WARNING] 'repositories.repository.layout' for opensymphony uses the unsupported value 'legacy', artifact resolution might fail. @ line 290, column 21
[WARNING]
[WARNING] It is highly recommended to fix these problems because they threaten the stability of your build.
[WARNING]
[WARNING] For this reason, future Maven versions might no longer support building such malformed projects.
[WARNING]
[INFO] ------------------------------------------------------------------------
[INFO] Reactor Build Order:
[INFO]
[INFO] Struts 2
[INFO] Struts 2 API
[INFO] Struts 2 - Core
[INFO]                                                                        
[INFO] ------------------------------------------------------------------------
[INFO] Building Struts 2 2.0.0-SNAPSHOT
[INFO] ------------------------------------------------------------------------
[INFO] Downloading: http://snapshots.maven.codehaus.org/maven2/org/apache/maven/plugins/maven-idea-plugin/maven-metadata.xml
[INFO] Downloading: https://repo.maven.apache.org/maven2/org/apache/maven/plugins/maven-idea-plugin/maven-metadata.xml
[INFO] Downloaded: https://repo.maven.apache.org/maven2/org/apache/maven/plugins/maven-idea-plugin/maven-metadata.xml (471 B at 1.2 KB/sec)
[WARNING] Could not transfer metadata org.apache.maven.plugins:maven-idea-plugin/maven-metadata.xml from/to Maven Snapshots (http://snapshots.maven.codehaus.org/maven2/): Connect to snapshots.maven.codehaus.org:80 [snapshots.maven.codehaus.org/52.5.67.234] failed: Connection timed out
[INFO] Downloading: https://repo.maven.apache.org/maven2/org/apache/maven/plugins/maven-idea-plugin/2.2.1/maven-idea-plugin-2.2.1.pom
[INFO] Downloaded: https://repo.maven.apache.org/maven2/org/apache/maven/plugins/maven-idea-plugin/2.2.1/maven-idea-plugin-2.2.1.pom (7 KB at 266.8 KB/sec)
[INFO] Downloading: https://repo.maven.apache.org/maven2/org/apache/maven/plugins/maven-idea-plugin/2.2.1/maven-idea-plugin-2.2.1.jar
[INFO] Downloaded: https://repo.maven.apache.org/maven2/org/apache/maven/plugins/maven-idea-plugin/2.2.1/maven-idea-plugin-2.2.1.jar (53 KB at 957.6 KB/sec)
[INFO] Downloading: https://repo.maven.apache.org/maven2/org/apache/maven/plugins/maven-compiler-plugin/maven-metadata.xml
[INFO] Downloading: http://snapshots.maven.codehaus.org/maven2/org/apache/maven/plugins/maven-compiler-plugin/maven-metadata.xml
[INFO] Downloaded: https://repo.maven.apache.org/maven2/org/apache/maven/plugins/maven-compiler-plugin/maven-metadata.xml (924 B at 50.1 KB/sec)
[WARNING] Could not transfer metadata org.apache.maven.plugins:maven-compiler-plugin/maven-metadata.xml from/to Maven Snapshots (http://snapshots.maven.codehaus.org/maven2/): Connect to snapshots.maven.codehaus.org:80 [snapshots.maven.codehaus.org/52.5.67.234] failed: Connection timed out
[INFO] Downloading: http://snapshots.maven.codehaus.org/maven2/org/apache/maven/plugins/maven-surefire-plugin/maven-metadata.xml
[WARNING] Could not transfer metadata org.apache.maven.plugins:maven-surefire-plugin/maven-metadata.xml from/to Maven Snapshots (http://snapshots.maven.codehaus.org/maven2/): Connect to snapshots.maven.codehaus.org:80 [snapshots.maven.codehaus.org/52.5.67.234] failed: Connection timed out
[INFO]                                                                        
[INFO] ------------------------------------------------------------------------
[INFO] Building Struts 2 API 2.0.0-SNAPSHOT
[INFO] ------------------------------------------------------------------------
[INFO] Downloading: http://snapshots.maven.codehaus.org/maven2/org/apache/maven/plugins/maven-javadoc-plugin/maven-metadata.xml
[INFO] Downloading: https://repo.maven.apache.org/maven2/org/apache/maven/plugins/maven-javadoc-plugin/maven-metadata.xml
[INFO] Downloaded: https://repo.maven.apache.org/maven2/org/apache/maven/plugins/maven-javadoc-plugin/maven-metadata.xml (942 B at 51.1 KB/sec)
[WARNING] Could not transfer metadata org.apache.maven.plugins:maven-javadoc-plugin/maven-metadata.xml from/to Maven Snapshots (http://snapshots.maven.codehaus.org/maven2/): Connect to snapshots.maven.codehaus.org:80 [snapshots.maven.codehaus.org/52.5.67.234] failed: Connection timed out
[WARNING] Failure to transfer org.apache.maven.plugins:maven-idea-plugin/maven-metadata.xml from http://snapshots.maven.codehaus.org/maven2/ was cached in the local repository, resolution will not be reattempted until the update interval of Maven Snapshots has elapsed or updates are forced. Original error: Could not transfer metadata org.apache.maven.plugins:maven-idea-plugin/maven-metadata.xml from/to Maven Snapshots (http://snapshots.maven.codehaus.org/maven2/): Connect to snapshots.maven.codehaus.org:80 [snapshots.maven.codehaus.org/52.5.67.234] failed: Connection timed out
[INFO] Downloading: http://repository.apache.org/snapshots/org/easymock/easymock/2.0/easymock-2.0.pom
[INFO] Downloading: https://repo.maven.apache.org/maven2/org/easymock/easymock/2.0/easymock-2.0.pom
[INFO] Downloaded: https://repo.maven.apache.org/maven2/org/easymock/easymock/2.0/easymock-2.0.pom (2 KB at 63.4 KB/sec)
[INFO] Downloading: http://repository.apache.org/snapshots/org/easymock/easymock/2.0/easymock-2.0.jar
[INFO] Downloading: https://repo.maven.apache.org/maven2/org/easymock/easymock/2.0/easymock-2.0.jar
[INFO] Downloaded: https://repo.maven.apache.org/maven2/org/easymock/easymock/2.0/easymock-2.0.jar (59 KB at 41.6 KB/sec)
[INFO]
[INFO] --- maven-resources-plugin:2.6:resources (default-resources) @ struts2-api ---
[WARNING] Using platform encoding (ISO-8859-1 actually) to copy filtered resources, i.e. build is platform dependent!
[INFO] skip non existing resourceDirectory <https://builds.apache.org/job/Struts-JDK7-pull-request/ws/api/src/main/resources>
[INFO]
[INFO] --- maven-compiler-plugin:3.1:compile (default-compile) @ struts2-api ---
[INFO] Changes detected - recompiling the module!
[WARNING] File encoding has not been set, using platform encoding ISO-8859-1, i.e. build is platform dependent!
[INFO] Compiling 14 source files to <https://builds.apache.org/job/Struts-JDK7-pull-request/ws/api/target/classes>
[INFO]
[INFO] --- maven-resources-plugin:2.6:testResources (default-testResources) @ struts2-api ---
[WARNING] Using platform encoding (ISO-8859-1 actually) to copy filtered resources, i.e. build is platform dependent!
[INFO] skip non existing resourceDirectory <https://builds.apache.org/job/Struts-JDK7-pull-request/ws/api/src/test/resources>
[INFO]
[INFO] --- maven-compiler-plugin:3.1:testCompile (default-testCompile) @ struts2-api ---
[INFO] No sources to compile
[INFO]
[INFO] --- maven-surefire-plugin:2.12.4:test (default-test) @ struts2-api ---
[INFO] No tests to run.
[JENKINS] Recording test results
[INFO]
[INFO] --- maven-jar-plugin:2.4:jar (default-jar) @ struts2-api ---
[INFO] Building jar: <https://builds.apache.org/job/Struts-JDK7-pull-request/ws/api/target/struts2-api-2.0.0-SNAPSHOT.jar>
[INFO]                                                                        
[INFO] ------------------------------------------------------------------------
[INFO] Building Struts 2 - Core 2.0.0-SNAPSHOT
[INFO] ------------------------------------------------------------------------
[WARNING] Failure to transfer org.apache.maven.plugins:maven-idea-plugin/maven-metadata.xml from http://snapshots.maven.codehaus.org/maven2/ was cached in the local repository, resolution will not be reattempted until the update interval of Maven Snapshots has elapsed or updates are forced. Original error: Could not transfer metadata org.apache.maven.plugins:maven-idea-plugin/maven-metadata.xml from/to Maven Snapshots (http://snapshots.maven.codehaus.org/maven2/): Connect to snapshots.maven.codehaus.org:80 [snapshots.maven.codehaus.org/52.5.67.234] failed: Connection timed out
[INFO] Downloading: http://snapshots.maven.codehaus.org/maven2/opensymphony/xwork/2.0-SNAPSHOT/maven-metadata.xml
[INFO] Downloading: http://repository.apache.org/snapshots/opensymphony/xwork/2.0-SNAPSHOT/maven-metadata.xml
[INFO] Downloading: http://snapshots.maven.codehaus.org/maven2/opensymphony/xwork/2.0-SNAPSHOT/maven-metadata.xml
[WARNING] Could not transfer metadata opensymphony:xwork:2.0-SNAPSHOT/maven-metadata.xml from/to snapshots-maven-codehaus (http://snapshots.maven.codehaus.org/maven2): Connect to snapshots.maven.codehaus.org:80 [snapshots.maven.codehaus.org/52.5.67.234] failed: Connection timed out
[WARNING] Could not transfer metadata opensymphony:xwork:2.0-SNAPSHOT/maven-metadata.xml from/to opensymphony (http://maven.opensymphony.com): Cannot access http://maven.opensymphony.com with type legacy using the available connector factories: BasicRepositoryConnectorFactory
[WARNING] Could not transfer metadata opensymphony:xwork:2.0-SNAPSHOT/maven-metadata.xml from/to Maven Snapshots (http://snapshots.maven.codehaus.org/maven2/): Connect to snapshots.maven.codehaus.org:80 [snapshots.maven.codehaus.org/52.5.67.234] failed: Connection timed out
[WARNING] Failure to transfer opensymphony:xwork:2.0-SNAPSHOT/maven-metadata.xml from http://snapshots.maven.codehaus.org/maven2 was cached in the local repository, resolution will not be reattempted until the update interval of snapshots-maven-codehaus has elapsed or updates are forced. Original error: Could not transfer metadata opensymphony:xwork:2.0-SNAPSHOT/maven-metadata.xml from/to snapshots-maven-codehaus (http://snapshots.maven.codehaus.org/maven2): Connect to snapshots.maven.codehaus.org:80 [snapshots.maven.codehaus.org/52.5.67.234] failed: Connection timed out
[WARNING] Failure to transfer opensymphony:xwork:2.0-SNAPSHOT/maven-metadata.xml from http://maven.opensymphony.com was cached in the local repository, resolution will not be reattempted until the update interval of opensymphony has elapsed or updates are forced. Original error: Could not transfer metadata opensymphony:xwork:2.0-SNAPSHOT/maven-metadata.xml from/to opensymphony (http://maven.opensymphony.com): Cannot access http://maven.opensymphony.com with type legacy using the available connector factories: BasicRepositoryConnectorFactory
[WARNING] Failure to transfer opensymphony:xwork:2.0-SNAPSHOT/maven-metadata.xml from http://snapshots.maven.codehaus.org/maven2/ was cached in the local repository, resolution will not be reattempted until the update interval of Maven Snapshots has elapsed or updates are forced. Original error: Could not transfer metadata opensymphony:xwork:2.0-SNAPSHOT/maven-metadata.xml from/to Maven Snapshots (http://snapshots.maven.codehaus.org/maven2/): Connect to snapshots.maven.codehaus.org:80 [snapshots.maven.codehaus.org/52.5.67.234] failed: Connection timed out
[INFO] Downloading: http://snapshots.maven.codehaus.org/maven2/opensymphony/xwork/2.0-SNAPSHOT/xwork-2.0-SNAPSHOT.pom
[INFO] Downloading: http://repository.apache.org/snapshots/opensymphony/xwork/2.0-SNAPSHOT/xwork-2.0-SNAPSHOT.pom
[INFO] Downloading: http://snapshots.maven.codehaus.org/maven2/opensymphony/xwork/2.0-SNAPSHOT/xwork-2.0-SNAPSHOT.pom
[INFO] Downloading: http://repository.apache.org/snapshots/freemarker/freemarker/2.3.4/freemarker-2.3.4.pom
[INFO] Downloading: https://repo.maven.apache.org/maven2/freemarker/freemarker/2.3.4/freemarker-2.3.4.pom
[INFO] Downloaded: https://repo.maven.apache.org/maven2/freemarker/freemarker/2.3.4/freemarker-2.3.4.pom (154 B at 7.9 KB/sec)
[INFO] Downloading: http://repository.apache.org/snapshots/uk/ltd/getahead/dwr/1.1-beta-3/dwr-1.1-beta-3.pom
[INFO] Downloading: https://repo.maven.apache.org/maven2/uk/ltd/getahead/dwr/1.1-beta-3/dwr-1.1-beta-3.pom
[INFO] Downloaded: https://repo.maven.apache.org/maven2/uk/ltd/getahead/dwr/1.1-beta-3/dwr-1.1-beta-3.pom (8 KB at 10.0 KB/sec)
[INFO] Downloading: http://repository.apache.org/snapshots/velocity-tools/velocity-tools/1.1/velocity-tools-1.1.pom
[INFO] Downloading: https://repo.maven.apache.org/maven2/velocity-tools/velocity-tools/1.1/velocity-tools-1.1.pom
[INFO] Downloaded: https://repo.maven.apache.org/maven2/velocity-tools/velocity-tools/1.1/velocity-tools-1.1.pom (160 B at 0.8 KB/sec)
[INFO] Downloading: http://repository.apache.org/snapshots/commons-fileupload/commons-fileupload/1.1.1/commons-fileupload-1.1.1.pom
[INFO] Downloading: https://repo.maven.apache.org/maven2/commons-fileupload/commons-fileupload/1.1.1/commons-fileupload-1.1.1.pom
[INFO] Downloaded: https://repo.maven.apache.org/maven2/commons-fileupload/commons-fileupload/1.1.1/commons-fileupload-1.1.1.pom (6 KB at 303.8 KB/sec)
[INFO] Downloading: http://repository.apache.org/snapshots/opensymphony/sitemesh/2.2.1/sitemesh-2.2.1.pom
[INFO] Downloading: https://repo.maven.apache.org/maven2/opensymphony/sitemesh/2.2.1/sitemesh-2.2.1.pom
[INFO] Downloaded: https://repo.maven.apache.org/maven2/opensymphony/sitemesh/2.2.1/sitemesh-2.2.1.pom (154 B at 8.4 KB/sec)
[INFO] Downloading: http://repository.apache.org/snapshots/xstream/xstream/1.1.2/xstream-1.1.2.pom
[INFO] Downloading: https://repo.maven.apache.org/maven2/xstream/xstream/1.1.2/xstream-1.1.2.pom
[INFO] Downloaded: https://repo.maven.apache.org/maven2/xstream/xstream/1.1.2/xstream-1.1.2.pom (148 B at 7.6 KB/sec)
[INFO] Downloading: http://snapshots.maven.codehaus.org/maven2/org/apache/struts/tiles/tiles-core/0.2-SNAPSHOT/maven-metadata.xml
[INFO] Downloading: http://repository.apache.org/snapshots/org/apache/struts/tiles/tiles-core/0.2-SNAPSHOT/maven-metadata.xml
[INFO] Downloading: http://snapshots.maven.codehaus.org/maven2/org/apache/struts/tiles/tiles-core/0.2-SNAPSHOT/maven-metadata.xml
[WARNING] Could not transfer metadata org.apache.struts.tiles:tiles-core:0.2-SNAPSHOT/maven-metadata.xml from/to snapshots-maven-codehaus (http://snapshots.maven.codehaus.org/maven2): Connect to snapshots.maven.codehaus.org:80 [snapshots.maven.codehaus.org/52.5.67.234] failed: Connection timed out
[WARNING] Could not transfer metadata org.apache.struts.tiles:tiles-core:0.2-SNAPSHOT/maven-metadata.xml from/to opensymphony (http://maven.opensymphony.com): Cannot access http://maven.opensymphony.com with type legacy using the available connector factories: BasicRepositoryConnectorFactory
[WARNING] Could not transfer metadata org.apache.struts.tiles:tiles-core:0.2-SNAPSHOT/maven-metadata.xml from/to Maven Snapshots (http://snapshots.maven.codehaus.org/maven2/): Connect to snapshots.maven.codehaus.org:80 [snapshots.maven.codehaus.org/52.5.67.234] failed: Connection timed out
[WARNING] Failure to transfer org.apache.struts.tiles:tiles-core:0.2-SNAPSHOT/maven-metadata.xml from http://snapshots.maven.codehaus.org/maven2 was cached in the local repository, resolution will not be reattempted until the update interval of snapshots-maven-codehaus has elapsed or updates are forced. Original error: Could not transfer metadata org.apache.struts.tiles:tiles-core:0.2-SNAPSHOT/maven-metadata.xml from/to snapshots-maven-codehaus (http://snapshots.maven.codehaus.org/maven2): Connect to snapshots.maven.codehaus.org:80 [snapshots.maven.codehaus.org/52.5.67.234] failed: Connection timed out
[WARNING] Failure to transfer org.apache.struts.tiles:tiles-core:0.2-SNAPSHOT/maven-metadata.xml from http://maven.opensymphony.com was cached in the local repository, resolution will not be reattempted until the update interval of opensymphony has elapsed or updates are forced. Original error: Could not transfer metadata org.apache.struts.tiles:tiles-core:0.2-SNAPSHOT/maven-metadata.xml from/to opensymphony (http://maven.opensymphony.com): Cannot access http://maven.opensymphony.com with type legacy using the available connector factories: BasicRepositoryConnectorFactory
[WARNING] Failure to transfer org.apache.struts.tiles:tiles-core:0.2-SNAPSHOT/maven-metadata.xml from http://snapshots.maven.codehaus.org/maven2/ was cached in the local repository, resolution will not be reattempted until the update interval of Maven Snapshots has elapsed or updates are forced. Original error: Could not transfer metadata org.apache.struts.tiles:tiles-core:0.2-SNAPSHOT/maven-metadata.xml from/to Maven Snapshots (http://snapshots.maven.codehaus.org/maven2/): Connect to snapshots.maven.codehaus.org:80 [snapshots.maven.codehaus.org/52.5.67.234] failed: Connection timed out
[INFO] Downloading: http://snapshots.maven.codehaus.org/maven2/org/apache/struts/tiles/tiles-core/0.2-SNAPSHOT/tiles-core-0.2-SNAPSHOT.pom
[INFO] Downloading: http://repository.apache.org/snapshots/org/apache/struts/tiles/tiles-core/0.2-SNAPSHOT/tiles-core-0.2-SNAPSHOT.pom
[INFO] Downloading: http://snapshots.maven.codehaus.org/maven2/org/apache/struts/tiles/tiles-core/0.2-SNAPSHOT/tiles-core-0.2-SNAPSHOT.pom
[INFO] Downloading: http://repository.apache.org/snapshots/commons-digester/commons-digester/1.7/commons-digester-1.7.pom
[INFO] Downloading: https://repo.maven.apache.org/maven2/commons-digester/commons-digester/1.7/commons-digester-1.7.pom
[INFO] Downloaded: https://repo.maven.apache.org/maven2/commons-digester/commons-digester/1.7/commons-digester-1.7.pom (7 KB at 306.0 KB/sec)
[INFO] Downloading: http://repository.apache.org/snapshots/org/apache/pluto/pluto/1.0.1-rc4/pluto-1.0.1-rc4.pom
[INFO] Downloading: https://repo.maven.apache.org/maven2/org/apache/pluto/pluto/1.0.1-rc4/pluto-1.0.1-rc4.pom
[INFO] Downloaded: https://repo.maven.apache.org/maven2/org/apache/pluto/pluto/1.0.1-rc4/pluto-1.0.1-rc4.pom (159 B at 0.7 KB/sec)
[INFO] Downloading: http://snapshots.maven.codehaus.org/maven2/org/codehaus/plexus/plexus-container-default/1.0-alpha-10-SNAPSHOT/maven-metadata.xml
[INFO] Downloading: http://repository.apache.org/snapshots/org/codehaus/plexus/plexus-container-default/1.0-alpha-10-SNAPSHOT/maven-metadata.xml
[INFO] Downloading: http://snapshots.maven.codehaus.org/maven2/org/codehaus/plexus/plexus-container-default/1.0-alpha-10-SNAPSHOT/maven-metadata.xml
[WARNING] Could not transfer metadata org.codehaus.plexus:plexus-container-default:1.0-alpha-10-SNAPSHOT/maven-metadata.xml from/to snapshots-maven-codehaus (http://snapshots.maven.codehaus.org/maven2): Connect to snapshots.maven.codehaus.org:80 [snapshots.maven.codehaus.org/52.5.67.234] failed: Connection timed out
[WARNING] Could not transfer metadata org.codehaus.plexus:plexus-container-default:1.0-alpha-10-SNAPSHOT/maven-metadata.xml from/to opensymphony (http://maven.opensymphony.com): Cannot access http://maven.opensymphony.com with type legacy using the available connector factories: BasicRepositoryConnectorFactory
[WARNING] Could not transfer metadata org.codehaus.plexus:plexus-container-default:1.0-alpha-10-SNAPSHOT/maven-metadata.xml from/to Maven Snapshots (http://snapshots.maven.codehaus.org/maven2/): Connect to snapshots.maven.codehaus.org:80 [snapshots.maven.codehaus.org/52.5.67.234] failed: Connection timed out
[WARNING] Failure to transfer org.codehaus.plexus:plexus-container-default:1.0-alpha-10-SNAPSHOT/maven-metadata.xml from http://snapshots.maven.codehaus.org/maven2 was cached in the local repository, resolution will not be reattempted until the update interval of snapshots-maven-codehaus has elapsed or updates are forced. Original error: Could not transfer metadata org.codehaus.plexus:plexus-container-default:1.0-alpha-10-SNAPSHOT/maven-metadata.xml from/to snapshots-maven-codehaus (http://snapshots.maven.codehaus.org/maven2): Connect to snapshots.maven.codehaus.org:80 [snapshots.maven.codehaus.org/52.5.67.234] failed: Connection timed out
[WARNING] Failure to transfer org.codehaus.plexus:plexus-container-default:1.0-alpha-10-SNAPSHOT/maven-metadata.xml from http://maven.opensymphony.com was cached in the local repository, resolution will not be reattempted until the update interval of opensymphony has elapsed or updates are forced. Original error: Could not transfer metadata org.codehaus.plexus:plexus-container-default:1.0-alpha-10-SNAPSHOT/maven-metadata.xml from/to opensymphony (http://maven.opensymphony.com): Cannot access http://maven.opensymphony.com with type legacy using the available connector factories: BasicRepositoryConnectorFactory
[WARNING] Failure to transfer org.codehaus.plexus:plexus-container-default:1.0-alpha-10-SNAPSHOT/maven-metadata.xml from http://snapshots.maven.codehaus.org/maven2/ was cached in the local repository, resolution will not be reattempted until the update interval of Maven Snapshots has elapsed or updates are forced. Original error: Could not transfer metadata org.codehaus.plexus:plexus-container-default:1.0-alpha-10-SNAPSHOT/maven-metadata.xml from/to Maven Snapshots (http://snapshots.maven.codehaus.org/maven2/): Connect to snapshots.maven.codehaus.org:80 [snapshots.maven.codehaus.org/52.5.67.234] failed: Connection timed out
[INFO] Downloading: http://snapshots.maven.codehaus.org/maven2/org/codehaus/plexus/plexus-container-default/1.0-alpha-10-SNAPSHOT/plexus-container-default-1.0-alpha-10-SNAPSHOT.pom
[INFO] Downloading: http://repository.apache.org/snapshots/org/codehaus/plexus/plexus-container-default/1.0-alpha-10-SNAPSHOT/plexus-container-default-1.0-alpha-10-SNAPSHOT.pom
[INFO] Downloading: http://snapshots.maven.codehaus.org/maven2/org/codehaus/plexus/plexus-container-default/1.0-alpha-10-SNAPSHOT/plexus-container-default-1.0-alpha-10-SNAPSHOT.pom
[INFO] Downloading: http://repository.apache.org/snapshots/org/springframework/spring-beans/1.2.8/spring-beans-1.2.8.pom
[INFO] Downloading: https://repo.maven.apache.org/maven2/org/springframework/spring-beans/1.2.8/spring-beans-1.2.8.pom
[INFO] Downloaded: https://repo.maven.apache.org/maven2/org/springframework/spring-beans/1.2.8/spring-beans-1.2.8.pom (2 KB at 57.9 KB/sec)
[INFO] Downloading: http://repository.apache.org/snapshots/org/springframework/spring-parent/1.2.8/spring-parent-1.2.8.pom
[INFO] Downloading: https://repo.maven.apache.org/maven2/org/springframework/spring-parent/1.2.8/spring-parent-1.2.8.pom
[INFO] Downloaded: https://repo.maven.apache.org/maven2/org/springframework/spring-parent/1.2.8/spring-parent-1.2.8.pom (11 KB at 63.1 KB/sec)
[INFO] Downloading: http://repository.apache.org/snapshots/org/springframework/spring-core/1.2.8/spring-core-1.2.8.pom
[INFO] Downloading: https://repo.maven.apache.org/maven2/org/springframework/spring-core/1.2.8/spring-core-1.2.8.pom
[INFO] Downloaded: https://repo.maven.apache.org/maven2/org/springframework/spring-core/1.2.8/spring-core-1.2.8.pom (2 KB at 6.8 KB/sec)
[INFO] Downloading: http://repository.apache.org/snapshots/org/springframework/spring-context/1.2.8/spring-context-1.2.8.pom
[INFO] Downloading: https://repo.maven.apache.org/maven2/org/springframework/spring-context/1.2.8/spring-context-1.2.8.pom
[INFO] Downloaded: https://repo.maven.apache.org/maven2/org/springframework/spring-context/1.2.8/spring-context-1.2.8.pom (2 KB at 5.9 KB/sec)
[INFO] Downloading: http://repository.apache.org/snapshots/org/springframework/spring-aop/1.2.8/spring-aop-1.2.8.pom
[INFO] Downloading: https://repo.maven.apache.org/maven2/org/springframework/spring-aop/1.2.8/spring-aop-1.2.8.pom
[INFO] Downloaded: https://repo.maven.apache.org/maven2/org/springframework/spring-aop/1.2.8/spring-aop-1.2.8.pom (2 KB at 10.6 KB/sec)
[INFO] Downloading: http://repository.apache.org/snapshots/org/springframework/spring-web/1.2.8/spring-web-1.2.8.pom
[INFO] Downloading: https://repo.maven.apache.org/maven2/org/springframework/spring-web/1.2.8/spring-web-1.2.8.pom
[INFO] Downloaded: https://repo.maven.apache.org/maven2/org/springframework/spring-web/1.2.8/spring-web-1.2.8.pom (2 KB at 10.2 KB/sec)
[INFO] Downloading: http://repository.apache.org/snapshots/org/springframework/spring-mock/1.2.8/spring-mock-1.2.8.pom
[INFO] Downloading: https://repo.maven.apache.org/maven2/org/springframework/spring-mock/1.2.8/spring-mock-1.2.8.pom
[INFO] Downloaded: https://repo.maven.apache.org/maven2/org/springframework/spring-mock/1.2.8/spring-mock-1.2.8.pom (2 KB at 6.6 KB/sec)
[INFO] Downloading: http://repository.apache.org/snapshots/myfaces/myfaces-jsf-api/1.0.9/myfaces-jsf-api-1.0.9.pom
[INFO] Downloading: https://repo.maven.apache.org/maven2/myfaces/myfaces-jsf-api/1.0.9/myfaces-jsf-api-1.0.9.pom
[INFO] Downloaded: https://repo.maven.apache.org/maven2/myfaces/myfaces-jsf-api/1.0.9/myfaces-jsf-api-1.0.9.pom (156 B at 0.9 KB/sec)
[INFO] Downloading: http://repository.apache.org/snapshots/jmock/jmock/1.0.1/jmock-1.0.1.pom
[INFO] Downloading: https://repo.maven.apache.org/maven2/jmock/jmock/1.0.1/jmock-1.0.1.pom
[INFO] Downloaded: https://repo.maven.apache.org/maven2/jmock/jmock/1.0.1/jmock-1.0.1.pom (314 B at 19.2 KB/sec)
[INFO] Downloading: http://repository.apache.org/snapshots/org/rifers/rife-continuations/0.0.2/rife-continuations-0.0.2.pom
[INFO] Downloading: https://repo.maven.apache.org/maven2/org/rifers/rife-continuations/0.0.2/rife-continuations-0.0.2.pom
[INFO] Downloaded: https://repo.maven.apache.org/maven2/org/rifers/rife-continuations/0.0.2/rife-continuations-0.0.2.pom (3 KB at 31.5 KB/sec)
[INFO] Downloading: http://repository.apache.org/snapshots/jmock/jmock-cglib/1.0.1/jmock-cglib-1.0.1.pom
[INFO] Downloading: https://repo.maven.apache.org/maven2/jmock/jmock-cglib/1.0.1/jmock-cglib-1.0.1.pom
[INFO] Downloaded: https://repo.maven.apache.org/maven2/jmock/jmock-cglib/1.0.1/jmock-cglib-1.0.1.pom (456 B at 2.7 KB/sec)
[INFO] Downloading: http://repository.apache.org/snapshots/log4j/log4j/1.2.9/log4j-1.2.9.pom
[INFO] Downloading: https://repo.maven.apache.org/maven2/log4j/log4j/1.2.9/log4j-1.2.9.pom
[INFO] Downloaded: https://repo.maven.apache.org/maven2/log4j/log4j/1.2.9/log4j-1.2.9.pom (144 B at 7.4 KB/sec)
[INFO] ------------------------------------------------------------------------
[INFO] Reactor Summary:
[INFO]
[INFO] Struts 2 ........................................... SUCCESS [06:27 min]
[INFO] Struts 2 API ....................................... SUCCESS [02:13 min]
[INFO] Struts 2 - Core .................................... FAILURE [19:28 min]
[INFO] ------------------------------------------------------------------------
[INFO] BUILD FAILURE
[INFO] ------------------------------------------------------------------------
[INFO] Total time: 28:15 min
[INFO] Finished at: 2017-04-28T11:42:22+00:00
[INFO] Final Memory: 23M/232M
[INFO] ------------------------------------------------------------------------
Waiting for Jenkins to finish collecting data[ERROR] Failed to execute goal on project struts2-core: Could not resolve dependencies for project org.apache.struts:struts2-core:jar:2.0.0-SNAPSHOT: Failed to collect dependencies at opensymphony:xwork:jar:2.0-SNAPSHOT: Failed to read artifact descriptor for opensymphony:xwork:jar:2.0-SNAPSHOT: Could not transfer artifact opensymphony:xwork:pom:2.0-SNAPSHOT from/to snapshots-maven-codehaus (http://snapshots.maven.codehaus.org/maven2): Connect to snapshots.maven.codehaus.org:80 [snapshots.maven.codehaus.org/52.5.67.234] failed: Connection timed out -> [Help 1]
[ERROR]
[ERROR] To see the full stack trace of the errors, re-run Maven with the -e switch.
[ERROR] Re-run Maven using the -X switch to enable full debug logging.
[ERROR]
[ERROR] For more information about the errors and possible solutions, please read the following articles:
[ERROR] [Help 1] http://cwiki.apache.org/confluence/display/MAVEN/DependencyResolutionException
[ERROR]
[ERROR] After correcting the problems, you can resume the build with the command
[ERROR]   mvn <goals> -rf :struts2-core

[JENKINS] Archiving <https://builds.apache.org/job/Struts-JDK7-pull-request/ws/pom.xml> to org.apache.struts/struts2-parent/2.0.0-SNAPSHOT/struts2-parent-2.0.0-SNAPSHOT.pom
[JENKINS] Archiving <https://builds.apache.org/job/Struts-JDK7-pull-request/ws/core/pom.xml> to org.apache.struts/struts2-core/2.0.0-SNAPSHOT/struts2-core-2.0.0-SNAPSHOT.pom
[JENKINS] Archiving <https://builds.apache.org/job/Struts-JDK7-pull-request/ws/api/pom.xml> to org.apache.struts/struts2-api/2.0.0-SNAPSHOT/struts2-api-2.0.0-SNAPSHOT.pom
[JENKINS] Archiving <https://builds.apache.org/job/Struts-JDK7-pull-request/ws/api/target/struts2-api-2.0.0-SNAPSHOT.jar> to org.apache.struts/struts2-api/2.0.0-SNAPSHOT/struts2-api-2.0.0-SNAPSHOT.jar
No prior successful build to compare, so performing full copy of artifacts
[locks-and-latches] Releasing all the locks
[locks-and-latches] All the locks released
channel stopped

---------------------------------------------------------------------
To unsubscribe, e-mail: [hidden email]
For additional commands, e-mail: [hidden email]

Reply | Threaded
Open this post in threaded view
|  
Report Content as Inappropriate

Jenkins build is unstable: Struts-JDK7-pull-request #288

Apache Jenkins Server-2
See <https://builds.apache.org/job/Struts-JDK7-pull-request/288/display/redirect>


---------------------------------------------------------------------
To unsubscribe, e-mail: [hidden email]
For additional commands, e-mail: [hidden email]

Reply | Threaded
Open this post in threaded view
|  
Report Content as Inappropriate

Jenkins build is back to stable : Struts-JDK7-pull-request #289

Apache Jenkins Server-2
See <https://builds.apache.org/job/Struts-JDK7-pull-request/289/display/redirect?page=changes>


---------------------------------------------------------------------
To unsubscribe, e-mail: [hidden email]
For additional commands, e-mail: [hidden email]

Loading...