Build failed in Jenkins: Tiles-Request #19

classic Classic list List threaded Threaded
2 messages Options
Reply | Threaded
Open this post in threaded view
|

Build failed in Jenkins: Tiles-Request #19

Apache Jenkins Server-2
See <https://builds.apache.org/job/Tiles-Request/19/display/redirect?page=changes>

Changes:

[mck] use Tiles Master 7

------------------------------------------
[...truncated 30.30 KB...]
A         tiles-request-api/src/main/java/org/apache/tiles/request/reflect
AU        tiles-request-api/src/main/java/org/apache/tiles/request/reflect/ClassUtil.java
AU        tiles-request-api/src/main/java/org/apache/tiles/request/reflect/CannotAccessMethodException.java
AU        tiles-request-api/src/main/java/org/apache/tiles/request/reflect/package-info.java
AU        tiles-request-api/src/main/java/org/apache/tiles/request/reflect/CannotInstantiateObjectException.java
A         tiles-request-api/src/site
A         tiles-request-api/src/site/site.xml
A         tiles-request-api/src/test
A         tiles-request-api/src/test/resources
A         tiles-request-api/src/test/resources/org
A         tiles-request-api/src/test/resources/org/apache
A         tiles-request-api/src/test/resources/org/apache/tiles
A         tiles-request-api/src/test/resources/org/apache/tiles/request
A         tiles-request-api/src/test/resources/org/apache/tiles/request/test
A         tiles-request-api/src/test/resources/org/apache/tiles/request/test/locale
A         tiles-request-api/src/test/resources/org/apache/tiles/request/test/locale/resource.txt
A         tiles-request-api/src/test/resources/org/apache/tiles/request/test/locale/resource with space.txt
A         tiles-request-api/src/test/java
A         tiles-request-api/src/test/java/org
A         tiles-request-api/src/test/java/org/apache
A         tiles-request-api/src/test/java/org/apache/tiles
A         tiles-request-api/src/test/java/org/apache/tiles/request
AU        tiles-request-api/src/test/java/org/apache/tiles/request/DefaultRequestWrapperTest.java
A         tiles-request-api/src/test/java/org/apache/tiles/request/locale
A         tiles-request-api/src/test/java/org/apache/tiles/request/locale/LocaleUtilTest.java
A         tiles-request-api/src/test/java/org/apache/tiles/request/locale/URLApplicationResourceTest.java
A         tiles-request-api/src/test/java/org/apache/tiles/request/locale/PostfixedApplicationResourceTest.java
A         tiles-request-api/src/test/java/org/apache/tiles/request/render
AU        tiles-request-api/src/test/java/org/apache/tiles/request/render/ChainedDelegateRendererTest.java
AU        tiles-request-api/src/test/java/org/apache/tiles/request/render/StringRendererTest.java
AU        tiles-request-api/src/test/java/org/apache/tiles/request/render/BasicRendererFactoryTest.java
AU        tiles-request-api/src/test/java/org/apache/tiles/request/render/PublisherRendererTest.java
AU        tiles-request-api/src/test/java/org/apache/tiles/request/render/NoSuchRendererExceptionTest.java
AU        tiles-request-api/src/test/java/org/apache/tiles/request/render/DispatchRendererTest.java
A         tiles-request-api/src/test/java/org/apache/tiles/request/osgi
A         tiles-request-api/src/test/java/org/apache/tiles/request/osgi/URLBundleApplicationResourceTest.java
A         tiles-request-api/src/test/java/org/apache/tiles/request/reflect
AU        tiles-request-api/src/test/java/org/apache/tiles/request/reflect/CannotInstantiateObjectExceptionTest.java
AU        tiles-request-api/src/test/java/org/apache/tiles/request/reflect/ClassUtilTest.java
AU        tiles-request-api/src/test/java/org/apache/tiles/request/reflect/CannotAccessMethodExceptionTest.java
AU        tiles-request-api/src/test/java/org/apache/tiles/request/ApplicationAccessTest.java
AU        tiles-request-api/src/test/java/org/apache/tiles/request/AbstractViewRequestTest.java
AU        tiles-request-api/src/test/java/org/apache/tiles/request/RequestExceptionTest.java
AU        tiles-request-api/src/test/java/org/apache/tiles/request/ApplicationContextWrapperTest.java
AU        tiles-request-api/src/test/java/org/apache/tiles/request/DispatchRequestWrapperTest.java
A         tiles-request-api/src/test/java/org/apache/tiles/request/scope
AU        tiles-request-api/src/test/java/org/apache/tiles/request/AbstractClientRequestTest.java
A         tiles-request-api/src/test/java/org/apache/tiles/request/collection
AU        tiles-request-api/src/test/java/org/apache/tiles/request/collection/CollectionUtilTest.java
AU        tiles-request-api/src/test/java/org/apache/tiles/request/collection/AddableParameterMapTest.java
AU        tiles-request-api/src/test/java/org/apache/tiles/request/collection/MapEntryArrayValuesTest.java
AU        tiles-request-api/src/test/java/org/apache/tiles/request/collection/ReadOnlyEnumerationMapValuesCollectionTest.java
AU        tiles-request-api/src/test/java/org/apache/tiles/request/collection/MapEntryTest.java
AU        tiles-request-api/src/test/java/org/apache/tiles/request/collection/ReadOnlyEnumerationMapEntrySetTest.java
AU        tiles-request-api/src/test/java/org/apache/tiles/request/collection/RemovableKeySetTest.java
AU        tiles-request-api/src/test/java/org/apache/tiles/request/collection/ReadOnlyEnumerationMapTest.java
AU        tiles-request-api/src/test/java/org/apache/tiles/request/collection/HeaderValuesCollectionTest.java
AU        tiles-request-api/src/test/java/org/apache/tiles/request/collection/HeaderValuesMapEntrySetTest.java
AU        tiles-request-api/src/test/java/org/apache/tiles/request/collection/KeySetTest.java
AU        tiles-request-api/src/test/java/org/apache/tiles/request/collection/ScopeMapEntrySetTest.java
AU        tiles-request-api/src/test/java/org/apache/tiles/request/collection/HeaderValuesMapTest.java
AU        tiles-request-api/src/test/java/org/apache/tiles/request/collection/ScopeMapTest.java
AU        tiles-request-api/src/test/java/org/apache/tiles/request/AbstractRequestTest.java
AU        tiles-request-api/src/test/java/org/apache/tiles/request/NotAvailableFeatureExceptionTest.java
AU        tiles-request-api/pom.xml
A         tiles-request-mustache
A         tiles-request-mustache/src
A         tiles-request-mustache/src/test
A         tiles-request-mustache/src/test/resources
A         tiles-request-mustache/src/test/resources/test.html
A         tiles-request-mustache/src/test/java
A         tiles-request-mustache/src/test/java/org
A         tiles-request-mustache/src/test/java/org/apache
A         tiles-request-mustache/src/test/java/org/apache/tiles
A         tiles-request-mustache/src/test/java/org/apache/tiles/request
A         tiles-request-mustache/src/test/java/org/apache/tiles/request/mustache
A         tiles-request-mustache/src/test/java/org/apache/tiles/request/mustache/MustacheRendererTest.java
A         tiles-request-mustache/src/test/java/org/apache/tiles/request/render
A         tiles-request-mustache/src/main
A         tiles-request-mustache/src/main/java
A         tiles-request-mustache/src/main/java/org
A         tiles-request-mustache/src/main/java/org/apache
A         tiles-request-mustache/src/main/java/org/apache/tiles
A         tiles-request-mustache/src/main/java/org/apache/tiles/request
A         tiles-request-mustache/src/main/java/org/apache/tiles/request/mustache
A         tiles-request-mustache/src/main/java/org/apache/tiles/request/mustache/package-info.java
A         tiles-request-mustache/src/main/java/org/apache/tiles/request/mustache/MustacheScopeExtractor.java
A         tiles-request-mustache/src/main/java/org/apache/tiles/request/mustache/MustacheRenderer.java
A         tiles-request-mustache/src/site
A         tiles-request-mustache/src/site/site.xml
A         tiles-request-mustache/pom.xml
A         assembly
A         assembly/src
A         assembly/src/main
A         assembly/src/main/resources
A         assembly/src/main/resources/NOTICE.txt
A         assembly/src/main/resources/LICENSE.txt
A         assembly/src/main/assembly
A         assembly/src/main/assembly/src.xml
A         assembly/src/main/assembly/bin.xml
A         assembly/src/main/assembly/docs.xml
A         assembly/src/site
A         assembly/src/site/site.xml
A         assembly/pom.xml
A         tiles-request-servlet-wildcard
A         tiles-request-servlet-wildcard/src
A         tiles-request-servlet-wildcard/src/test
A         tiles-request-servlet-wildcard/src/test/java
A         tiles-request-servlet-wildcard/src/test/java/org
A         tiles-request-servlet-wildcard/src/test/java/org/apache
A         tiles-request-servlet-wildcard/src/test/java/org/apache/tiles
A         tiles-request-servlet-wildcard/src/test/java/org/apache/tiles/request
A         tiles-request-servlet-wildcard/src/test/java/org/apache/tiles/request/servlet
A         tiles-request-servlet-wildcard/src/test/java/org/apache/tiles/request/servlet/wildcard
AU        tiles-request-servlet-wildcard/src/test/java/org/apache/tiles/request/servlet/wildcard/WildcardServletApplicationContextTest.java
A         tiles-request-servlet-wildcard/src/test/resources
A         tiles-request-servlet-wildcard/src/main
A         tiles-request-servlet-wildcard/src/main/resources
A         tiles-request-servlet-wildcard/src/main/java
A         tiles-request-servlet-wildcard/src/main/java/org
A         tiles-request-servlet-wildcard/src/main/java/org/apache
A         tiles-request-servlet-wildcard/src/main/java/org/apache/tiles
A         tiles-request-servlet-wildcard/src/main/java/org/apache/tiles/request
A         tiles-request-servlet-wildcard/src/main/java/org/apache/tiles/request/servlet
A         tiles-request-servlet-wildcard/src/main/java/org/apache/tiles/request/servlet/wildcard
A         tiles-request-servlet-wildcard/src/main/java/org/apache/tiles/request/servlet/wildcard/package-info.java
AU        tiles-request-servlet-wildcard/src/main/java/org/apache/tiles/request/servlet/wildcard/WildcardServletApplicationContext.java
A         tiles-request-servlet-wildcard/src/site
A         tiles-request-servlet-wildcard/src/site/site.xml
AU        tiles-request-servlet-wildcard/pom.xml
 U        .
At revision 1807476

Parsing POMs
Downloaded artifact http://repo.maven.apache.org/maven2/org/apache/tiles/tiles-master/7/tiles-master-7.pom
Modules changed, recalculating dependency graph
Established TCP socket on 42727
maven33-agent.jar already up to date
maven33-interceptor.jar already up to date
maven3-interceptor-commons.jar already up to date
[Tiles-Request] $ /home/jenkins/tools/java/latest1.7/bin/java -Xmx2g -Xms256m -cp /home/jenkins/jenkins-slave/maven33-agent.jar:/home/jenkins/tools/maven/apache-maven-3.3.9/boot/plexus-classworlds-2.5.2.jar:/home/jenkins/tools/maven/apache-maven-3.3.9/conf/logging jenkins.maven3.agent.Maven33Main /home/jenkins/tools/maven/apache-maven-3.3.9 /home/jenkins/jenkins-slave/slave.jar /home/jenkins/jenkins-slave/maven33-interceptor.jar /home/jenkins/jenkins-slave/maven3-interceptor-commons.jar 42727
<===[JENKINS REMOTING CAPACITY]===>   channel started
ERROR: ================================================================================
ERROR: Invalid project setup: jenkins/security/MasterToSlaveCallable : Unsupported major.minor version 52.0
ERROR: [JENKINS-18403][JENKINS-28294] JDK 'JDK 1.7 (latest)' not supported to run Maven projects.
ERROR: Maven projects have to be launched with a Java version greater or equal to the minimum version required by the master.
ERROR: Use the Maven JDK Toolchains (plugin) to build your maven project with an older JDK.
ERROR: Retrying with slave Java and setting compile/test properties to point to /home/jenkins/tools/java/latest1.7.
ERROR: ================================================================================
Established TCP socket on 34219
maven33-agent.jar already up to date
maven33-interceptor.jar already up to date
maven3-interceptor-commons.jar already up to date
[Tiles-Request] $ /usr/local/asfpackages/java/jdk1.8.0_131/jre/bin/java -Xmx2g -Xms256m -cp /home/jenkins/jenkins-slave/maven33-agent.jar:/home/jenkins/tools/maven/apache-maven-3.3.9/boot/plexus-classworlds-2.5.2.jar:/home/jenkins/tools/maven/apache-maven-3.3.9/conf/logging jenkins.maven3.agent.Maven33Main /home/jenkins/tools/maven/apache-maven-3.3.9 /home/jenkins/jenkins-slave/slave.jar /home/jenkins/jenkins-slave/maven33-interceptor.jar /home/jenkins/jenkins-slave/maven3-interceptor-commons.jar 34219
<===[JENKINS REMOTING CAPACITY]===>   channel started
Executing Maven:  -B -f <https://builds.apache.org/job/Tiles-Request/ws/pom.xml> -Dmaven.repo.local=/home/jenkins/jenkins-slave/maven-repositories/0 clean install checkstyle:checkstyle
[INFO] Scanning for projects...
[INFO] Downloading: https://repo.maven.apache.org/maven2/org/apache/maven/wagon/wagon-ssh/2.12/wagon-ssh-2.12.pom
[INFO] Downloaded: https://repo.maven.apache.org/maven2/org/apache/maven/wagon/wagon-ssh/2.12/wagon-ssh-2.12.pom (7 KB at 12.9 KB/sec)
[INFO] Downloading: https://repo.maven.apache.org/maven2/org/apache/maven/wagon/wagon-providers/2.12/wagon-providers-2.12.pom
[INFO] Downloaded: https://repo.maven.apache.org/maven2/org/apache/maven/wagon/wagon-providers/2.12/wagon-providers-2.12.pom (3 KB at 144.4 KB/sec)
[INFO] Downloading: https://repo.maven.apache.org/maven2/com/jcraft/jsch.agentproxy.jsch/0.0.9/jsch.agentproxy.jsch-0.0.9.pom
[INFO] Downloaded: https://repo.maven.apache.org/maven2/com/jcraft/jsch.agentproxy.jsch/0.0.9/jsch.agentproxy.jsch-0.0.9.pom (2 KB at 59.7 KB/sec)
[INFO] Downloading: https://repo.maven.apache.org/maven2/org/apache/maven/wagon/wagon-ssh-common/2.12/wagon-ssh-common-2.12.pom
[INFO] Downloaded: https://repo.maven.apache.org/maven2/org/apache/maven/wagon/wagon-ssh-common/2.12/wagon-ssh-common-2.12.pom (2 KB at 116.1 KB/sec)
[INFO] Downloading: https://repo.maven.apache.org/maven2/org/apache/maven/wagon/wagon-provider-api/2.12/wagon-provider-api-2.12.pom
[INFO] Downloaded: https://repo.maven.apache.org/maven2/org/apache/maven/wagon/wagon-provider-api/2.12/wagon-provider-api-2.12.pom (2 KB at 109.7 KB/sec)
[INFO] Downloading: https://repo.maven.apache.org/maven2/org/apache/maven/wagon/wagon-ssh/2.12/wagon-ssh-2.12.jar
[INFO] Downloading: https://repo.maven.apache.org/maven2/com/jcraft/jsch.agentproxy.jsch/0.0.9/jsch.agentproxy.jsch-0.0.9.jar
[INFO] Downloading: https://repo.maven.apache.org/maven2/org/apache/maven/wagon/wagon-ssh-common/2.12/wagon-ssh-common-2.12.jar
[INFO] Downloading: https://repo.maven.apache.org/maven2/org/apache/maven/wagon/wagon-provider-api/2.12/wagon-provider-api-2.12.jar
[INFO] Downloaded: https://repo.maven.apache.org/maven2/org/apache/maven/wagon/wagon-ssh/2.12/wagon-ssh-2.12.jar (31 KB at 305.1 KB/sec)
[INFO] Downloaded: https://repo.maven.apache.org/maven2/com/jcraft/jsch.agentproxy.jsch/0.0.9/jsch.agentproxy.jsch-0.0.9.jar (5 KB at 31.4 KB/sec)
[INFO] Downloaded: https://repo.maven.apache.org/maven2/org/apache/maven/wagon/wagon-ssh-common/2.12/wagon-ssh-common-2.12.jar (27 KB at 171.4 KB/sec)
[INFO] Downloaded: https://repo.maven.apache.org/maven2/org/apache/maven/wagon/wagon-provider-api/2.12/wagon-provider-api-2.12.jar (54 KB at 361.6 KB/sec)
[INFO] ------------------------------------------------------------------------
[INFO] Reactor Build Order:
[INFO]
[INFO] Tiles Request Framework
[INFO] Tiles request - API
[INFO] Tiles request - Servlet support
[INFO] Tiles Request - Wildcard file loading in Servlets
[INFO] Tiles - Portlet support
[INFO] Tiles - Wildcard file loading in Portlets
[INFO] Tiles Request - JSP support
[INFO] Tiles Request - Freemarker support
[INFO] Tiles Request - Velocity support
[INFO] Tiles request - Mustache support
[INFO] Tiles Request Assembly
[INFO] Downloading: https://repo.maven.apache.org/maven2/org/apache/maven/plugins/maven-site-scm-publish-plugin/1.1/maven-site-scm-publish-plugin-1.1.pom
[WARNING] The POM for org.apache.maven.plugins:maven-site-scm-publish-plugin:jar:1.1 is missing, no dependency information available
[INFO] Downloading: https://repo.maven.apache.org/maven2/org/apache/maven/plugins/maven-site-scm-publish-plugin/1.1/maven-site-scm-publish-plugin-1.1.jar
[WARNING] Failed to retrieve plugin descriptor for org.apache.maven.plugins:maven-site-scm-publish-plugin:1.1: Plugin org.apache.maven.plugins:maven-site-scm-publish-plugin:1.1 or one of its dependencies could not be resolved: Could not find artifact org.apache.maven.plugins:maven-site-scm-publish-plugin:jar:1.1 in central (https://repo.maven.apache.org/maven2)
[INFO] Downloading: https://repo.maven.apache.org/maven2/org/codehaus/mojo/wagon-maven-plugin/1.0-beta-5/wagon-maven-plugin-1.0-beta-5.pom
[INFO] Downloaded: https://repo.maven.apache.org/maven2/org/codehaus/mojo/wagon-maven-plugin/1.0-beta-5/wagon-maven-plugin-1.0-beta-5.pom (6 KB at 227.8 KB/sec)
[INFO] Downloading: https://repo.maven.apache.org/maven2/org/codehaus/mojo/wagon-maven-plugin/1.0-beta-5/wagon-maven-plugin-1.0-beta-5.jar
[INFO] Downloaded: https://repo.maven.apache.org/maven2/org/codehaus/mojo/wagon-maven-plugin/1.0-beta-5/wagon-maven-plugin-1.0-beta-5.jar (50 KB at 1596.6 KB/sec)
[INFO]                                                                        
[INFO] ------------------------------------------------------------------------
[INFO] Building Tiles Request Framework 1.1-SNAPSHOT
[INFO] ------------------------------------------------------------------------
[WARNING] The POM for org.apache.maven.plugins:maven-site-scm-publish-plugin:jar:1.1 is missing, no dependency information available
[WARNING] Failed to retrieve plugin descriptor for org.apache.maven.plugins:maven-site-scm-publish-plugin:1.1: Plugin org.apache.maven.plugins:maven-site-scm-publish-plugin:1.1 or one of its dependencies could not be resolved: Failure to find org.apache.maven.plugins:maven-site-scm-publish-plugin:jar:1.1 in https://repo.maven.apache.org/maven2 was cached in the local repository, resolution will not be reattempted until the update interval of central has elapsed or updates are forced
[INFO]
[INFO] --- maven-clean-plugin:3.0.0:clean (default-clean) @ tiles-request ---
[INFO]
[INFO] --- maven-enforcer-plugin:1.4.1:enforce (enforce-java) @ tiles-request ---
[WARNING] Rule 0: org.apache.maven.plugins.enforcer.RequireJavaVersion failed with message:
Detected JDK Version: 1.8.0-131 is not in the allowed range [1.8.0-144,1.9).
[INFO] ------------------------------------------------------------------------
[INFO] Reactor Summary:
[INFO]
[INFO] Tiles Request Framework ............................ FAILURE [  1.368 s]
[INFO] Tiles request - API ................................ SKIPPED
[INFO] Tiles request - Servlet support .................... SKIPPED
[INFO] Tiles Request - Wildcard file loading in Servlets .. SKIPPED
[INFO] Tiles - Portlet support ............................ SKIPPED
[INFO] Tiles - Wildcard file loading in Portlets .......... SKIPPED
[INFO] Tiles Request - JSP support ........................ SKIPPED
[INFO] Tiles Request - Freemarker support ................. SKIPPED
[INFO] Tiles Request - Velocity support ................... SKIPPED
[INFO] Tiles request - Mustache support ................... SKIPPED
[INFO] Tiles Request Assembly ............................. SKIPPED
[INFO] ------------------------------------------------------------------------
[INFO] BUILD FAILURE
[INFO] ------------------------------------------------------------------------
[INFO] Total time: 9.395 s
[INFO] Finished at: 2017-09-06T12:27:50+00:00
[INFO] Final Memory: 30M/392M
[INFO] ------------------------------------------------------------------------
[ERROR] Failed to execute goal org.apache.maven.plugins:maven-enforcer-plugin:1.4.1:enforce (enforce-java) on project tiles-request: Some Enforcer rules have failed. Look above for specific messages explaining why the rule failed. -> [Help 1]
[ERROR]
[ERROR] To see the full stack trace of the errors, re-run Maven with the -e switch.
[ERROR] Re-run Maven using the -X switch to enable full debug logging.
[ERROR]
[ERROR] For more information about the errors and possible solutions, please read the following articles:
[ERROR] [Help 1] http://cwiki.apache.org/confluence/display/MAVEN/MojoExecutionException
[JENKINS] Archiving <https://builds.apache.org/job/Tiles-Request/ws/assembly/pom.xml> to org.apache.tiles/tiles-request-assembly/1.1-SNAPSHOT/tiles-request-assembly-1.1-SNAPSHOT.pom
[JENKINS] Archiving <https://builds.apache.org/job/Tiles-Request/ws/pom.xml> to org.apache.tiles/tiles-request/1.1-SNAPSHOT/tiles-request-1.1-SNAPSHOT.pom
[JENKINS] Archiving <https://builds.apache.org/job/Tiles-Request/ws/tiles-request-velocity/pom.xml> to org.apache.tiles/tiles-request-velocity/1.1-SNAPSHOT/tiles-request-velocity-1.1-SNAPSHOT.pom
[JENKINS] Archiving <https://builds.apache.org/job/Tiles-Request/ws/tiles-request-freemarker/pom.xml> to org.apache.tiles/tiles-request-freemarker/1.1-SNAPSHOT/tiles-request-freemarker-1.1-SNAPSHOT.pom
[JENKINS] Archiving <https://builds.apache.org/job/Tiles-Request/ws/tiles-request-servlet-wildcard/pom.xml> to org.apache.tiles/tiles-request-servlet-wildcard/1.1-SNAPSHOT/tiles-request-servlet-wildcard-1.1-SNAPSHOT.pom
[JENKINS] Archiving <https://builds.apache.org/job/Tiles-Request/ws/tiles-request-mustache/pom.xml> to org.apache.tiles/tiles-request-mustache/1.1-SNAPSHOT/tiles-request-mustache-1.1-SNAPSHOT.pom
[JENKINS] Archiving <https://builds.apache.org/job/Tiles-Request/ws/tiles-request-jsp/pom.xml> to org.apache.tiles/tiles-request-jsp/1.1-SNAPSHOT/tiles-request-jsp-1.1-SNAPSHOT.pom
[JENKINS] Archiving <https://builds.apache.org/job/Tiles-Request/ws/tiles-request-servlet/pom.xml> to org.apache.tiles/tiles-request-servlet/1.1-SNAPSHOT/tiles-request-servlet-1.1-SNAPSHOT.pom
[JENKINS] Archiving <https://builds.apache.org/job/Tiles-Request/ws/tiles-request-portlet-wildcard/pom.xml> to org.apache.tiles/tiles-request-portlet-wildcard/1.1-SNAPSHOT/tiles-request-portlet-wildcard-1.1-SNAPSHOT.pom
[JENKINS] Archiving <https://builds.apache.org/job/Tiles-Request/ws/tiles-request-api/pom.xml> to org.apache.tiles/tiles-request-api/1.1-SNAPSHOT/tiles-request-api-1.1-SNAPSHOT.pom
[JENKINS] Archiving <https://builds.apache.org/job/Tiles-Request/ws/tiles-request-portlet/pom.xml> to org.apache.tiles/tiles-request-portlet/1.1-SNAPSHOT/tiles-request-portlet-1.1-SNAPSHOT.pom
channel stopped
Reply | Threaded
Open this post in threaded view
|

Jenkins build is back to normal : Tiles-Request #20

Apache Jenkins Server-2