Build failed in Jenkins: Tiles-Request-1.0.x #21

classic Classic list List threaded Threaded
9 messages Options
Reply | Threaded
Open this post in threaded view
|

Build failed in Jenkins: Tiles-Request-1.0.x #21

Apache Jenkins Server-2
See <https://builds.apache.org/job/Tiles-Request-1.0.x/21/display/redirect?page=changes>

Changes:

[mck] [maven-release-plugin] prepare for next development iteration

[mck] [maven-release-plugin] prepare release tiles-request-1.0.7

------------------------------------------
[...truncated 38.85 KB...]
A         tiles-request-portlet-wildcard/src/main
A         tiles-request-portlet-wildcard/src/main/java
A         tiles-request-portlet-wildcard/src/main/java/org
A         tiles-request-portlet-wildcard/src/main/java/org/apache
A         tiles-request-portlet-wildcard/src/main/java/org/apache/tiles
A         tiles-request-portlet-wildcard/src/main/java/org/apache/tiles/request
A         tiles-request-portlet-wildcard/src/main/java/org/apache/tiles/request/portlet
A         tiles-request-portlet-wildcard/src/main/java/org/apache/tiles/request/portlet/wildcard
AU        tiles-request-portlet-wildcard/src/main/java/org/apache/tiles/request/portlet/wildcard/WildcardPortletApplicationContext.java
A         tiles-request-portlet-wildcard/src/main/java/org/apache/tiles/request/portlet/wildcard/package-info.java
A         tiles-request-portlet-wildcard/src/main/resources
A         tiles-request-portlet-wildcard/src/site
A         tiles-request-portlet-wildcard/src/site/site.xml
 U        .
At revision 1807204

Parsing POMs
Modules changed, recalculating dependency graph
Established TCP socket on 39786
maven33-agent.jar already up to date
maven33-interceptor.jar already up to date
maven3-interceptor-commons.jar already up to date
[Tiles-Request-1.0.x] $ /home/jenkins/tools/java/latest1.7/bin/java -Xmx2g -Xms256m -cp /home/jenkins/jenkins-slave/maven33-agent.jar:/home/jenkins/tools/maven/apache-maven-3.3.9/boot/plexus-classworlds-2.5.2.jar:/home/jenkins/tools/maven/apache-maven-3.3.9/conf/logging jenkins.maven3.agent.Maven33Main /home/jenkins/tools/maven/apache-maven-3.3.9 /home/jenkins/jenkins-slave/slave.jar /home/jenkins/jenkins-slave/maven33-interceptor.jar /home/jenkins/jenkins-slave/maven3-interceptor-commons.jar 39786
<===[JENKINS REMOTING CAPACITY]===>   channel started
ERROR: ================================================================================
ERROR: Invalid project setup: jenkins/security/MasterToSlaveCallable : Unsupported major.minor version 52.0
ERROR: [JENKINS-18403][JENKINS-28294] JDK 'JDK 1.7 (latest)' not supported to run Maven projects.
ERROR: Maven projects have to be launched with a Java version greater or equal to the minimum version required by the master.
ERROR: Use the Maven JDK Toolchains (plugin) to build your maven project with an older JDK.
ERROR: Retrying with slave Java and setting compile/test properties to point to /home/jenkins/tools/java/latest1.7.
ERROR: ================================================================================
Established TCP socket on 39902
maven33-agent.jar already up to date
maven33-interceptor.jar already up to date
maven3-interceptor-commons.jar already up to date
[Tiles-Request-1.0.x] $ /usr/local/asfpackages/java/jdk1.8.0_131/jre/bin/java -Xmx2g -Xms256m -cp /home/jenkins/jenkins-slave/maven33-agent.jar:/home/jenkins/tools/maven/apache-maven-3.3.9/boot/plexus-classworlds-2.5.2.jar:/home/jenkins/tools/maven/apache-maven-3.3.9/conf/logging jenkins.maven3.agent.Maven33Main /home/jenkins/tools/maven/apache-maven-3.3.9 /home/jenkins/jenkins-slave/slave.jar /home/jenkins/jenkins-slave/maven33-interceptor.jar /home/jenkins/jenkins-slave/maven3-interceptor-commons.jar 39902
<===[JENKINS REMOTING CAPACITY]===>   channel started
Executing Maven:  -B -f <https://builds.apache.org/job/Tiles-Request-1.0.x/ws/pom.xml> -Dmaven.repo.local=/home/jenkins/jenkins-slave/maven-repositories/0 clean install
[INFO] Scanning for projects...
[INFO] Downloading: https://repo.maven.apache.org/maven2/org/apache/maven/plugins/maven-scm-publish-plugin/1.0-beta-2/maven-scm-publish-plugin-1.0-beta-2.pom
[INFO] Downloaded: https://repo.maven.apache.org/maven2/org/apache/maven/plugins/maven-scm-publish-plugin/1.0-beta-2/maven-scm-publish-plugin-1.0-beta-2.pom (7 KB at 22.3 KB/sec)
[INFO] Downloading: https://repo.maven.apache.org/maven2/org/apache/maven/release/maven-release-manager/2.3.2/maven-release-manager-2.3.2.pom
[INFO] Downloaded: https://repo.maven.apache.org/maven2/org/apache/maven/release/maven-release-manager/2.3.2/maven-release-manager-2.3.2.pom (10 KB at 395.2 KB/sec)
[INFO] Downloading: https://repo.maven.apache.org/maven2/org/apache/maven/release/maven-release/2.3.2/maven-release-2.3.2.pom
[INFO] Downloaded: https://repo.maven.apache.org/maven2/org/apache/maven/release/maven-release/2.3.2/maven-release-2.3.2.pom (9 KB at 382.7 KB/sec)
[INFO] Downloading: https://repo.maven.apache.org/maven2/org/apache/maven/scm/maven-scm-providers-standard/1.7/maven-scm-providers-standard-1.7.pom
[INFO] Downloaded: https://repo.maven.apache.org/maven2/org/apache/maven/scm/maven-scm-providers-standard/1.7/maven-scm-providers-standard-1.7.pom (4 KB at 213.9 KB/sec)
[INFO] Downloading: https://repo.maven.apache.org/maven2/org/apache/maven/scm/maven-scm-providers/1.7/maven-scm-providers-1.7.pom
[INFO] Downloaded: https://repo.maven.apache.org/maven2/org/apache/maven/scm/maven-scm-providers/1.7/maven-scm-providers-1.7.pom (4 KB at 228.1 KB/sec)
[INFO] Downloading: https://repo.maven.apache.org/maven2/org/apache/maven/scm/maven-scm/1.7/maven-scm-1.7.pom
[INFO] Downloaded: https://repo.maven.apache.org/maven2/org/apache/maven/scm/maven-scm/1.7/maven-scm-1.7.pom (18 KB at 806.5 KB/sec)
[INFO] Downloading: https://repo.maven.apache.org/maven2/org/apache/maven/scm/maven-scm-provider-accurev/1.7/maven-scm-provider-accurev-1.7.pom
[INFO] Downloaded: https://repo.maven.apache.org/maven2/org/apache/maven/scm/maven-scm-provider-accurev/1.7/maven-scm-provider-accurev-1.7.pom (4 KB at 213.3 KB/sec)
[INFO] Downloading: https://repo.maven.apache.org/maven2/org/apache/maven/scm/maven-scm-api/1.7/maven-scm-api-1.7.pom
[INFO] Downloaded: https://repo.maven.apache.org/maven2/org/apache/maven/scm/maven-scm-api/1.7/maven-scm-api-1.7.pom (2 KB at 102.7 KB/sec)
[INFO] Downloading: https://repo.maven.apache.org/maven2/org/apache/maven/scm/maven-scm-provider-bazaar/1.7/maven-scm-provider-bazaar-1.7.pom
[INFO] Downloaded: https://repo.maven.apache.org/maven2/org/apache/maven/scm/maven-scm-provider-bazaar/1.7/maven-scm-provider-bazaar-1.7.pom (3 KB at 125.4 KB/sec)
[INFO] Downloading: https://repo.maven.apache.org/maven2/org/apache/maven/scm/maven-scm-provider-clearcase/1.7/maven-scm-provider-clearcase-1.7.pom
[INFO] Downloaded: https://repo.maven.apache.org/maven2/org/apache/maven/scm/maven-scm-provider-clearcase/1.7/maven-scm-provider-clearcase-1.7.pom (3 KB at 165.9 KB/sec)
[INFO] Downloading: https://repo.maven.apache.org/maven2/org/apache/maven/scm/maven-scm-provider-cvsexe/1.7/maven-scm-provider-cvsexe-1.7.pom
[INFO] Downloaded: https://repo.maven.apache.org/maven2/org/apache/maven/scm/maven-scm-provider-cvsexe/1.7/maven-scm-provider-cvsexe-1.7.pom (3 KB at 174.6 KB/sec)
[INFO] Downloading: https://repo.maven.apache.org/maven2/org/apache/maven/scm/maven-scm-providers-cvs/1.7/maven-scm-providers-cvs-1.7.pom
[INFO] Downloaded: https://repo.maven.apache.org/maven2/org/apache/maven/scm/maven-scm-providers-cvs/1.7/maven-scm-providers-cvs-1.7.pom (2 KB at 104.3 KB/sec)
[INFO] Downloading: https://repo.maven.apache.org/maven2/org/apache/maven/scm/maven-scm-provider-cvs-commons/1.7/maven-scm-provider-cvs-commons-1.7.pom
[INFO] Downloaded: https://repo.maven.apache.org/maven2/org/apache/maven/scm/maven-scm-provider-cvs-commons/1.7/maven-scm-provider-cvs-commons-1.7.pom (3 KB at 148.1 KB/sec)
[INFO] Downloading: https://repo.maven.apache.org/maven2/org/apache/maven/scm/maven-scm-provider-cvsjava/1.7/maven-scm-provider-cvsjava-1.7.pom
[INFO] Downloaded: https://repo.maven.apache.org/maven2/org/apache/maven/scm/maven-scm-provider-cvsjava/1.7/maven-scm-provider-cvsjava-1.7.pom (3 KB at 149.8 KB/sec)
[INFO] Downloading: https://repo.maven.apache.org/maven2/org/apache/maven/scm/maven-scm-provider-gitexe/1.7/maven-scm-provider-gitexe-1.7.pom
[INFO] Downloaded: https://repo.maven.apache.org/maven2/org/apache/maven/scm/maven-scm-provider-gitexe/1.7/maven-scm-provider-gitexe-1.7.pom (3 KB at 145.8 KB/sec)
[INFO] Downloading: https://repo.maven.apache.org/maven2/org/apache/maven/scm/maven-scm-providers-git/1.7/maven-scm-providers-git-1.7.pom
[INFO] Downloaded: https://repo.maven.apache.org/maven2/org/apache/maven/scm/maven-scm-providers-git/1.7/maven-scm-providers-git-1.7.pom (3 KB at 119.9 KB/sec)
[INFO] Downloading: https://repo.maven.apache.org/maven2/org/apache/maven/scm/maven-scm-provider-git-commons/1.7/maven-scm-provider-git-commons-1.7.pom
[INFO] Downloaded: https://repo.maven.apache.org/maven2/org/apache/maven/scm/maven-scm-provider-git-commons/1.7/maven-scm-provider-git-commons-1.7.pom (3 KB at 137.9 KB/sec)
[INFO] Downloading: https://repo.maven.apache.org/maven2/org/apache/maven/scm/maven-scm-provider-hg/1.7/maven-scm-provider-hg-1.7.pom
[INFO] Downloaded: https://repo.maven.apache.org/maven2/org/apache/maven/scm/maven-scm-provider-hg/1.7/maven-scm-provider-hg-1.7.pom (3 KB at 159.2 KB/sec)
[INFO] Downloading: https://repo.maven.apache.org/maven2/org/apache/maven/scm/maven-scm-provider-perforce/1.7/maven-scm-provider-perforce-1.7.pom
[INFO] Downloaded: https://repo.maven.apache.org/maven2/org/apache/maven/scm/maven-scm-provider-perforce/1.7/maven-scm-provider-perforce-1.7.pom (3 KB at 160.5 KB/sec)
[INFO] Downloading: https://repo.maven.apache.org/maven2/org/apache/maven/scm/maven-scm-provider-starteam/1.7/maven-scm-provider-starteam-1.7.pom
[INFO] Downloaded: https://repo.maven.apache.org/maven2/org/apache/maven/scm/maven-scm-provider-starteam/1.7/maven-scm-provider-starteam-1.7.pom (3 KB at 167.7 KB/sec)
[INFO] Downloading: https://repo.maven.apache.org/maven2/org/apache/maven/scm/maven-scm-provider-svnexe/1.7/maven-scm-provider-svnexe-1.7.pom
[INFO] Downloaded: https://repo.maven.apache.org/maven2/org/apache/maven/scm/maven-scm-provider-svnexe/1.7/maven-scm-provider-svnexe-1.7.pom (3 KB at 153.0 KB/sec)
[INFO] Downloading: https://repo.maven.apache.org/maven2/org/apache/maven/scm/maven-scm-providers-svn/1.7/maven-scm-providers-svn-1.7.pom
[INFO] Downloaded: https://repo.maven.apache.org/maven2/org/apache/maven/scm/maven-scm-providers-svn/1.7/maven-scm-providers-svn-1.7.pom (3 KB at 138.3 KB/sec)
[INFO] Downloading: https://repo.maven.apache.org/maven2/org/apache/maven/scm/maven-scm-provider-svn-commons/1.7/maven-scm-provider-svn-commons-1.7.pom
[INFO] Downloaded: https://repo.maven.apache.org/maven2/org/apache/maven/scm/maven-scm-provider-svn-commons/1.7/maven-scm-provider-svn-commons-1.7.pom (3 KB at 175.8 KB/sec)
[INFO] Downloading: https://repo.maven.apache.org/maven2/org/apache/maven/scm/maven-scm-provider-synergy/1.7/maven-scm-provider-synergy-1.7.pom
[INFO] Downloaded: https://repo.maven.apache.org/maven2/org/apache/maven/scm/maven-scm-provider-synergy/1.7/maven-scm-provider-synergy-1.7.pom (2 KB at 127.0 KB/sec)
[INFO] Downloading: https://repo.maven.apache.org/maven2/org/apache/maven/scm/maven-scm-provider-vss/1.7/maven-scm-provider-vss-1.7.pom
[INFO] Downloaded: https://repo.maven.apache.org/maven2/org/apache/maven/scm/maven-scm-provider-vss/1.7/maven-scm-provider-vss-1.7.pom (3 KB at 156.5 KB/sec)
[INFO] Downloading: https://repo.maven.apache.org/maven2/org/apache/maven/scm/maven-scm-provider-tfs/1.7/maven-scm-provider-tfs-1.7.pom
[INFO] Downloaded: https://repo.maven.apache.org/maven2/org/apache/maven/scm/maven-scm-provider-tfs/1.7/maven-scm-provider-tfs-1.7.pom (3 KB at 186.0 KB/sec)
[INFO] Downloading: https://repo.maven.apache.org/maven2/org/apache/maven/scm/maven-scm-provider-integrity/1.7/maven-scm-provider-integrity-1.7.pom
[INFO] Downloaded: https://repo.maven.apache.org/maven2/org/apache/maven/scm/maven-scm-provider-integrity/1.7/maven-scm-provider-integrity-1.7.pom (5 KB at 279.3 KB/sec)
[INFO] Downloading: https://repo.maven.apache.org/maven2/org/apache/maven/scm/maven-scm-provider-jazz/1.7/maven-scm-provider-jazz-1.7.pom
[INFO] Downloaded: https://repo.maven.apache.org/maven2/org/apache/maven/scm/maven-scm-provider-jazz/1.7/maven-scm-provider-jazz-1.7.pom (4 KB at 222.4 KB/sec)
[INFO] Downloading: https://repo.maven.apache.org/maven2/org/apache/maven/scm/maven-scm-manager-plexus/1.7/maven-scm-manager-plexus-1.7.pom
[INFO] Downloaded: https://repo.maven.apache.org/maven2/org/apache/maven/scm/maven-scm-manager-plexus/1.7/maven-scm-manager-plexus-1.7.pom (3 KB at 140.9 KB/sec)
[INFO] Downloading: https://repo.maven.apache.org/maven2/org/apache/maven/scm/maven-scm-managers/1.7/maven-scm-managers-1.7.pom
[INFO] Downloaded: https://repo.maven.apache.org/maven2/org/apache/maven/scm/maven-scm-managers/1.7/maven-scm-managers-1.7.pom (2 KB at 90.9 KB/sec)
[INFO] Downloading: https://repo.maven.apache.org/maven2/org/apache/maven/scm/maven-scm-api/1.8.1/maven-scm-api-1.8.1.pom
[INFO] Downloaded: https://repo.maven.apache.org/maven2/org/apache/maven/scm/maven-scm-api/1.8.1/maven-scm-api-1.8.1.pom (2 KB at 102.8 KB/sec)
[INFO] Downloading: https://repo.maven.apache.org/maven2/org/apache/maven/scm/maven-scm/1.8.1/maven-scm-1.8.1.pom
[INFO] Downloaded: https://repo.maven.apache.org/maven2/org/apache/maven/scm/maven-scm/1.8.1/maven-scm-1.8.1.pom (22 KB at 848.8 KB/sec)
[INFO] Downloading: https://repo.maven.apache.org/maven2/org/apache/maven/scm/maven-scm-provider-gitexe/1.8.1/maven-scm-provider-gitexe-1.8.1.pom
[INFO] Downloaded: https://repo.maven.apache.org/maven2/org/apache/maven/scm/maven-scm-provider-gitexe/1.8.1/maven-scm-provider-gitexe-1.8.1.pom (3 KB at 171.5 KB/sec)
[INFO] Downloading: https://repo.maven.apache.org/maven2/org/apache/maven/scm/maven-scm-providers-git/1.8.1/maven-scm-providers-git-1.8.1.pom
[INFO] Downloaded: https://repo.maven.apache.org/maven2/org/apache/maven/scm/maven-scm-providers-git/1.8.1/maven-scm-providers-git-1.8.1.pom (3 KB at 144.0 KB/sec)
[INFO] Downloading: https://repo.maven.apache.org/maven2/org/apache/maven/scm/maven-scm-providers/1.8.1/maven-scm-providers-1.8.1.pom
[INFO] Downloaded: https://repo.maven.apache.org/maven2/org/apache/maven/scm/maven-scm-providers/1.8.1/maven-scm-providers-1.8.1.pom (4 KB at 243.4 KB/sec)
[INFO] Downloading: https://repo.maven.apache.org/maven2/org/apache/maven/scm/maven-scm-provider-git-commons/1.8.1/maven-scm-provider-git-commons-1.8.1.pom
[INFO] Downloaded: https://repo.maven.apache.org/maven2/org/apache/maven/scm/maven-scm-provider-git-commons/1.8.1/maven-scm-provider-git-commons-1.8.1.pom (3 KB at 138.1 KB/sec)
[INFO] Downloading: https://repo.maven.apache.org/maven2/org/apache/maven/scm/maven-scm-provider-svnexe/1.8.1/maven-scm-provider-svnexe-1.8.1.pom
[INFO] Downloaded: https://repo.maven.apache.org/maven2/org/apache/maven/scm/maven-scm-provider-svnexe/1.8.1/maven-scm-provider-svnexe-1.8.1.pom (3 KB at 164.1 KB/sec)
[INFO] Downloading: https://repo.maven.apache.org/maven2/org/apache/maven/scm/maven-scm-providers-svn/1.8.1/maven-scm-providers-svn-1.8.1.pom
[INFO] Downloaded: https://repo.maven.apache.org/maven2/org/apache/maven/scm/maven-scm-providers-svn/1.8.1/maven-scm-providers-svn-1.8.1.pom (3 KB at 129.8 KB/sec)
[INFO] Downloading: https://repo.maven.apache.org/maven2/org/apache/maven/scm/maven-scm-provider-svn-commons/1.8.1/maven-scm-provider-svn-commons-1.8.1.pom
[INFO] Downloaded: https://repo.maven.apache.org/maven2/org/apache/maven/scm/maven-scm-provider-svn-commons/1.8.1/maven-scm-provider-svn-commons-1.8.1.pom (3 KB at 164.9 KB/sec)
[INFO] Downloading: https://repo.maven.apache.org/maven2/org/apache/maven/plugins/maven-scm-publish-plugin/1.0-beta-2/maven-scm-publish-plugin-1.0-beta-2.jar
[INFO] Downloading: https://repo.maven.apache.org/maven2/org/apache/maven/release/maven-release-manager/2.3.2/maven-release-manager-2.3.2.jar
[INFO] Downloading: https://repo.maven.apache.org/maven2/org/apache/maven/scm/maven-scm-provider-accurev/1.7/maven-scm-provider-accurev-1.7.jar
[INFO] Downloading: https://repo.maven.apache.org/maven2/org/apache/maven/scm/maven-scm-provider-bazaar/1.7/maven-scm-provider-bazaar-1.7.jar
[INFO] Downloading: https://repo.maven.apache.org/maven2/org/apache/maven/scm/maven-scm-provider-clearcase/1.7/maven-scm-provider-clearcase-1.7.jar
[INFO] Downloaded: https://repo.maven.apache.org/maven2/org/apache/maven/plugins/maven-scm-publish-plugin/1.0-beta-2/maven-scm-publish-plugin-1.0-beta-2.jar (35 KB at 922.1 KB/sec)
[INFO] Downloading: https://repo.maven.apache.org/maven2/org/apache/maven/scm/maven-scm-provider-cvsexe/1.7/maven-scm-provider-cvsexe-1.7.jar
[INFO] Downloaded: https://repo.maven.apache.org/maven2/org/apache/maven/scm/maven-scm-provider-cvsexe/1.7/maven-scm-provider-cvsexe-1.7.jar (30 KB at 539.4 KB/sec)
[INFO] Downloading: https://repo.maven.apache.org/maven2/org/apache/maven/scm/maven-scm-provider-cvs-commons/1.7/maven-scm-provider-cvs-commons-1.7.jar
[INFO] Downloaded: https://repo.maven.apache.org/maven2/org/apache/maven/scm/maven-scm-provider-bazaar/1.7/maven-scm-provider-bazaar-1.7.jar (54 KB at 782.1 KB/sec)
[INFO] Downloading: https://repo.maven.apache.org/maven2/org/apache/maven/scm/maven-scm-provider-cvsjava/1.7/maven-scm-provider-cvsjava-1.7.jar
[INFO] Downloaded: https://repo.maven.apache.org/maven2/org/apache/maven/scm/maven-scm-provider-clearcase/1.7/maven-scm-provider-clearcase-1.7.jar (70 KB at 977.6 KB/sec)
[INFO] Downloading: https://repo.maven.apache.org/maven2/org/apache/maven/scm/maven-scm-provider-hg/1.7/maven-scm-provider-hg-1.7.jar
[INFO] Downloaded: https://repo.maven.apache.org/maven2/org/apache/maven/scm/maven-scm-provider-accurev/1.7/maven-scm-provider-accurev-1.7.jar (91 KB at 1202.8 KB/sec)
[INFO] Downloading: https://repo.maven.apache.org/maven2/org/apache/maven/scm/maven-scm-provider-perforce/1.7/maven-scm-provider-perforce-1.7.jar
[INFO] Downloaded: https://repo.maven.apache.org/maven2/org/apache/maven/scm/maven-scm-provider-cvs-commons/1.7/maven-scm-provider-cvs-commons-1.7.jar (78 KB at 951.2 KB/sec)
[INFO] Downloading: https://repo.maven.apache.org/maven2/org/apache/maven/scm/maven-scm-provider-starteam/1.7/maven-scm-provider-starteam-1.7.jar
[INFO] Downloaded: https://repo.maven.apache.org/maven2/org/apache/maven/release/maven-release-manager/2.3.2/maven-release-manager-2.3.2.jar (181 KB at 1984.2 KB/sec)
[INFO] Downloading: https://repo.maven.apache.org/maven2/org/apache/maven/scm/maven-scm-provider-synergy/1.7/maven-scm-provider-synergy-1.7.jar
[INFO] Downloaded: https://repo.maven.apache.org/maven2/org/apache/maven/scm/maven-scm-provider-cvsjava/1.7/maven-scm-provider-cvsjava-1.7.jar (43 KB at 481.9 KB/sec)
[INFO] Downloading: https://repo.maven.apache.org/maven2/org/apache/maven/scm/maven-scm-provider-vss/1.7/maven-scm-provider-vss-1.7.jar
[INFO] Downloaded: https://repo.maven.apache.org/maven2/org/apache/maven/scm/maven-scm-provider-hg/1.7/maven-scm-provider-hg-1.7.jar (64 KB at 697.8 KB/sec)
[INFO] Downloading: https://repo.maven.apache.org/maven2/org/apache/maven/scm/maven-scm-provider-tfs/1.7/maven-scm-provider-tfs-1.7.jar
[INFO] Downloaded: https://repo.maven.apache.org/maven2/org/apache/maven/scm/maven-scm-provider-perforce/1.7/maven-scm-provider-perforce-1.7.jar (80 KB at 848.6 KB/sec)
[INFO] Downloading: https://repo.maven.apache.org/maven2/org/apache/maven/scm/maven-scm-provider-integrity/1.7/maven-scm-provider-integrity-1.7.jar
[INFO] Downloaded: https://repo.maven.apache.org/maven2/org/apache/maven/scm/maven-scm-provider-starteam/1.7/maven-scm-provider-starteam-1.7.jar (73 KB at 704.8 KB/sec)
[INFO] Downloading: https://repo.maven.apache.org/maven2/org/apache/maven/scm/maven-scm-provider-jazz/1.7/maven-scm-provider-jazz-1.7.jar
[INFO] Downloaded: https://repo.maven.apache.org/maven2/org/apache/maven/scm/maven-scm-provider-synergy/1.7/maven-scm-provider-synergy-1.7.jar (57 KB at 524.1 KB/sec)
[INFO] Downloading: https://repo.maven.apache.org/maven2/org/apache/maven/scm/maven-scm-manager-plexus/1.7/maven-scm-manager-plexus-1.7.jar
[INFO] Downloaded: https://repo.maven.apache.org/maven2/org/apache/maven/scm/maven-scm-provider-tfs/1.7/maven-scm-provider-tfs-1.7.jar (41 KB at 378.8 KB/sec)
[INFO] Downloading: https://repo.maven.apache.org/maven2/org/apache/maven/scm/maven-scm-api/1.8.1/maven-scm-api-1.8.1.jar
[INFO] Downloaded: https://repo.maven.apache.org/maven2/org/apache/maven/scm/maven-scm-provider-vss/1.7/maven-scm-provider-vss-1.7.jar (67 KB at 572.0 KB/sec)
[INFO] Downloading: https://repo.maven.apache.org/maven2/org/apache/maven/scm/maven-scm-provider-gitexe/1.8.1/maven-scm-provider-gitexe-1.8.1.jar
[INFO] Downloaded: https://repo.maven.apache.org/maven2/org/apache/maven/scm/maven-scm-provider-integrity/1.7/maven-scm-provider-integrity-1.7.jar (76 KB at 643.3 KB/sec)
[INFO] Downloading: https://repo.maven.apache.org/maven2/org/apache/maven/scm/maven-scm-provider-git-commons/1.8.1/maven-scm-provider-git-commons-1.8.1.jar
[INFO] Downloaded: https://repo.maven.apache.org/maven2/org/apache/maven/scm/maven-scm-provider-jazz/1.7/maven-scm-provider-jazz-1.7.jar (64 KB at 517.8 KB/sec)
[INFO] Downloading: https://repo.maven.apache.org/maven2/org/apache/maven/scm/maven-scm-provider-svnexe/1.8.1/maven-scm-provider-svnexe-1.8.1.jar
[INFO] Downloaded: https://repo.maven.apache.org/maven2/org/apache/maven/scm/maven-scm-manager-plexus/1.7/maven-scm-manager-plexus-1.7.jar (11 KB at 83.9 KB/sec)
[INFO] Downloading: https://repo.maven.apache.org/maven2/org/apache/maven/scm/maven-scm-provider-svn-commons/1.8.1/maven-scm-provider-svn-commons-1.8.1.jar
[INFO] Downloaded: https://repo.maven.apache.org/maven2/org/apache/maven/scm/maven-scm-provider-git-commons/1.8.1/maven-scm-provider-git-commons-1.8.1.jar (37 KB at 273.6 KB/sec)
[INFO] Downloaded: https://repo.maven.apache.org/maven2/org/apache/maven/scm/maven-scm-provider-gitexe/1.8.1/maven-scm-provider-gitexe-1.8.1.jar (63 KB at 451.6 KB/sec)
[INFO] Downloaded: https://repo.maven.apache.org/maven2/org/apache/maven/scm/maven-scm-api/1.8.1/maven-scm-api-1.8.1.jar (103 KB at 746.3 KB/sec)
[INFO] Downloaded: https://repo.maven.apache.org/maven2/org/apache/maven/scm/maven-scm-provider-svn-commons/1.8.1/maven-scm-provider-svn-commons-1.8.1.jar (40 KB at 274.3 KB/sec)
[INFO] Downloaded: https://repo.maven.apache.org/maven2/org/apache/maven/scm/maven-scm-provider-svnexe/1.8.1/maven-scm-provider-svnexe-1.8.1.jar (76 KB at 496.7 KB/sec)
[INFO] Downloading: https://repo.maven.apache.org/maven2/org/apache/maven/wagon/wagon-ssh/2.5/wagon-ssh-2.5.pom
[INFO] Downloaded: https://repo.maven.apache.org/maven2/org/apache/maven/wagon/wagon-ssh/2.5/wagon-ssh-2.5.pom (6 KB at 310.4 KB/sec)
[INFO] Downloading: https://repo.maven.apache.org/maven2/org/apache/maven/wagon/wagon-ssh-common/2.5/wagon-ssh-common-2.5.pom
[INFO] Downloaded: https://repo.maven.apache.org/maven2/org/apache/maven/wagon/wagon-ssh-common/2.5/wagon-ssh-common-2.5.pom (2 KB at 112.1 KB/sec)
[INFO] Downloading: https://repo.maven.apache.org/maven2/org/apache/maven/wagon/wagon-ssh/2.5/wagon-ssh-2.5.jar
[INFO] Downloading: https://repo.maven.apache.org/maven2/org/apache/maven/wagon/wagon-ssh-common/2.5/wagon-ssh-common-2.5.jar
[INFO] Downloaded: https://repo.maven.apache.org/maven2/org/apache/maven/wagon/wagon-ssh/2.5/wagon-ssh-2.5.jar (29 KB at 1179.3 KB/sec)
[INFO] Downloaded: https://repo.maven.apache.org/maven2/org/apache/maven/wagon/wagon-ssh-common/2.5/wagon-ssh-common-2.5.jar (25 KB at 918.8 KB/sec)
[INFO] ------------------------------------------------------------------------
[INFO] Reactor Build Order:
[INFO]
[INFO] Tiles Request Framework
[INFO] Tiles request - API
[INFO] Tiles request - Servlet support
[INFO] Tiles Request - Wildcard file loading in Servlets
[INFO] Tiles - Portlet support
[INFO] Tiles - Wildcard file loading in Portlets
[INFO] Tiles Request - JSP support
[INFO] Tiles Request - Freemarker support
[INFO] Tiles Request - Velocity support
[INFO] Tiles request - Mustache support
[INFO] Tiles Request Assembly
[INFO]                                                                        
[INFO] ------------------------------------------------------------------------
[INFO] Building Tiles Request Framework 1.0.8-SNAPSHOT
[INFO] ------------------------------------------------------------------------
[INFO] Downloading: https://repo.maven.apache.org/maven2/org/apache/maven/plugins/maven-enforcer-plugin/1.2/maven-enforcer-plugin-1.2.pom
[INFO] Downloaded: https://repo.maven.apache.org/maven2/org/apache/maven/plugins/maven-enforcer-plugin/1.2/maven-enforcer-plugin-1.2.pom (6 KB at 356.1 KB/sec)
[INFO] Downloading: https://repo.maven.apache.org/maven2/org/apache/maven/enforcer/enforcer/1.2/enforcer-1.2.pom
[INFO] Downloaded: https://repo.maven.apache.org/maven2/org/apache/maven/enforcer/enforcer/1.2/enforcer-1.2.pom (11 KB at 670.5 KB/sec)
[INFO] Downloading: https://repo.maven.apache.org/maven2/org/apache/maven/plugins/maven-enforcer-plugin/1.2/maven-enforcer-plugin-1.2.jar
[INFO] Downloaded: https://repo.maven.apache.org/maven2/org/apache/maven/plugins/maven-enforcer-plugin/1.2/maven-enforcer-plugin-1.2.jar (25 KB at 1461.2 KB/sec)
[INFO] Downloading: https://repo.maven.apache.org/maven2/org/slf4j/slf4j-api/1.5.8/slf4j-api-1.5.8.jar
[INFO] Downloaded: https://repo.maven.apache.org/maven2/org/slf4j/slf4j-api/1.5.8/slf4j-api-1.5.8.jar (23 KB at 1272.0 KB/sec)
[INFO]
[INFO] --- maven-clean-plugin:2.5:clean (default-clean) @ tiles-request ---
[INFO]
[INFO] --- maven-enforcer-plugin:1.2:enforce (enforce-java) @ tiles-request ---
[INFO] Downloading: https://repo.maven.apache.org/maven2/org/apache/maven/enforcer/enforcer-api/1.2/enforcer-api-1.2.pom
[INFO] Downloaded: https://repo.maven.apache.org/maven2/org/apache/maven/enforcer/enforcer-api/1.2/enforcer-api-1.2.pom (3 KB at 146.9 KB/sec)
[INFO] Downloading: https://repo.maven.apache.org/maven2/org/apache/maven/enforcer/enforcer-rules/1.2/enforcer-rules-1.2.pom
[INFO] Downloaded: https://repo.maven.apache.org/maven2/org/apache/maven/enforcer/enforcer-rules/1.2/enforcer-rules-1.2.pom (4 KB at 225.3 KB/sec)
[INFO] Downloading: https://repo.maven.apache.org/maven2/org/apache/maven/enforcer/enforcer-api/1.2/enforcer-api-1.2.jar
[INFO] Downloading: https://repo.maven.apache.org/maven2/org/apache/maven/enforcer/enforcer-rules/1.2/enforcer-rules-1.2.jar
[INFO] Downloaded: https://repo.maven.apache.org/maven2/org/apache/maven/enforcer/enforcer-api/1.2/enforcer-api-1.2.jar (10 KB at 529.5 KB/sec)
[INFO] Downloaded: https://repo.maven.apache.org/maven2/org/apache/maven/enforcer/enforcer-rules/1.2/enforcer-rules-1.2.jar (75 KB at 2257.0 KB/sec)
[WARNING] Rule 0: org.apache.maven.plugins.enforcer.RequireJavaVersion failed with message:
Detected JDK Version: 1.8.0-131 is not in the allowed range [1.7.0-45,1.8).
[INFO] ------------------------------------------------------------------------
[INFO] Reactor Summary:
[INFO]
[INFO] Tiles Request Framework ............................ FAILURE [  4.003 s]
[INFO] Tiles request - API ................................ SKIPPED
[INFO] Tiles request - Servlet support .................... SKIPPED
[INFO] Tiles Request - Wildcard file loading in Servlets .. SKIPPED
[INFO] Tiles - Portlet support ............................ SKIPPED
[INFO] Tiles - Wildcard file loading in Portlets .......... SKIPPED
[INFO] Tiles Request - JSP support ........................ SKIPPED
[INFO] Tiles Request - Freemarker support ................. SKIPPED
[INFO] Tiles Request - Velocity support ................... SKIPPED
[INFO] Tiles request - Mustache support ................... SKIPPED
[INFO] Tiles Request Assembly ............................. SKIPPED
[INFO] ------------------------------------------------------------------------
[INFO] BUILD FAILURE
[INFO] ------------------------------------------------------------------------
[INFO] Total time: 18.436 s
[INFO] Finished at: 2017-09-04T09:45:45+00:00
[INFO] Final Memory: 21M/382M
[INFO] ------------------------------------------------------------------------
[ERROR] Failed to execute goal org.apache.maven.plugins:maven-enforcer-plugin:1.2:enforce (enforce-java) on project tiles-request: Some Enforcer rules have failed. Look above for specific messages explaining why the rule failed. -> [Help 1]
[ERROR]
[ERROR] To see the full stack trace of the errors, re-run Maven with the -e switch.
[ERROR] Re-run Maven using the -X switch to enable full debug logging.
[ERROR]
[ERROR] For more information about the errors and possible solutions, please read the following articles:
[ERROR] [Help 1] http://cwiki.apache.org/confluence/display/MAVEN/MojoExecutionException
[JENKINS] Archiving <https://builds.apache.org/job/Tiles-Request-1.0.x/ws/assembly/pom.xml> to org.apache.tiles/tiles-request-assembly/1.0.8-SNAPSHOT/tiles-request-assembly-1.0.8-SNAPSHOT.pom
[JENKINS] Archiving <https://builds.apache.org/job/Tiles-Request-1.0.x/ws/pom.xml> to org.apache.tiles/tiles-request/1.0.8-SNAPSHOT/tiles-request-1.0.8-SNAPSHOT.pom
[JENKINS] Archiving <https://builds.apache.org/job/Tiles-Request-1.0.x/ws/tiles-request-velocity/pom.xml> to org.apache.tiles/tiles-request-velocity/1.0.8-SNAPSHOT/tiles-request-velocity-1.0.8-SNAPSHOT.pom
[JENKINS] Archiving <https://builds.apache.org/job/Tiles-Request-1.0.x/ws/tiles-request-freemarker/pom.xml> to org.apache.tiles/tiles-request-freemarker/1.0.8-SNAPSHOT/tiles-request-freemarker-1.0.8-SNAPSHOT.pom
[JENKINS] Archiving <https://builds.apache.org/job/Tiles-Request-1.0.x/ws/tiles-request-servlet-wildcard/pom.xml> to org.apache.tiles/tiles-request-servlet-wildcard/1.0.8-SNAPSHOT/tiles-request-servlet-wildcard-1.0.8-SNAPSHOT.pom
[JENKINS] Archiving <https://builds.apache.org/job/Tiles-Request-1.0.x/ws/tiles-request-mustache/pom.xml> to org.apache.tiles/tiles-request-mustache/1.0.8-SNAPSHOT/tiles-request-mustache-1.0.8-SNAPSHOT.pom
[JENKINS] Archiving <https://builds.apache.org/job/Tiles-Request-1.0.x/ws/tiles-request-jsp/pom.xml> to org.apache.tiles/tiles-request-jsp/1.0.8-SNAPSHOT/tiles-request-jsp-1.0.8-SNAPSHOT.pom
[JENKINS] Archiving <https://builds.apache.org/job/Tiles-Request-1.0.x/ws/tiles-request-servlet/pom.xml> to org.apache.tiles/tiles-request-servlet/1.0.8-SNAPSHOT/tiles-request-servlet-1.0.8-SNAPSHOT.pom
[JENKINS] Archiving <https://builds.apache.org/job/Tiles-Request-1.0.x/ws/tiles-request-portlet-wildcard/pom.xml> to org.apache.tiles/tiles-request-portlet-wildcard/1.0.8-SNAPSHOT/tiles-request-portlet-wildcard-1.0.8-SNAPSHOT.pom
[JENKINS] Archiving <https://builds.apache.org/job/Tiles-Request-1.0.x/ws/tiles-request-api/pom.xml> to org.apache.tiles/tiles-request-api/1.0.8-SNAPSHOT/tiles-request-api-1.0.8-SNAPSHOT.pom
[JENKINS] Archiving <https://builds.apache.org/job/Tiles-Request-1.0.x/ws/tiles-request-portlet/pom.xml> to org.apache.tiles/tiles-request-portlet/1.0.8-SNAPSHOT/tiles-request-portlet-1.0.8-SNAPSHOT.pom
channel stopped
Reply | Threaded
Open this post in threaded view
|

Build failed in Jenkins: Tiles-Request-1.0.x #22

Apache Jenkins Server-2
See <https://builds.apache.org/job/Tiles-Request-1.0.x/22/display/redirect>

------------------------------------------
[...truncated 24.30 KB...]
AU        tiles-request-velocity/src/test/java/org/apache/tiles/request/velocity/render/VelocityRendererTest.java
A         tiles-request-velocity/src/test/java/org/apache/tiles/request/velocity/autotag
AU        tiles-request-velocity/src/test/java/org/apache/tiles/request/velocity/autotag/VelocityAutotagRuntimeTest.java
AU        tiles-request-velocity/src/test/java/org/apache/tiles/request/velocity/autotag/VelocityUtilTest.java
AU        tiles-request-velocity/src/test/java/org/apache/tiles/request/velocity/autotag/VelocityModelBodyTest.java
AU        tiles-request-velocity/src/test/java/org/apache/tiles/request/velocity/VelocityScopeMapTest.java
AU        tiles-request-velocity/src/test/java/org/apache/tiles/request/velocity/VelocityRequestTest.java
A         tiles-request-velocity/src/test/java/org/apache/tiles/request/velocity/extractor
AU        tiles-request-velocity/src/test/java/org/apache/tiles/request/velocity/extractor/VelocityScopeExtractorTest.java
A         tiles-request-velocity/src/test/resources
A         tiles-request-velocity/src/main
A         tiles-request-velocity/src/main/java
A         tiles-request-velocity/src/main/java/org
A         tiles-request-velocity/src/main/java/org/apache
A         tiles-request-velocity/src/main/java/org/apache/tiles
A         tiles-request-velocity/src/main/java/org/apache/tiles/request
A         tiles-request-velocity/src/main/java/org/apache/tiles/request/velocity
AU        tiles-request-velocity/src/main/java/org/apache/tiles/request/velocity/VelocityRequest.java
A         tiles-request-velocity/src/main/java/org/apache/tiles/request/velocity/extractor
AU        tiles-request-velocity/src/main/java/org/apache/tiles/request/velocity/extractor/VelocityScopeExtractor.java
A         tiles-request-velocity/src/main/java/org/apache/tiles/request/velocity/extractor/package-info.java
A         tiles-request-velocity/src/main/java/org/apache/tiles/request/velocity/render
AU        tiles-request-velocity/src/main/java/org/apache/tiles/request/velocity/render/VelocityRendererBuilder.java
AU        tiles-request-velocity/src/main/java/org/apache/tiles/request/velocity/render/ApplicationContextJeeConfig.java
A         tiles-request-velocity/src/main/java/org/apache/tiles/request/velocity/render/package-info.java
AU        tiles-request-velocity/src/main/java/org/apache/tiles/request/velocity/render/VelocityRenderer.java
A         tiles-request-velocity/src/main/java/org/apache/tiles/request/velocity/autotag
AU        tiles-request-velocity/src/main/java/org/apache/tiles/request/velocity/autotag/package-info.java
AU        tiles-request-velocity/src/main/java/org/apache/tiles/request/velocity/autotag/VelocityAutotagRuntime.java
AU        tiles-request-velocity/src/main/java/org/apache/tiles/request/velocity/autotag/VelocityUtil.java
AU        tiles-request-velocity/src/main/java/org/apache/tiles/request/velocity/autotag/VelocityModelBody.java
A         tiles-request-velocity/src/main/java/org/apache/tiles/request/velocity/package-info.java
AU        tiles-request-velocity/src/main/java/org/apache/tiles/request/velocity/VelocityScopeMap.java
A         tiles-request-velocity/src/main/resources
A         tiles-request-velocity/src/site
A         tiles-request-velocity/src/site/site.xml
AU        tiles-request-velocity/pom.xml
A         tiles-request-api
A         tiles-request-api/src
A         tiles-request-api/src/main
A         tiles-request-api/src/main/java
A         tiles-request-api/src/main/java/org
A         tiles-request-api/src/main/java/org/apache
A         tiles-request-api/src/main/java/org/apache/tiles
A         tiles-request-api/src/main/java/org/apache/tiles/request
AU        tiles-request-api/src/main/java/org/apache/tiles/request/AbstractRequest.java
A         tiles-request-api/src/main/java/org/apache/tiles/request/locale
A         tiles-request-api/src/main/java/org/apache/tiles/request/locale/LocaleUtil.java
A         tiles-request-api/src/main/java/org/apache/tiles/request/locale/URLApplicationResource.java
A         tiles-request-api/src/main/java/org/apache/tiles/request/locale/PostfixedApplicationResource.java
A         tiles-request-api/src/main/java/org/apache/tiles/request/attribute
AU        tiles-request-api/src/main/java/org/apache/tiles/request/attribute/AttributeExtractor.java
AU        tiles-request-api/src/main/java/org/apache/tiles/request/attribute/HasAddableKeys.java
AU        tiles-request-api/src/main/java/org/apache/tiles/request/attribute/HasRemovableKeys.java
AU        tiles-request-api/src/main/java/org/apache/tiles/request/attribute/package-info.java
AU        tiles-request-api/src/main/java/org/apache/tiles/request/attribute/EnumeratedValuesExtractor.java
AU        tiles-request-api/src/main/java/org/apache/tiles/request/attribute/HasKeys.java
AU        tiles-request-api/src/main/java/org/apache/tiles/request/attribute/Addable.java
AU        tiles-request-api/src/main/java/org/apache/tiles/request/package-info.java
AU        tiles-request-api/src/main/java/org/apache/tiles/request/ApplicationAccess.java
AU        tiles-request-api/src/main/java/org/apache/tiles/request/ApplicationContextAware.java
AU        tiles-request-api/src/main/java/org/apache/tiles/request/Request.java
AU        tiles-request-api/src/main/java/org/apache/tiles/request/RequestWrapper.java
AU        tiles-request-api/src/main/java/org/apache/tiles/request/NotAvailableFeatureException.java
AU        tiles-request-api/src/main/java/org/apache/tiles/request/DefaultRequestWrapper.java
A         tiles-request-api/src/main/java/org/apache/tiles/request/render
AU        tiles-request-api/src/main/java/org/apache/tiles/request/render/NoSuchRendererException.java
AU        tiles-request-api/src/main/java/org/apache/tiles/request/render/DispatchRenderer.java
AU        tiles-request-api/src/main/java/org/apache/tiles/request/render/Renderer.java
AU        tiles-request-api/src/main/java/org/apache/tiles/request/render/ChainedDelegateRenderer.java
AU        tiles-request-api/src/main/java/org/apache/tiles/request/render/StringRenderer.java
AU        tiles-request-api/src/main/java/org/apache/tiles/request/render/RenderException.java
AU        tiles-request-api/src/main/java/org/apache/tiles/request/render/RendererFactory.java
AU        tiles-request-api/src/main/java/org/apache/tiles/request/render/BasicRendererFactory.java
AU        tiles-request-api/src/main/java/org/apache/tiles/request/render/CannotRenderException.java
AU        tiles-request-api/src/main/java/org/apache/tiles/request/render/PublisherRenderer.java
AU        tiles-request-api/src/main/java/org/apache/tiles/request/render/package-info.java
A         tiles-request-api/src/main/java/org/apache/tiles/request/reflect
AU        tiles-request-api/src/main/java/org/apache/tiles/request/reflect/CannotInstantiateObjectException.java
AU        tiles-request-api/src/main/java/org/apache/tiles/request/reflect/ClassUtil.java
AU        tiles-request-api/src/main/java/org/apache/tiles/request/reflect/CannotAccessMethodException.java
AU        tiles-request-api/src/main/java/org/apache/tiles/request/reflect/package-info.java
AU        tiles-request-api/src/main/java/org/apache/tiles/request/AbstractViewRequest.java
AU        tiles-request-api/src/main/java/org/apache/tiles/request/RequestException.java
AU        tiles-request-api/src/main/java/org/apache/tiles/request/ApplicationContext.java
A         tiles-request-api/src/main/java/org/apache/tiles/request/DispatchRequest.java
AU        tiles-request-api/src/main/java/org/apache/tiles/request/ApplicationContextWrapper.java
AU        tiles-request-api/src/main/java/org/apache/tiles/request/DispatchRequestWrapper.java
A         tiles-request-api/src/main/java/org/apache/tiles/request/collection
AU        tiles-request-api/src/main/java/org/apache/tiles/request/collection/AddableParameterMap.java
AU        tiles-request-api/src/main/java/org/apache/tiles/request/collection/MapEntryArrayValues.java
AU        tiles-request-api/src/main/java/org/apache/tiles/request/collection/MapEntry.java
AU        tiles-request-api/src/main/java/org/apache/tiles/request/collection/RemovableKeySet.java
AU        tiles-request-api/src/main/java/org/apache/tiles/request/collection/ReadOnlyEnumerationMap.java
AU        tiles-request-api/src/main/java/org/apache/tiles/request/collection/KeySet.java
AU        tiles-request-api/src/main/java/org/apache/tiles/request/collection/package-info.java
AU        tiles-request-api/src/main/java/org/apache/tiles/request/collection/HeaderValuesMap.java
AU        tiles-request-api/src/main/java/org/apache/tiles/request/collection/ScopeMap.java
AU        tiles-request-api/src/main/java/org/apache/tiles/request/collection/CollectionUtil.java
AU        tiles-request-api/src/main/java/org/apache/tiles/request/AbstractClientRequest.java
A         tiles-request-api/src/main/java/org/apache/tiles/request/ApplicationResource.java
A         tiles-request-api/src/main/resources
A         tiles-request-api/src/site
A         tiles-request-api/src/site/site.xml
A         tiles-request-api/src/test
A         tiles-request-api/src/test/java
A         tiles-request-api/src/test/java/org
A         tiles-request-api/src/test/java/org/apache
A         tiles-request-api/src/test/java/org/apache/tiles
A         tiles-request-api/src/test/java/org/apache/tiles/request
AU        tiles-request-api/src/test/java/org/apache/tiles/request/AbstractViewRequestTest.java
AU        tiles-request-api/src/test/java/org/apache/tiles/request/RequestExceptionTest.java
AU        tiles-request-api/src/test/java/org/apache/tiles/request/ApplicationContextWrapperTest.java
AU        tiles-request-api/src/test/java/org/apache/tiles/request/DispatchRequestWrapperTest.java
A         tiles-request-api/src/test/java/org/apache/tiles/request/scope
AU        tiles-request-api/src/test/java/org/apache/tiles/request/AbstractClientRequestTest.java
A         tiles-request-api/src/test/java/org/apache/tiles/request/collection
AU        tiles-request-api/src/test/java/org/apache/tiles/request/collection/HeaderValuesCollectionTest.java
AU        tiles-request-api/src/test/java/org/apache/tiles/request/collection/HeaderValuesMapEntrySetTest.java
AU        tiles-request-api/src/test/java/org/apache/tiles/request/collection/KeySetTest.java
AU        tiles-request-api/src/test/java/org/apache/tiles/request/collection/ScopeMapEntrySetTest.java
AU        tiles-request-api/src/test/java/org/apache/tiles/request/collection/HeaderValuesMapTest.java
AU        tiles-request-api/src/test/java/org/apache/tiles/request/collection/ScopeMapTest.java
AU        tiles-request-api/src/test/java/org/apache/tiles/request/collection/CollectionUtilTest.java
AU        tiles-request-api/src/test/java/org/apache/tiles/request/collection/AddableParameterMapTest.java
AU        tiles-request-api/src/test/java/org/apache/tiles/request/collection/MapEntryArrayValuesTest.java
AU        tiles-request-api/src/test/java/org/apache/tiles/request/collection/ReadOnlyEnumerationMapValuesCollectionTest.java
AU        tiles-request-api/src/test/java/org/apache/tiles/request/collection/MapEntryTest.java
AU        tiles-request-api/src/test/java/org/apache/tiles/request/collection/ReadOnlyEnumerationMapEntrySetTest.java
AU        tiles-request-api/src/test/java/org/apache/tiles/request/collection/RemovableKeySetTest.java
AU        tiles-request-api/src/test/java/org/apache/tiles/request/collection/ReadOnlyEnumerationMapTest.java
AU        tiles-request-api/src/test/java/org/apache/tiles/request/AbstractRequestTest.java
AU        tiles-request-api/src/test/java/org/apache/tiles/request/NotAvailableFeatureExceptionTest.java
AU        tiles-request-api/src/test/java/org/apache/tiles/request/DefaultRequestWrapperTest.java
A         tiles-request-api/src/test/java/org/apache/tiles/request/locale
A         tiles-request-api/src/test/java/org/apache/tiles/request/locale/LocaleUtilTest.java
A         tiles-request-api/src/test/java/org/apache/tiles/request/locale/URLApplicationResourceTest.java
A         tiles-request-api/src/test/java/org/apache/tiles/request/locale/PostfixedApplicationResourceTest.java
A         tiles-request-api/src/test/java/org/apache/tiles/request/render
AU        tiles-request-api/src/test/java/org/apache/tiles/request/render/BasicRendererFactoryTest.java
AU        tiles-request-api/src/test/java/org/apache/tiles/request/render/PublisherRendererTest.java
AU        tiles-request-api/src/test/java/org/apache/tiles/request/render/NoSuchRendererExceptionTest.java
AU        tiles-request-api/src/test/java/org/apache/tiles/request/render/DispatchRendererTest.java
AU        tiles-request-api/src/test/java/org/apache/tiles/request/render/ChainedDelegateRendererTest.java
AU        tiles-request-api/src/test/java/org/apache/tiles/request/render/StringRendererTest.java
A         tiles-request-api/src/test/java/org/apache/tiles/request/osgi
A         tiles-request-api/src/test/java/org/apache/tiles/request/osgi/URLBundleApplicationResourceTest.java
A         tiles-request-api/src/test/java/org/apache/tiles/request/reflect
AU        tiles-request-api/src/test/java/org/apache/tiles/request/reflect/CannotInstantiateObjectExceptionTest.java
AU        tiles-request-api/src/test/java/org/apache/tiles/request/reflect/ClassUtilTest.java
AU        tiles-request-api/src/test/java/org/apache/tiles/request/reflect/CannotAccessMethodExceptionTest.java
AU        tiles-request-api/src/test/java/org/apache/tiles/request/ApplicationAccessTest.java
A         tiles-request-api/src/test/resources
A         tiles-request-api/src/test/resources/org
A         tiles-request-api/src/test/resources/org/apache
A         tiles-request-api/src/test/resources/org/apache/tiles
A         tiles-request-api/src/test/resources/org/apache/tiles/request
A         tiles-request-api/src/test/resources/org/apache/tiles/request/test
A         tiles-request-api/src/test/resources/org/apache/tiles/request/test/locale
A         tiles-request-api/src/test/resources/org/apache/tiles/request/test/locale/resource.txt
A         tiles-request-api/src/test/resources/org/apache/tiles/request/test/locale/resource with space.txt
AU        tiles-request-api/pom.xml
A         tiles-request-mustache
A         tiles-request-mustache/src
A         tiles-request-mustache/src/test
A         tiles-request-mustache/src/test/resources
A         tiles-request-mustache/src/test/resources/test.html
A         tiles-request-mustache/src/test/java
A         tiles-request-mustache/src/test/java/org
A         tiles-request-mustache/src/test/java/org/apache
A         tiles-request-mustache/src/test/java/org/apache/tiles
A         tiles-request-mustache/src/test/java/org/apache/tiles/request
A         tiles-request-mustache/src/test/java/org/apache/tiles/request/render
A         tiles-request-mustache/src/test/java/org/apache/tiles/request/mustache
A         tiles-request-mustache/src/test/java/org/apache/tiles/request/mustache/MustacheRendererTest.java
A         tiles-request-mustache/src/main
A         tiles-request-mustache/src/main/java
A         tiles-request-mustache/src/main/java/org
A         tiles-request-mustache/src/main/java/org/apache
A         tiles-request-mustache/src/main/java/org/apache/tiles
A         tiles-request-mustache/src/main/java/org/apache/tiles/request
A         tiles-request-mustache/src/main/java/org/apache/tiles/request/mustache
A         tiles-request-mustache/src/main/java/org/apache/tiles/request/mustache/MustacheScopeExtractor.java
A         tiles-request-mustache/src/main/java/org/apache/tiles/request/mustache/MustacheRenderer.java
A         tiles-request-mustache/src/main/java/org/apache/tiles/request/mustache/package-info.java
A         tiles-request-mustache/src/site
A         tiles-request-mustache/src/site/site.xml
A         tiles-request-mustache/pom.xml
 U        .
At revision 1807211

No changes for https://svn.apache.org/repos/asf/tiles/request/branches/TREQ_1_0_X since the previous build
Parsing POMs
Downloaded artifact http://repo.maven.apache.org/maven2/org/apache/tiles/tiles-master/6/tiles-master-6.pom
Established TCP socket on 39305
maven33-agent.jar already up to date
maven33-interceptor.jar already up to date
maven3-interceptor-commons.jar already up to date
[Tiles-Request-1.0.x] $ /usr/lib/jvm/java-7-openjdk-amd64//bin/java -Xmx2g -Xms256m -cp /home/jenkins/jenkins-slave/maven33-agent.jar:/home/jenkins/tools/maven/apache-maven-3.3.9/boot/plexus-classworlds-2.5.2.jar:/home/jenkins/tools/maven/apache-maven-3.3.9/conf/logging jenkins.maven3.agent.Maven33Main /home/jenkins/tools/maven/apache-maven-3.3.9 /home/jenkins/jenkins-slave/slave.jar /home/jenkins/jenkins-slave/maven33-interceptor.jar /home/jenkins/jenkins-slave/maven3-interceptor-commons.jar 39305
ERROR: Failed to parse POMs
java.io.IOException: Cannot run program "/usr/lib/jvm/java-7-openjdk-amd64//bin/java" (in directory "<https://builds.apache.org/job/Tiles-Request-1.0.x/ws/")>: error=2, No such file or directory
        at java.lang.ProcessBuilder.start(ProcessBuilder.java:1048)
        at hudson.Proc$LocalProc.<init>(Proc.java:245)
        at hudson.Proc$LocalProc.<init>(Proc.java:214)
        at hudson.Launcher$LocalLauncher.launch(Launcher.java:850)
        at hudson.Launcher$ProcStarter.start(Launcher.java:384)
        at hudson.Launcher$RemoteLaunchCallable.call(Launcher.java:1195)
        at hudson.Launcher$RemoteLaunchCallable.call(Launcher.java:1160)
        at hudson.remoting.UserRequest.perform(UserRequest.java:153)
        at hudson.remoting.UserRequest.perform(UserRequest.java:50)
        at hudson.remoting.Request$2.run(Request.java:336)
        at hudson.remoting.InterceptingExecutorService$1.call(InterceptingExecutorService.java:68)
        at java.util.concurrent.FutureTask.run(FutureTask.java:266)
        at java.util.concurrent.ThreadPoolExecutor.runWorker(ThreadPoolExecutor.java:1142)
        at java.util.concurrent.ThreadPoolExecutor$Worker.run(ThreadPoolExecutor.java:617)
        at java.lang.Thread.run(Thread.java:748)
        at ......remote call to H25(Native Method)
        at hudson.remoting.Channel.attachCallSiteStackTrace(Channel.java:1545)
        at hudson.remoting.UserResponse.retrieve(UserRequest.java:253)
        at hudson.remoting.Channel.call(Channel.java:830)
        at hudson.Launcher$RemoteLauncher.launch(Launcher.java:959)
        at hudson.Launcher$ProcStarter.start(Launcher.java:384)
        at hudson.maven.AbstractMavenProcessFactory.newProcess(AbstractMavenProcessFactory.java:278)
        at hudson.maven.ProcessCache.get(ProcessCache.java:236)
        at hudson.maven.MavenModuleSetBuild$MavenModuleSetBuildExecution.doRun(MavenModuleSetBuild.java:803)
        at hudson.model.AbstractBuild$AbstractBuildExecution.run(AbstractBuild.java:490)
        at hudson.model.Run.execute(Run.java:1735)
        at hudson.maven.MavenModuleSetBuild.run(MavenModuleSetBuild.java:542)
        at hudson.model.ResourceController.execute(ResourceController.java:97)
        at hudson.model.Executor.run(Executor.java:405)
Caused by: java.io.IOException: error=2, No such file or directory
        at java.lang.UNIXProcess.forkAndExec(Native Method)
        at java.lang.UNIXProcess.<init>(UNIXProcess.java:247)
        at java.lang.ProcessImpl.start(ProcessImpl.java:134)
        at java.lang.ProcessBuilder.start(ProcessBuilder.java:1029)
        at hudson.Proc$LocalProc.<init>(Proc.java:245)
        at hudson.Proc$LocalProc.<init>(Proc.java:214)
        at hudson.Launcher$LocalLauncher.launch(Launcher.java:850)
        at hudson.Launcher$ProcStarter.start(Launcher.java:384)
        at hudson.Launcher$RemoteLaunchCallable.call(Launcher.java:1195)
        at hudson.Launcher$RemoteLaunchCallable.call(Launcher.java:1160)
        at hudson.remoting.UserRequest.perform(UserRequest.java:153)
        at hudson.remoting.UserRequest.perform(UserRequest.java:50)
        at hudson.remoting.Request$2.run(Request.java:336)
        at hudson.remoting.InterceptingExecutorService$1.call(InterceptingExecutorService.java:68)
        at java.util.concurrent.FutureTask.run(FutureTask.java:266)
        at java.util.concurrent.ThreadPoolExecutor.runWorker(ThreadPoolExecutor.java:1142)
        at java.util.concurrent.ThreadPoolExecutor$Worker.run(ThreadPoolExecutor.java:617)
        at java.lang.Thread.run(Thread.java:748)
Reply | Threaded
Open this post in threaded view
|

Build failed in Jenkins: Tiles-Request-1.0.x #23

Apache Jenkins Server-2
See <https://builds.apache.org/job/Tiles-Request-1.0.x/23/display/redirect>

------------------------------------------
[...truncated 891 B...]
<===[JENKINS REMOTING CAPACITY]===>   channel started
ERROR: ================================================================================
ERROR: Invalid project setup: jenkins/security/MasterToSlaveCallable : Unsupported major.minor version 52.0
ERROR: [JENKINS-18403][JENKINS-28294] JDK 'jdk-1.7.0_79 (unlimited security)' not supported to run Maven projects.
ERROR: Maven projects have to be launched with a Java version greater or equal to the minimum version required by the master.
ERROR: Use the Maven JDK Toolchains (plugin) to build your maven project with an older JDK.
ERROR: Retrying with slave Java and setting compile/test properties to point to /home/jenkins/tools/java/jdk1.7.0_79-unlimited-security.
ERROR: ================================================================================
Established TCP socket on 37608
maven33-agent.jar already up to date
maven33-interceptor.jar already up to date
maven3-interceptor-commons.jar already up to date
[Tiles-Request-1.0.x] $ /usr/local/asfpackages/java/jdk1.8.0_131/jre/bin/java -Xmx2g -Xms256m -cp /home/jenkins/jenkins-slave/maven33-agent.jar:/home/jenkins/tools/maven/apache-maven-3.3.9/boot/plexus-classworlds-2.5.2.jar:/home/jenkins/tools/maven/apache-maven-3.3.9/conf/logging jenkins.maven3.agent.Maven33Main /home/jenkins/tools/maven/apache-maven-3.3.9 /home/jenkins/jenkins-slave/slave.jar /home/jenkins/jenkins-slave/maven33-interceptor.jar /home/jenkins/jenkins-slave/maven3-interceptor-commons.jar 37608
<===[JENKINS REMOTING CAPACITY]===>   channel started
Executing Maven:  -B -f <https://builds.apache.org/job/Tiles-Request-1.0.x/ws/pom.xml> -Dmaven.repo.local=/home/jenkins/jenkins-slave/maven-repositories/1 clean install
[INFO] Scanning for projects...
[INFO] Downloading: https://repo.maven.apache.org/maven2/org/apache/maven/release/maven-release-manager/2.3.2/maven-release-manager-2.3.2.pom
[INFO] Downloaded: https://repo.maven.apache.org/maven2/org/apache/maven/release/maven-release-manager/2.3.2/maven-release-manager-2.3.2.pom (10 KB at 38.4 KB/sec)
[INFO] Downloading: https://repo.maven.apache.org/maven2/org/apache/maven/release/maven-release/2.3.2/maven-release-2.3.2.pom
[INFO] Downloaded: https://repo.maven.apache.org/maven2/org/apache/maven/release/maven-release/2.3.2/maven-release-2.3.2.pom (9 KB at 323.8 KB/sec)
[INFO] Downloading: https://repo.maven.apache.org/maven2/org/apache/maven/scm/maven-scm-providers-standard/1.7/maven-scm-providers-standard-1.7.pom
[INFO] Downloaded: https://repo.maven.apache.org/maven2/org/apache/maven/scm/maven-scm-providers-standard/1.7/maven-scm-providers-standard-1.7.pom (4 KB at 213.9 KB/sec)
[INFO] Downloading: https://repo.maven.apache.org/maven2/org/apache/maven/scm/maven-scm-providers/1.7/maven-scm-providers-1.7.pom
[INFO] Downloaded: https://repo.maven.apache.org/maven2/org/apache/maven/scm/maven-scm-providers/1.7/maven-scm-providers-1.7.pom (4 KB at 214.7 KB/sec)
[INFO] Downloading: https://repo.maven.apache.org/maven2/org/apache/maven/scm/maven-scm/1.7/maven-scm-1.7.pom
[INFO] Downloaded: https://repo.maven.apache.org/maven2/org/apache/maven/scm/maven-scm/1.7/maven-scm-1.7.pom (18 KB at 933.9 KB/sec)
[INFO] Downloading: https://repo.maven.apache.org/maven2/org/apache/maven/scm/maven-scm-provider-accurev/1.7/maven-scm-provider-accurev-1.7.pom
[INFO] Downloaded: https://repo.maven.apache.org/maven2/org/apache/maven/scm/maven-scm-provider-accurev/1.7/maven-scm-provider-accurev-1.7.pom (4 KB at 188.2 KB/sec)
[INFO] Downloading: https://repo.maven.apache.org/maven2/org/apache/maven/scm/maven-scm-api/1.7/maven-scm-api-1.7.pom
[INFO] Downloaded: https://repo.maven.apache.org/maven2/org/apache/maven/scm/maven-scm-api/1.7/maven-scm-api-1.7.pom (2 KB at 102.7 KB/sec)
[INFO] Downloading: https://repo.maven.apache.org/maven2/org/apache/maven/scm/maven-scm-provider-bazaar/1.7/maven-scm-provider-bazaar-1.7.pom
[INFO] Downloaded: https://repo.maven.apache.org/maven2/org/apache/maven/scm/maven-scm-provider-bazaar/1.7/maven-scm-provider-bazaar-1.7.pom (3 KB at 111.5 KB/sec)
[INFO] Downloading: https://repo.maven.apache.org/maven2/org/apache/maven/scm/maven-scm-provider-clearcase/1.7/maven-scm-provider-clearcase-1.7.pom
[INFO] Downloaded: https://repo.maven.apache.org/maven2/org/apache/maven/scm/maven-scm-provider-clearcase/1.7/maven-scm-provider-clearcase-1.7.pom (3 KB at 165.9 KB/sec)
[INFO] Downloading: https://repo.maven.apache.org/maven2/org/apache/maven/scm/maven-scm-provider-cvsexe/1.7/maven-scm-provider-cvsexe-1.7.pom
[INFO] Downloaded: https://repo.maven.apache.org/maven2/org/apache/maven/scm/maven-scm-provider-cvsexe/1.7/maven-scm-provider-cvsexe-1.7.pom (3 KB at 174.6 KB/sec)
[INFO] Downloading: https://repo.maven.apache.org/maven2/org/apache/maven/scm/maven-scm-providers-cvs/1.7/maven-scm-providers-cvs-1.7.pom
[INFO] Downloaded: https://repo.maven.apache.org/maven2/org/apache/maven/scm/maven-scm-providers-cvs/1.7/maven-scm-providers-cvs-1.7.pom (2 KB at 98.2 KB/sec)
[INFO] Downloading: https://repo.maven.apache.org/maven2/org/apache/maven/scm/maven-scm-provider-cvs-commons/1.7/maven-scm-provider-cvs-commons-1.7.pom
[INFO] Downloaded: https://repo.maven.apache.org/maven2/org/apache/maven/scm/maven-scm-provider-cvs-commons/1.7/maven-scm-provider-cvs-commons-1.7.pom (3 KB at 148.1 KB/sec)
[INFO] Downloading: https://repo.maven.apache.org/maven2/org/apache/maven/scm/maven-scm-provider-cvsjava/1.7/maven-scm-provider-cvsjava-1.7.pom
[INFO] Downloaded: https://repo.maven.apache.org/maven2/org/apache/maven/scm/maven-scm-provider-cvsjava/1.7/maven-scm-provider-cvsjava-1.7.pom (3 KB at 159.2 KB/sec)
[INFO] Downloading: https://repo.maven.apache.org/maven2/org/netbeans/lib/cvsclient/20060125/cvsclient-20060125.pom
[INFO] Downloaded: https://repo.maven.apache.org/maven2/org/netbeans/lib/cvsclient/20060125/cvsclient-20060125.pom (0 B at 0.0 KB/sec)
[INFO] Downloading: https://repo.maven.apache.org/maven2/ch/ethz/ganymed/ganymed-ssh2/build210/ganymed-ssh2-build210.pom
[INFO] Downloaded: https://repo.maven.apache.org/maven2/ch/ethz/ganymed/ganymed-ssh2/build210/ganymed-ssh2-build210.pom (0 B at 0.0 KB/sec)
[INFO] Downloading: https://repo.maven.apache.org/maven2/org/apache/maven/scm/maven-scm-provider-gitexe/1.7/maven-scm-provider-gitexe-1.7.pom
[INFO] Downloaded: https://repo.maven.apache.org/maven2/org/apache/maven/scm/maven-scm-provider-gitexe/1.7/maven-scm-provider-gitexe-1.7.pom (3 KB at 137.2 KB/sec)
[INFO] Downloading: https://repo.maven.apache.org/maven2/org/apache/maven/scm/maven-scm-providers-git/1.7/maven-scm-providers-git-1.7.pom
[INFO] Downloaded: https://repo.maven.apache.org/maven2/org/apache/maven/scm/maven-scm-providers-git/1.7/maven-scm-providers-git-1.7.pom (3 KB at 134.9 KB/sec)
[INFO] Downloading: https://repo.maven.apache.org/maven2/org/apache/maven/scm/maven-scm-provider-git-commons/1.7/maven-scm-provider-git-commons-1.7.pom
[INFO] Downloaded: https://repo.maven.apache.org/maven2/org/apache/maven/scm/maven-scm-provider-git-commons/1.7/maven-scm-provider-git-commons-1.7.pom (3 KB at 137.9 KB/sec)
[INFO] Downloading: https://repo.maven.apache.org/maven2/org/apache/maven/scm/maven-scm-provider-hg/1.7/maven-scm-provider-hg-1.7.pom
[INFO] Downloaded: https://repo.maven.apache.org/maven2/org/apache/maven/scm/maven-scm-provider-hg/1.7/maven-scm-provider-hg-1.7.pom (3 KB at 159.2 KB/sec)
[INFO] Downloading: https://repo.maven.apache.org/maven2/org/apache/maven/scm/maven-scm-provider-perforce/1.7/maven-scm-provider-perforce-1.7.pom
[INFO] Downloaded: https://repo.maven.apache.org/maven2/org/apache/maven/scm/maven-scm-provider-perforce/1.7/maven-scm-provider-perforce-1.7.pom (3 KB at 171.2 KB/sec)
[INFO] Downloading: https://repo.maven.apache.org/maven2/org/apache/maven/scm/maven-scm-provider-starteam/1.7/maven-scm-provider-starteam-1.7.pom
[INFO] Downloaded: https://repo.maven.apache.org/maven2/org/apache/maven/scm/maven-scm-provider-starteam/1.7/maven-scm-provider-starteam-1.7.pom (3 KB at 157.2 KB/sec)
[INFO] Downloading: https://repo.maven.apache.org/maven2/org/apache/maven/scm/maven-scm-provider-svnexe/1.7/maven-scm-provider-svnexe-1.7.pom
[INFO] Downloaded: https://repo.maven.apache.org/maven2/org/apache/maven/scm/maven-scm-provider-svnexe/1.7/maven-scm-provider-svnexe-1.7.pom (3 KB at 144.0 KB/sec)
[INFO] Downloading: https://repo.maven.apache.org/maven2/org/apache/maven/scm/maven-scm-providers-svn/1.7/maven-scm-providers-svn-1.7.pom
[INFO] Downloaded: https://repo.maven.apache.org/maven2/org/apache/maven/scm/maven-scm-providers-svn/1.7/maven-scm-providers-svn-1.7.pom (3 KB at 138.3 KB/sec)
[INFO] Downloading: https://repo.maven.apache.org/maven2/org/apache/maven/scm/maven-scm-provider-svn-commons/1.7/maven-scm-provider-svn-commons-1.7.pom
[INFO] Downloaded: https://repo.maven.apache.org/maven2/org/apache/maven/scm/maven-scm-provider-svn-commons/1.7/maven-scm-provider-svn-commons-1.7.pom (3 KB at 175.8 KB/sec)
[INFO] Downloading: https://repo.maven.apache.org/maven2/org/apache/maven/scm/maven-scm-provider-synergy/1.7/maven-scm-provider-synergy-1.7.pom
[INFO] Downloaded: https://repo.maven.apache.org/maven2/org/apache/maven/scm/maven-scm-provider-synergy/1.7/maven-scm-provider-synergy-1.7.pom (2 KB at 112.1 KB/sec)
[INFO] Downloading: https://repo.maven.apache.org/maven2/org/apache/maven/scm/maven-scm-provider-vss/1.7/maven-scm-provider-vss-1.7.pom
[INFO] Downloaded: https://repo.maven.apache.org/maven2/org/apache/maven/scm/maven-scm-provider-vss/1.7/maven-scm-provider-vss-1.7.pom (3 KB at 147.3 KB/sec)
[INFO] Downloading: https://repo.maven.apache.org/maven2/org/apache/maven/scm/maven-scm-provider-tfs/1.7/maven-scm-provider-tfs-1.7.pom
[INFO] Downloaded: https://repo.maven.apache.org/maven2/org/apache/maven/scm/maven-scm-provider-tfs/1.7/maven-scm-provider-tfs-1.7.pom (3 KB at 174.4 KB/sec)
[INFO] Downloading: https://repo.maven.apache.org/maven2/org/apache/maven/scm/maven-scm-provider-integrity/1.7/maven-scm-provider-integrity-1.7.pom
[INFO] Downloaded: https://repo.maven.apache.org/maven2/org/apache/maven/scm/maven-scm-provider-integrity/1.7/maven-scm-provider-integrity-1.7.pom (5 KB at 261.8 KB/sec)
[INFO] Downloading: https://repo.maven.apache.org/maven2/com/mks/api/mksapi-jar/4.10.9049/mksapi-jar-4.10.9049.pom
[INFO] Downloaded: https://repo.maven.apache.org/maven2/com/mks/api/mksapi-jar/4.10.9049/mksapi-jar-4.10.9049.pom (2 KB at 54.2 KB/sec)
[INFO] Downloading: https://repo.maven.apache.org/maven2/org/codehaus/groovy/groovy-all/1.7.6/groovy-all-1.7.6.pom
[INFO] Downloaded: https://repo.maven.apache.org/maven2/org/codehaus/groovy/groovy-all/1.7.6/groovy-all-1.7.6.pom (27 KB at 1341.5 KB/sec)
[INFO] Downloading: https://repo.maven.apache.org/maven2/org/apache/maven/scm/maven-scm-provider-jazz/1.7/maven-scm-provider-jazz-1.7.pom
[INFO] Downloaded: https://repo.maven.apache.org/maven2/org/apache/maven/scm/maven-scm-provider-jazz/1.7/maven-scm-provider-jazz-1.7.pom (4 KB at 237.2 KB/sec)
[INFO] Downloading: https://repo.maven.apache.org/maven2/org/apache/maven/scm/maven-scm-manager-plexus/1.7/maven-scm-manager-plexus-1.7.pom
[INFO] Downloaded: https://repo.maven.apache.org/maven2/org/apache/maven/scm/maven-scm-manager-plexus/1.7/maven-scm-manager-plexus-1.7.pom (3 KB at 132.1 KB/sec)
[INFO] Downloading: https://repo.maven.apache.org/maven2/org/apache/maven/scm/maven-scm-managers/1.7/maven-scm-managers-1.7.pom
[INFO] Downloaded: https://repo.maven.apache.org/maven2/org/apache/maven/scm/maven-scm-managers/1.7/maven-scm-managers-1.7.pom (2 KB at 60.6 KB/sec)
[INFO] Downloading: https://repo.maven.apache.org/maven2/jaxen/jaxen/1.1-beta-8/jaxen-1.1-beta-8.pom
[INFO] Downloaded: https://repo.maven.apache.org/maven2/jaxen/jaxen/1.1-beta-8/jaxen-1.1-beta-8.pom (7 KB at 408.8 KB/sec)
[INFO] Downloading: https://repo.maven.apache.org/maven2/org/apache/maven/scm/maven-scm-api/1.8.1/maven-scm-api-1.8.1.pom
[INFO] Downloaded: https://repo.maven.apache.org/maven2/org/apache/maven/scm/maven-scm-api/1.8.1/maven-scm-api-1.8.1.pom (2 KB at 96.4 KB/sec)
[INFO] Downloading: https://repo.maven.apache.org/maven2/org/apache/maven/scm/maven-scm/1.8.1/maven-scm-1.8.1.pom
[INFO] Downloaded: https://repo.maven.apache.org/maven2/org/apache/maven/scm/maven-scm/1.8.1/maven-scm-1.8.1.pom (22 KB at 1178.9 KB/sec)
[INFO] Downloading: https://repo.maven.apache.org/maven2/org/apache/maven/scm/maven-scm-provider-gitexe/1.8.1/maven-scm-provider-gitexe-1.8.1.pom
[INFO] Downloaded: https://repo.maven.apache.org/maven2/org/apache/maven/scm/maven-scm-provider-gitexe/1.8.1/maven-scm-provider-gitexe-1.8.1.pom (3 KB at 160.8 KB/sec)
[INFO] Downloading: https://repo.maven.apache.org/maven2/org/apache/maven/scm/maven-scm-providers-git/1.8.1/maven-scm-providers-git-1.8.1.pom
[INFO] Downloaded: https://repo.maven.apache.org/maven2/org/apache/maven/scm/maven-scm-providers-git/1.8.1/maven-scm-providers-git-1.8.1.pom (3 KB at 144.0 KB/sec)
[INFO] Downloading: https://repo.maven.apache.org/maven2/org/apache/maven/scm/maven-scm-providers/1.8.1/maven-scm-providers-1.8.1.pom
[INFO] Downloaded: https://repo.maven.apache.org/maven2/org/apache/maven/scm/maven-scm-providers/1.8.1/maven-scm-providers-1.8.1.pom (4 KB at 228.2 KB/sec)
[INFO] Downloading: https://repo.maven.apache.org/maven2/org/apache/maven/scm/maven-scm-provider-git-commons/1.8.1/maven-scm-provider-git-commons-1.8.1.pom
[INFO] Downloaded: https://repo.maven.apache.org/maven2/org/apache/maven/scm/maven-scm-provider-git-commons/1.8.1/maven-scm-provider-git-commons-1.8.1.pom (3 KB at 138.1 KB/sec)
[INFO] Downloading: https://repo.maven.apache.org/maven2/org/apache/maven/scm/maven-scm-provider-svnexe/1.8.1/maven-scm-provider-svnexe-1.8.1.pom
[INFO] Downloaded: https://repo.maven.apache.org/maven2/org/apache/maven/scm/maven-scm-provider-svnexe/1.8.1/maven-scm-provider-svnexe-1.8.1.pom (3 KB at 153.9 KB/sec)
[INFO] Downloading: https://repo.maven.apache.org/maven2/org/apache/maven/scm/maven-scm-providers-svn/1.8.1/maven-scm-providers-svn-1.8.1.pom
[INFO] Downloaded: https://repo.maven.apache.org/maven2/org/apache/maven/scm/maven-scm-providers-svn/1.8.1/maven-scm-providers-svn-1.8.1.pom (3 KB at 138.4 KB/sec)
[INFO] Downloading: https://repo.maven.apache.org/maven2/org/apache/maven/scm/maven-scm-provider-svn-commons/1.8.1/maven-scm-provider-svn-commons-1.8.1.pom
[INFO] Downloaded: https://repo.maven.apache.org/maven2/org/apache/maven/scm/maven-scm-provider-svn-commons/1.8.1/maven-scm-provider-svn-commons-1.8.1.pom (3 KB at 175.9 KB/sec)
[INFO] Downloading: https://repo.maven.apache.org/maven2/org/codehaus/jackson/jackson-core-asl/1.9.4/jackson-core-asl-1.9.4.pom
[INFO] Downloaded: https://repo.maven.apache.org/maven2/org/codehaus/jackson/jackson-core-asl/1.9.4/jackson-core-asl-1.9.4.pom (1016 B at 62.0 KB/sec)
[INFO] Downloading: https://repo.maven.apache.org/maven2/org/codehaus/jackson/jackson-mapper-asl/1.9.4/jackson-mapper-asl-1.9.4.pom
[INFO] Downloaded: https://repo.maven.apache.org/maven2/org/codehaus/jackson/jackson-mapper-asl/1.9.4/jackson-mapper-asl-1.9.4.pom (2 KB at 80.9 KB/sec)
[INFO] Downloading: https://repo.maven.apache.org/maven2/org/apache/maven/release/maven-release-manager/2.3.2/maven-release-manager-2.3.2.jar
[INFO] Downloading: https://repo.maven.apache.org/maven2/org/apache/maven/scm/maven-scm-provider-accurev/1.7/maven-scm-provider-accurev-1.7.jar
[INFO] Downloading: https://repo.maven.apache.org/maven2/org/apache/maven/scm/maven-scm-provider-bazaar/1.7/maven-scm-provider-bazaar-1.7.jar
[INFO] Downloading: https://repo.maven.apache.org/maven2/org/apache/maven/scm/maven-scm-provider-clearcase/1.7/maven-scm-provider-clearcase-1.7.jar
[INFO] Downloading: https://repo.maven.apache.org/maven2/org/apache/maven/scm/maven-scm-provider-cvsexe/1.7/maven-scm-provider-cvsexe-1.7.jar
[INFO] Downloaded: https://repo.maven.apache.org/maven2/org/apache/maven/release/maven-release-manager/2.3.2/maven-release-manager-2.3.2.jar (181 KB at 3540.5 KB/sec)
[INFO] Downloading: https://repo.maven.apache.org/maven2/org/apache/maven/scm/maven-scm-provider-cvs-commons/1.7/maven-scm-provider-cvs-commons-1.7.jar
[INFO] Downloaded: https://repo.maven.apache.org/maven2/org/apache/maven/scm/maven-scm-provider-cvsexe/1.7/maven-scm-provider-cvsexe-1.7.jar (30 KB at 469.8 KB/sec)
[INFO] Downloading: https://repo.maven.apache.org/maven2/org/apache/maven/scm/maven-scm-provider-cvsjava/1.7/maven-scm-provider-cvsjava-1.7.jar
[INFO] Downloaded: https://repo.maven.apache.org/maven2/org/apache/maven/scm/maven-scm-provider-bazaar/1.7/maven-scm-provider-bazaar-1.7.jar (54 KB at 770.8 KB/sec)
[INFO] Downloading: https://repo.maven.apache.org/maven2/org/netbeans/lib/cvsclient/20060125/cvsclient-20060125.jar
[INFO] Downloaded: https://repo.maven.apache.org/maven2/org/apache/maven/scm/maven-scm-provider-clearcase/1.7/maven-scm-provider-clearcase-1.7.jar (70 KB at 991.6 KB/sec)
[INFO] Downloading: https://repo.maven.apache.org/maven2/ch/ethz/ganymed/ganymed-ssh2/build210/ganymed-ssh2-build210.jar
[INFO] Downloaded: https://repo.maven.apache.org/maven2/org/apache/maven/scm/maven-scm-provider-accurev/1.7/maven-scm-provider-accurev-1.7.jar (91 KB at 1235.7 KB/sec)
[INFO] Downloading: https://repo.maven.apache.org/maven2/org/apache/maven/scm/maven-scm-provider-hg/1.7/maven-scm-provider-hg-1.7.jar
[INFO] Downloaded: https://repo.maven.apache.org/maven2/org/apache/maven/scm/maven-scm-provider-cvs-commons/1.7/maven-scm-provider-cvs-commons-1.7.jar (78 KB at 1039.9 KB/sec)
[INFO] Downloading: https://repo.maven.apache.org/maven2/org/apache/maven/scm/maven-scm-provider-perforce/1.7/maven-scm-provider-perforce-1.7.jar
[INFO] Downloaded: https://repo.maven.apache.org/maven2/ch/ethz/ganymed/ganymed-ssh2/build210/ganymed-ssh2-build210.jar (0 B at 0.0 KB/sec)
[INFO] Downloading: https://repo.maven.apache.org/maven2/org/apache/maven/scm/maven-scm-provider-starteam/1.7/maven-scm-provider-starteam-1.7.jar
[INFO] Downloaded: https://repo.maven.apache.org/maven2/org/netbeans/lib/cvsclient/20060125/cvsclient-20060125.jar (0 B at 0.0 KB/sec)
[INFO] Downloading: https://repo.maven.apache.org/maven2/org/apache/maven/scm/maven-scm-provider-synergy/1.7/maven-scm-provider-synergy-1.7.jar
[INFO] Downloaded: https://repo.maven.apache.org/maven2/org/apache/maven/scm/maven-scm-provider-cvsjava/1.7/maven-scm-provider-cvsjava-1.7.jar (43 KB at 530.1 KB/sec)
[INFO] Downloading: https://repo.maven.apache.org/maven2/org/apache/maven/scm/maven-scm-provider-vss/1.7/maven-scm-provider-vss-1.7.jar
[INFO] Downloaded: https://repo.maven.apache.org/maven2/org/apache/maven/scm/maven-scm-provider-hg/1.7/maven-scm-provider-hg-1.7.jar (64 KB at 690.3 KB/sec)
[INFO] Downloading: https://repo.maven.apache.org/maven2/org/apache/maven/scm/maven-scm-provider-tfs/1.7/maven-scm-provider-tfs-1.7.jar
[INFO] Downloaded: https://repo.maven.apache.org/maven2/org/apache/maven/scm/maven-scm-provider-perforce/1.7/maven-scm-provider-perforce-1.7.jar (80 KB at 839.7 KB/sec)
[INFO] Downloading: https://repo.maven.apache.org/maven2/org/apache/maven/scm/maven-scm-provider-integrity/1.7/maven-scm-provider-integrity-1.7.jar
[INFO] Downloaded: https://repo.maven.apache.org/maven2/org/apache/maven/scm/maven-scm-provider-starteam/1.7/maven-scm-provider-starteam-1.7.jar (73 KB at 748.3 KB/sec)
[INFO] Downloading: https://repo.maven.apache.org/maven2/com/mks/api/mksapi-jar/4.10.9049/mksapi-jar-4.10.9049.jar
[INFO] Downloaded: https://repo.maven.apache.org/maven2/org/apache/maven/scm/maven-scm-provider-synergy/1.7/maven-scm-provider-synergy-1.7.jar (57 KB at 549.8 KB/sec)
[INFO] Downloading: https://repo.maven.apache.org/maven2/org/codehaus/groovy/groovy-all/1.7.6/groovy-all-1.7.6.jar
[INFO] Downloaded: https://repo.maven.apache.org/maven2/org/apache/maven/scm/maven-scm-provider-vss/1.7/maven-scm-provider-vss-1.7.jar (67 KB at 656.2 KB/sec)
[INFO] Downloading: https://repo.maven.apache.org/maven2/org/apache/maven/scm/maven-scm-provider-jazz/1.7/maven-scm-provider-jazz-1.7.jar
[INFO] Downloaded: https://repo.maven.apache.org/maven2/org/apache/maven/scm/maven-scm-provider-tfs/1.7/maven-scm-provider-tfs-1.7.jar (41 KB at 365.3 KB/sec)
[INFO] Downloading: https://repo.maven.apache.org/maven2/org/apache/maven/scm/maven-scm-manager-plexus/1.7/maven-scm-manager-plexus-1.7.jar
[INFO] Downloaded: https://repo.maven.apache.org/maven2/org/apache/maven/scm/maven-scm-provider-integrity/1.7/maven-scm-provider-integrity-1.7.jar (76 KB at 660.1 KB/sec)
[INFO] Downloading: https://repo.maven.apache.org/maven2/jaxen/jaxen/1.1-beta-8/jaxen-1.1-beta-8.jar
[INFO] Downloaded: https://repo.maven.apache.org/maven2/org/apache/maven/scm/maven-scm-provider-jazz/1.7/maven-scm-provider-jazz-1.7.jar (64 KB at 522.0 KB/sec)
[INFO] Downloading: https://repo.maven.apache.org/maven2/org/apache/maven/scm/maven-scm-api/1.8.1/maven-scm-api-1.8.1.jar
[INFO] Downloaded: https://repo.maven.apache.org/maven2/org/apache/maven/scm/maven-scm-manager-plexus/1.7/maven-scm-manager-plexus-1.7.jar (11 KB at 81.9 KB/sec)
[INFO] Downloading: https://repo.maven.apache.org/maven2/org/apache/maven/scm/maven-scm-provider-gitexe/1.8.1/maven-scm-provider-gitexe-1.8.1.jar
[INFO] Downloaded: https://repo.maven.apache.org/maven2/jaxen/jaxen/1.1-beta-8/jaxen-1.1-beta-8.jar (227 KB at 1549.8 KB/sec)
[INFO] Downloading: https://repo.maven.apache.org/maven2/org/apache/maven/scm/maven-scm-provider-git-commons/1.8.1/maven-scm-provider-git-commons-1.8.1.jar
[INFO] Downloaded: https://repo.maven.apache.org/maven2/org/apache/maven/scm/maven-scm-provider-gitexe/1.8.1/maven-scm-provider-gitexe-1.8.1.jar (63 KB at 424.0 KB/sec)
[INFO] Downloading: https://repo.maven.apache.org/maven2/org/apache/maven/scm/maven-scm-provider-svnexe/1.8.1/maven-scm-provider-svnexe-1.8.1.jar
[INFO] Downloaded: https://repo.maven.apache.org/maven2/org/apache/maven/scm/maven-scm-api/1.8.1/maven-scm-api-1.8.1.jar (103 KB at 695.8 KB/sec)
[INFO] Downloading: https://repo.maven.apache.org/maven2/org/apache/maven/scm/maven-scm-provider-svn-commons/1.8.1/maven-scm-provider-svn-commons-1.8.1.jar
[INFO] Downloaded: https://repo.maven.apache.org/maven2/com/mks/api/mksapi-jar/4.10.9049/mksapi-jar-4.10.9049.jar (630 KB at 3864.8 KB/sec)
[INFO] Downloading: https://repo.maven.apache.org/maven2/org/codehaus/jackson/jackson-core-asl/1.9.4/jackson-core-asl-1.9.4.jar
[INFO] Downloaded: https://repo.maven.apache.org/maven2/org/apache/maven/scm/maven-scm-provider-git-commons/1.8.1/maven-scm-provider-git-commons-1.8.1.jar (37 KB at 223.9 KB/sec)
[INFO] Downloading: https://repo.maven.apache.org/maven2/org/codehaus/jackson/jackson-mapper-asl/1.9.4/jackson-mapper-asl-1.9.4.jar
[INFO] Downloaded: https://repo.maven.apache.org/maven2/org/apache/maven/scm/maven-scm-provider-svn-commons/1.8.1/maven-scm-provider-svn-commons-1.8.1.jar (40 KB at 236.5 KB/sec)
[INFO] Downloaded: https://repo.maven.apache.org/maven2/org/apache/maven/scm/maven-scm-provider-svnexe/1.8.1/maven-scm-provider-svnexe-1.8.1.jar (76 KB at 441.2 KB/sec)
[INFO] Downloaded: https://repo.maven.apache.org/maven2/org/codehaus/jackson/jackson-core-asl/1.9.4/jackson-core-asl-1.9.4.jar (223 KB at 1155.3 KB/sec)
[INFO] Downloaded: https://repo.maven.apache.org/maven2/org/codehaus/jackson/jackson-mapper-asl/1.9.4/jackson-mapper-asl-1.9.4.jar (760 KB at 3204.5 KB/sec)
[INFO] Downloaded: https://repo.maven.apache.org/maven2/org/codehaus/groovy/groovy-all/1.7.6/groovy-all-1.7.6.jar (5527 KB at 12199.2 KB/sec)
[INFO] Downloading: https://repo.maven.apache.org/maven2/org/apache/maven/wagon/wagon-provider-api/2.5/wagon-provider-api-2.5.jar
[INFO] Downloaded: https://repo.maven.apache.org/maven2/org/apache/maven/wagon/wagon-provider-api/2.5/wagon-provider-api-2.5.jar (52 KB at 2571.7 KB/sec)
[INFO] ------------------------------------------------------------------------
[INFO] Reactor Build Order:
[INFO]
[INFO] Tiles Request Framework
[INFO] Tiles request - API
[INFO] Tiles request - Servlet support
[INFO] Tiles Request - Wildcard file loading in Servlets
[INFO] Tiles - Portlet support
[INFO] Tiles - Wildcard file loading in Portlets
[INFO] Tiles Request - JSP support
[INFO] Tiles Request - Freemarker support
[INFO] Tiles Request - Velocity support
[INFO] Tiles request - Mustache support
[INFO] Tiles Request Assembly
[INFO]                                                                        
[INFO] ------------------------------------------------------------------------
[INFO] Building Tiles Request Framework 1.0.8-SNAPSHOT
[INFO] ------------------------------------------------------------------------
[INFO] Downloading: https://repo.maven.apache.org/maven2/org/apache/maven/plugins/maven-enforcer-plugin/1.2/maven-enforcer-plugin-1.2.pom
[INFO] Downloaded: https://repo.maven.apache.org/maven2/org/apache/maven/plugins/maven-enforcer-plugin/1.2/maven-enforcer-plugin-1.2.pom (6 KB at 316.5 KB/sec)
[INFO] Downloading: https://repo.maven.apache.org/maven2/org/apache/maven/enforcer/enforcer/1.2/enforcer-1.2.pom
[INFO] Downloaded: https://repo.maven.apache.org/maven2/org/apache/maven/enforcer/enforcer/1.2/enforcer-1.2.pom (11 KB at 564.7 KB/sec)
[INFO] Downloading: https://repo.maven.apache.org/maven2/org/apache/maven/plugins/maven-enforcer-plugin/1.2/maven-enforcer-plugin-1.2.jar
[INFO] Downloaded: https://repo.maven.apache.org/maven2/org/apache/maven/plugins/maven-enforcer-plugin/1.2/maven-enforcer-plugin-1.2.jar (25 KB at 1307.4 KB/sec)
[INFO] Downloading: https://repo.maven.apache.org/maven2/org/slf4j/slf4j-api/1.5.8/slf4j-api-1.5.8.jar
[INFO] Downloaded: https://repo.maven.apache.org/maven2/org/slf4j/slf4j-api/1.5.8/slf4j-api-1.5.8.jar (23 KB at 1272.0 KB/sec)
[INFO]
[INFO] --- maven-clean-plugin:2.5:clean (default-clean) @ tiles-request ---
[INFO]
[INFO] --- maven-enforcer-plugin:1.2:enforce (enforce-java) @ tiles-request ---
[INFO] Downloading: https://repo.maven.apache.org/maven2/org/apache/maven/enforcer/enforcer-api/1.2/enforcer-api-1.2.pom
[INFO] Downloaded: https://repo.maven.apache.org/maven2/org/apache/maven/enforcer/enforcer-api/1.2/enforcer-api-1.2.pom (3 KB at 164.2 KB/sec)
[INFO] Downloading: https://repo.maven.apache.org/maven2/org/apache/maven/enforcer/enforcer-rules/1.2/enforcer-rules-1.2.pom
[INFO] Downloaded: https://repo.maven.apache.org/maven2/org/apache/maven/enforcer/enforcer-rules/1.2/enforcer-rules-1.2.pom (4 KB at 240.3 KB/sec)
[INFO] Downloading: https://repo.maven.apache.org/maven2/org/apache/maven/shared/maven-dependency-tree/2.0/maven-dependency-tree-2.0.pom
[INFO] Downloaded: https://repo.maven.apache.org/maven2/org/apache/maven/shared/maven-dependency-tree/2.0/maven-dependency-tree-2.0.pom (5 KB at 285.2 KB/sec)
[INFO] Downloading: https://repo.maven.apache.org/maven2/org/apache/maven/enforcer/enforcer-api/1.2/enforcer-api-1.2.jar
[INFO] Downloading: https://repo.maven.apache.org/maven2/org/apache/maven/enforcer/enforcer-rules/1.2/enforcer-rules-1.2.jar
[INFO] Downloading: https://repo.maven.apache.org/maven2/org/apache/maven/shared/maven-dependency-tree/2.0/maven-dependency-tree-2.0.jar
[INFO] Downloaded: https://repo.maven.apache.org/maven2/org/apache/maven/enforcer/enforcer-api/1.2/enforcer-api-1.2.jar (10 KB at 529.5 KB/sec)
[INFO] Downloaded: https://repo.maven.apache.org/maven2/org/apache/maven/shared/maven-dependency-tree/2.0/maven-dependency-tree-2.0.jar (55 KB at 2605.7 KB/sec)
[INFO] Downloaded: https://repo.maven.apache.org/maven2/org/apache/maven/enforcer/enforcer-rules/1.2/enforcer-rules-1.2.jar (75 KB at 2864.7 KB/sec)
[WARNING] Rule 0: org.apache.maven.plugins.enforcer.RequireJavaVersion failed with message:
Detected JDK Version: 1.8.0-131 is not in the allowed range [1.7.0-45,1.8).
[INFO] ------------------------------------------------------------------------
[INFO] Reactor Summary:
[INFO]
[INFO] Tiles Request Framework ............................ FAILURE [  3.654 s]
[INFO] Tiles request - API ................................ SKIPPED
[INFO] Tiles request - Servlet support .................... SKIPPED
[INFO] Tiles Request - Wildcard file loading in Servlets .. SKIPPED
[INFO] Tiles - Portlet support ............................ SKIPPED
[INFO] Tiles - Wildcard file loading in Portlets .......... SKIPPED
[INFO] Tiles Request - JSP support ........................ SKIPPED
[INFO] Tiles Request - Freemarker support ................. SKIPPED
[INFO] Tiles Request - Velocity support ................... SKIPPED
[INFO] Tiles request - Mustache support ................... SKIPPED
[INFO] Tiles Request Assembly ............................. SKIPPED
[INFO] ------------------------------------------------------------------------
[INFO] BUILD FAILURE
[INFO] ------------------------------------------------------------------------
[INFO] Total time: 17.763 s
[INFO] Finished at: 2017-09-04T11:34:44+00:00
[INFO] Final Memory: 20M/376M
[INFO] ------------------------------------------------------------------------
Waiting for Jenkins to finish collecting data
[ERROR] Failed to execute goal org.apache.maven.plugins:maven-enforcer-plugin:1.2:enforce (enforce-java) on project tiles-request: Some Enforcer rules have failed. Look above for specific messages explaining why the rule failed. -> [Help 1]
[ERROR]
[ERROR] To see the full stack trace of the errors, re-run Maven with the -e switch.
[ERROR] Re-run Maven using the -X switch to enable full debug logging.
[ERROR]
[ERROR] For more information about the errors and possible solutions, please read the following articles:
[ERROR] [Help 1] http://cwiki.apache.org/confluence/display/MAVEN/MojoExecutionException
[JENKINS] Archiving <https://builds.apache.org/job/Tiles-Request-1.0.x/ws/assembly/pom.xml> to org.apache.tiles/tiles-request-assembly/1.0.8-SNAPSHOT/tiles-request-assembly-1.0.8-SNAPSHOT.pom
[JENKINS] Archiving <https://builds.apache.org/job/Tiles-Request-1.0.x/ws/pom.xml> to org.apache.tiles/tiles-request/1.0.8-SNAPSHOT/tiles-request-1.0.8-SNAPSHOT.pom
[JENKINS] Archiving <https://builds.apache.org/job/Tiles-Request-1.0.x/ws/tiles-request-velocity/pom.xml> to org.apache.tiles/tiles-request-velocity/1.0.8-SNAPSHOT/tiles-request-velocity-1.0.8-SNAPSHOT.pom
[JENKINS] Archiving <https://builds.apache.org/job/Tiles-Request-1.0.x/ws/tiles-request-freemarker/pom.xml> to org.apache.tiles/tiles-request-freemarker/1.0.8-SNAPSHOT/tiles-request-freemarker-1.0.8-SNAPSHOT.pom
[JENKINS] Archiving <https://builds.apache.org/job/Tiles-Request-1.0.x/ws/tiles-request-servlet-wildcard/pom.xml> to org.apache.tiles/tiles-request-servlet-wildcard/1.0.8-SNAPSHOT/tiles-request-servlet-wildcard-1.0.8-SNAPSHOT.pom
[JENKINS] Archiving <https://builds.apache.org/job/Tiles-Request-1.0.x/ws/tiles-request-mustache/pom.xml> to org.apache.tiles/tiles-request-mustache/1.0.8-SNAPSHOT/tiles-request-mustache-1.0.8-SNAPSHOT.pom
[JENKINS] Archiving <https://builds.apache.org/job/Tiles-Request-1.0.x/ws/tiles-request-jsp/pom.xml> to org.apache.tiles/tiles-request-jsp/1.0.8-SNAPSHOT/tiles-request-jsp-1.0.8-SNAPSHOT.pom
[JENKINS] Archiving <https://builds.apache.org/job/Tiles-Request-1.0.x/ws/tiles-request-servlet/pom.xml> to org.apache.tiles/tiles-request-servlet/1.0.8-SNAPSHOT/tiles-request-servlet-1.0.8-SNAPSHOT.pom
[JENKINS] Archiving <https://builds.apache.org/job/Tiles-Request-1.0.x/ws/tiles-request-portlet-wildcard/pom.xml> to org.apache.tiles/tiles-request-portlet-wildcard/1.0.8-SNAPSHOT/tiles-request-portlet-wildcard-1.0.8-SNAPSHOT.pom
[JENKINS] Archiving <https://builds.apache.org/job/Tiles-Request-1.0.x/ws/tiles-request-api/pom.xml> to org.apache.tiles/tiles-request-api/1.0.8-SNAPSHOT/tiles-request-api-1.0.8-SNAPSHOT.pom
[JENKINS] Archiving <https://builds.apache.org/job/Tiles-Request-1.0.x/ws/tiles-request-portlet/pom.xml> to org.apache.tiles/tiles-request-portlet/1.0.8-SNAPSHOT/tiles-request-portlet-1.0.8-SNAPSHOT.pom
channel stopped
Reply | Threaded
Open this post in threaded view
|

Build failed in Jenkins: Tiles-Request-1.0.x #24

Apache Jenkins Server-2
See <https://builds.apache.org/job/Tiles-Request-1.0.x/24/display/redirect>

------------------------------------------
Started by an SCM change
[EnvInject] - Loading node environment variables.
Building remotely on H25 (couchdbtest ubuntu xenial) in workspace <https://builds.apache.org/job/Tiles-Request-1.0.x/ws/>
Updating https://svn.apache.org/repos/asf/tiles/request/branches/TREQ_1_0_X at revision '2017-09-04T11:38:12.752 +0000'
At revision 1807211

No changes for https://svn.apache.org/repos/asf/tiles/request/branches/TREQ_1_0_X since the previous build
Parsing POMs
Downloaded artifact http://repo.maven.apache.org/maven2/org/apache/tiles/tiles-master/6/tiles-master-6.pom
Established TCP socket on 37680
maven33-agent.jar already up to date
maven33-interceptor.jar already up to date
maven3-interceptor-commons.jar already up to date
[Tiles-Request-1.0.x] $ /home/jenkins/tools/java/latest1.8/bin/java -Xmx2g -Xms256m -cp /home/jenkins/jenkins-slave/maven33-agent.jar:/home/jenkins/tools/maven/apache-maven-3.3.9/boot/plexus-classworlds-2.5.2.jar:/home/jenkins/tools/maven/apache-maven-3.3.9/conf/logging jenkins.maven3.agent.Maven33Main /home/jenkins/tools/maven/apache-maven-3.3.9 /home/jenkins/jenkins-slave/slave.jar /home/jenkins/jenkins-slave/maven33-interceptor.jar /home/jenkins/jenkins-slave/maven3-interceptor-commons.jar 37680
<===[JENKINS REMOTING CAPACITY]===>   channel started
Executing Maven:  -B -f <https://builds.apache.org/job/Tiles-Request-1.0.x/ws/pom.xml> -Dmaven.repo.local=/home/jenkins/jenkins-slave/maven-repositories/0 clean install
[INFO] Scanning for projects...
[INFO] Downloading: https://repo.maven.apache.org/maven2/org/apache/maven/release/maven-release-manager/2.3.2/maven-release-manager-2.3.2.pom
[INFO] Downloaded: https://repo.maven.apache.org/maven2/org/apache/maven/release/maven-release-manager/2.3.2/maven-release-manager-2.3.2.pom (10 KB at 34.4 KB/sec)
[INFO] Downloading: https://repo.maven.apache.org/maven2/org/apache/maven/release/maven-release/2.3.2/maven-release-2.3.2.pom
[INFO] Downloaded: https://repo.maven.apache.org/maven2/org/apache/maven/release/maven-release/2.3.2/maven-release-2.3.2.pom (9 KB at 467.8 KB/sec)
[INFO] Downloading: https://repo.maven.apache.org/maven2/org/apache/maven/scm/maven-scm-providers-standard/1.7/maven-scm-providers-standard-1.7.pom
[INFO] Downloaded: https://repo.maven.apache.org/maven2/org/apache/maven/scm/maven-scm-providers-standard/1.7/maven-scm-providers-standard-1.7.pom (4 KB at 226.4 KB/sec)
[INFO] Downloading: https://repo.maven.apache.org/maven2/org/apache/maven/scm/maven-scm-providers/1.7/maven-scm-providers-1.7.pom
[INFO] Downloaded: https://repo.maven.apache.org/maven2/org/apache/maven/scm/maven-scm-providers/1.7/maven-scm-providers-1.7.pom (4 KB at 228.1 KB/sec)
[INFO] Downloading: https://repo.maven.apache.org/maven2/org/apache/maven/scm/maven-scm/1.7/maven-scm-1.7.pom
[INFO] Downloaded: https://repo.maven.apache.org/maven2/org/apache/maven/scm/maven-scm/1.7/maven-scm-1.7.pom (18 KB at 933.9 KB/sec)
[INFO] Downloading: https://repo.maven.apache.org/maven2/org/apache/maven/scm/maven-scm-provider-accurev/1.7/maven-scm-provider-accurev-1.7.pom
[INFO] Downloaded: https://repo.maven.apache.org/maven2/org/apache/maven/scm/maven-scm-provider-accurev/1.7/maven-scm-provider-accurev-1.7.pom (4 KB at 200.0 KB/sec)
[INFO] Downloading: https://repo.maven.apache.org/maven2/org/apache/maven/scm/maven-scm-api/1.7/maven-scm-api-1.7.pom
[INFO] Downloaded: https://repo.maven.apache.org/maven2/org/apache/maven/scm/maven-scm-api/1.7/maven-scm-api-1.7.pom (2 KB at 102.7 KB/sec)
[INFO] Downloading: https://repo.maven.apache.org/maven2/org/apache/maven/scm/maven-scm-provider-bazaar/1.7/maven-scm-provider-bazaar-1.7.pom
[INFO] Downloaded: https://repo.maven.apache.org/maven2/org/apache/maven/scm/maven-scm-provider-bazaar/1.7/maven-scm-provider-bazaar-1.7.pom (3 KB at 125.4 KB/sec)
[INFO] Downloading: https://repo.maven.apache.org/maven2/org/apache/maven/scm/maven-scm-provider-clearcase/1.7/maven-scm-provider-clearcase-1.7.pom
[INFO] Downloaded: https://repo.maven.apache.org/maven2/org/apache/maven/scm/maven-scm-provider-clearcase/1.7/maven-scm-provider-clearcase-1.7.pom (3 KB at 177.0 KB/sec)
[INFO] Downloading: https://repo.maven.apache.org/maven2/org/apache/maven/scm/maven-scm-provider-cvsexe/1.7/maven-scm-provider-cvsexe-1.7.pom
[INFO] Downloaded: https://repo.maven.apache.org/maven2/org/apache/maven/scm/maven-scm-provider-cvsexe/1.7/maven-scm-provider-cvsexe-1.7.pom (3 KB at 174.6 KB/sec)
[INFO] Downloading: https://repo.maven.apache.org/maven2/org/apache/maven/scm/maven-scm-providers-cvs/1.7/maven-scm-providers-cvs-1.7.pom
[INFO] Downloaded: https://repo.maven.apache.org/maven2/org/apache/maven/scm/maven-scm-providers-cvs/1.7/maven-scm-providers-cvs-1.7.pom (2 KB at 104.3 KB/sec)
[INFO] Downloading: https://repo.maven.apache.org/maven2/org/apache/maven/scm/maven-scm-provider-cvs-commons/1.7/maven-scm-provider-cvs-commons-1.7.pom
[INFO] Downloaded: https://repo.maven.apache.org/maven2/org/apache/maven/scm/maven-scm-provider-cvs-commons/1.7/maven-scm-provider-cvs-commons-1.7.pom (3 KB at 157.9 KB/sec)
[INFO] Downloading: https://repo.maven.apache.org/maven2/org/apache/maven/scm/maven-scm-provider-cvsjava/1.7/maven-scm-provider-cvsjava-1.7.pom
[INFO] Downloaded: https://repo.maven.apache.org/maven2/org/apache/maven/scm/maven-scm-provider-cvsjava/1.7/maven-scm-provider-cvsjava-1.7.pom (3 KB at 159.2 KB/sec)
[INFO] Downloading: https://repo.maven.apache.org/maven2/org/apache/maven/scm/maven-scm-provider-gitexe/1.7/maven-scm-provider-gitexe-1.7.pom
[INFO] Downloaded: https://repo.maven.apache.org/maven2/org/apache/maven/scm/maven-scm-provider-gitexe/1.7/maven-scm-provider-gitexe-1.7.pom (3 KB at 155.5 KB/sec)
[INFO] Downloading: https://repo.maven.apache.org/maven2/org/apache/maven/scm/maven-scm-providers-git/1.7/maven-scm-providers-git-1.7.pom
[INFO] Downloaded: https://repo.maven.apache.org/maven2/org/apache/maven/scm/maven-scm-providers-git/1.7/maven-scm-providers-git-1.7.pom (3 KB at 143.9 KB/sec)
[INFO] Downloading: https://repo.maven.apache.org/maven2/org/apache/maven/scm/maven-scm-provider-git-commons/1.7/maven-scm-provider-git-commons-1.7.pom
[INFO] Downloaded: https://repo.maven.apache.org/maven2/org/apache/maven/scm/maven-scm-provider-git-commons/1.7/maven-scm-provider-git-commons-1.7.pom (3 KB at 147.1 KB/sec)
[INFO] Downloading: https://repo.maven.apache.org/maven2/org/apache/maven/scm/maven-scm-provider-hg/1.7/maven-scm-provider-hg-1.7.pom
[INFO] Downloaded: https://repo.maven.apache.org/maven2/org/apache/maven/scm/maven-scm-provider-hg/1.7/maven-scm-provider-hg-1.7.pom (3 KB at 159.2 KB/sec)
[INFO] Downloading: https://repo.maven.apache.org/maven2/org/apache/maven/scm/maven-scm-provider-perforce/1.7/maven-scm-provider-perforce-1.7.pom
[INFO] Downloaded: https://repo.maven.apache.org/maven2/org/apache/maven/scm/maven-scm-provider-perforce/1.7/maven-scm-provider-perforce-1.7.pom (3 KB at 183.4 KB/sec)
[INFO] Downloading: https://repo.maven.apache.org/maven2/org/apache/maven/scm/maven-scm-provider-starteam/1.7/maven-scm-provider-starteam-1.7.pom
[INFO] Downloaded: https://repo.maven.apache.org/maven2/org/apache/maven/scm/maven-scm-provider-starteam/1.7/maven-scm-provider-starteam-1.7.pom (3 KB at 167.7 KB/sec)
[INFO] Downloading: https://repo.maven.apache.org/maven2/org/apache/maven/scm/maven-scm-provider-svnexe/1.7/maven-scm-provider-svnexe-1.7.pom
[INFO] Downloaded: https://repo.maven.apache.org/maven2/org/apache/maven/scm/maven-scm-provider-svnexe/1.7/maven-scm-provider-svnexe-1.7.pom (3 KB at 174.8 KB/sec)
[INFO] Downloading: https://repo.maven.apache.org/maven2/org/apache/maven/scm/maven-scm-providers-svn/1.7/maven-scm-providers-svn-1.7.pom
[INFO] Downloaded: https://repo.maven.apache.org/maven2/org/apache/maven/scm/maven-scm-providers-svn/1.7/maven-scm-providers-svn-1.7.pom (3 KB at 148.2 KB/sec)
[INFO] Downloading: https://repo.maven.apache.org/maven2/org/apache/maven/scm/maven-scm-provider-svn-commons/1.7/maven-scm-provider-svn-commons-1.7.pom
[INFO] Downloaded: https://repo.maven.apache.org/maven2/org/apache/maven/scm/maven-scm-provider-svn-commons/1.7/maven-scm-provider-svn-commons-1.7.pom (3 KB at 175.8 KB/sec)
[INFO] Downloading: https://repo.maven.apache.org/maven2/org/apache/maven/scm/maven-scm-provider-synergy/1.7/maven-scm-provider-synergy-1.7.pom
[INFO] Downloaded: https://repo.maven.apache.org/maven2/org/apache/maven/scm/maven-scm-provider-synergy/1.7/maven-scm-provider-synergy-1.7.pom (2 KB at 136.1 KB/sec)
[INFO] Downloading: https://repo.maven.apache.org/maven2/org/apache/maven/scm/maven-scm-provider-vss/1.7/maven-scm-provider-vss-1.7.pom
[INFO] Downloaded: https://repo.maven.apache.org/maven2/org/apache/maven/scm/maven-scm-provider-vss/1.7/maven-scm-provider-vss-1.7.pom (3 KB at 166.9 KB/sec)
[INFO] Downloading: https://repo.maven.apache.org/maven2/org/apache/maven/scm/maven-scm-provider-tfs/1.7/maven-scm-provider-tfs-1.7.pom
[INFO] Downloaded: https://repo.maven.apache.org/maven2/org/apache/maven/scm/maven-scm-provider-tfs/1.7/maven-scm-provider-tfs-1.7.pom (3 KB at 186.0 KB/sec)
[INFO] Downloading: https://repo.maven.apache.org/maven2/org/apache/maven/scm/maven-scm-provider-integrity/1.7/maven-scm-provider-integrity-1.7.pom
[INFO] Downloaded: https://repo.maven.apache.org/maven2/org/apache/maven/scm/maven-scm-provider-integrity/1.7/maven-scm-provider-integrity-1.7.pom (5 KB at 261.8 KB/sec)
[INFO] Downloading: https://repo.maven.apache.org/maven2/org/apache/maven/scm/maven-scm-provider-jazz/1.7/maven-scm-provider-jazz-1.7.pom
[INFO] Downloaded: https://repo.maven.apache.org/maven2/org/apache/maven/scm/maven-scm-provider-jazz/1.7/maven-scm-provider-jazz-1.7.pom (4 KB at 222.4 KB/sec)
[INFO] Downloading: https://repo.maven.apache.org/maven2/org/apache/maven/scm/maven-scm-manager-plexus/1.7/maven-scm-manager-plexus-1.7.pom
[INFO] Downloaded: https://repo.maven.apache.org/maven2/org/apache/maven/scm/maven-scm-manager-plexus/1.7/maven-scm-manager-plexus-1.7.pom (3 KB at 140.9 KB/sec)
[INFO] Downloading: https://repo.maven.apache.org/maven2/org/apache/maven/scm/maven-scm-managers/1.7/maven-scm-managers-1.7.pom
[INFO] Downloaded: https://repo.maven.apache.org/maven2/org/apache/maven/scm/maven-scm-managers/1.7/maven-scm-managers-1.7.pom (2 KB at 103.9 KB/sec)
[INFO] Downloading: https://repo.maven.apache.org/maven2/org/apache/maven/scm/maven-scm-api/1.8.1/maven-scm-api-1.8.1.pom
[INFO] Downloaded: https://repo.maven.apache.org/maven2/org/apache/maven/scm/maven-scm-api/1.8.1/maven-scm-api-1.8.1.pom (2 KB at 102.8 KB/sec)
[INFO] Downloading: https://repo.maven.apache.org/maven2/org/apache/maven/scm/maven-scm/1.8.1/maven-scm-1.8.1.pom
[INFO] Downloaded: https://repo.maven.apache.org/maven2/org/apache/maven/scm/maven-scm/1.8.1/maven-scm-1.8.1.pom (22 KB at 1248.2 KB/sec)
[INFO] Downloading: https://repo.maven.apache.org/maven2/org/apache/maven/scm/maven-scm-provider-gitexe/1.8.1/maven-scm-provider-gitexe-1.8.1.pom
[INFO] Downloaded: https://repo.maven.apache.org/maven2/org/apache/maven/scm/maven-scm-provider-gitexe/1.8.1/maven-scm-provider-gitexe-1.8.1.pom (3 KB at 171.5 KB/sec)
[INFO] Downloading: https://repo.maven.apache.org/maven2/org/apache/maven/scm/maven-scm-providers-git/1.8.1/maven-scm-providers-git-1.8.1.pom
[INFO] Downloaded: https://repo.maven.apache.org/maven2/org/apache/maven/scm/maven-scm-providers-git/1.8.1/maven-scm-providers-git-1.8.1.pom (3 KB at 154.3 KB/sec)
[INFO] Downloading: https://repo.maven.apache.org/maven2/org/apache/maven/scm/maven-scm-providers/1.8.1/maven-scm-providers-1.8.1.pom
[INFO] Downloaded: https://repo.maven.apache.org/maven2/org/apache/maven/scm/maven-scm-providers/1.8.1/maven-scm-providers-1.8.1.pom (4 KB at 260.8 KB/sec)
[INFO] Downloading: https://repo.maven.apache.org/maven2/org/apache/maven/scm/maven-scm-provider-git-commons/1.8.1/maven-scm-provider-git-commons-1.8.1.pom
[INFO] Downloaded: https://repo.maven.apache.org/maven2/org/apache/maven/scm/maven-scm-provider-git-commons/1.8.1/maven-scm-provider-git-commons-1.8.1.pom (3 KB at 138.1 KB/sec)
[INFO] Downloading: https://repo.maven.apache.org/maven2/org/apache/maven/scm/maven-scm-provider-svnexe/1.8.1/maven-scm-provider-svnexe-1.8.1.pom
[INFO] Downloaded: https://repo.maven.apache.org/maven2/org/apache/maven/scm/maven-scm-provider-svnexe/1.8.1/maven-scm-provider-svnexe-1.8.1.pom (3 KB at 153.9 KB/sec)
[INFO] Downloading: https://repo.maven.apache.org/maven2/org/apache/maven/scm/maven-scm-providers-svn/1.8.1/maven-scm-providers-svn-1.8.1.pom
[INFO] Downloaded: https://repo.maven.apache.org/maven2/org/apache/maven/scm/maven-scm-providers-svn/1.8.1/maven-scm-providers-svn-1.8.1.pom (3 KB at 148.3 KB/sec)
[INFO] Downloading: https://repo.maven.apache.org/maven2/org/apache/maven/scm/maven-scm-provider-svn-commons/1.8.1/maven-scm-provider-svn-commons-1.8.1.pom
[INFO] Downloaded: https://repo.maven.apache.org/maven2/org/apache/maven/scm/maven-scm-provider-svn-commons/1.8.1/maven-scm-provider-svn-commons-1.8.1.pom (3 KB at 164.9 KB/sec)
[INFO] Downloading: https://repo.maven.apache.org/maven2/org/apache/maven/release/maven-release-manager/2.3.2/maven-release-manager-2.3.2.jar
[INFO] Downloading: https://repo.maven.apache.org/maven2/org/apache/maven/scm/maven-scm-provider-accurev/1.7/maven-scm-provider-accurev-1.7.jar
[INFO] Downloading: https://repo.maven.apache.org/maven2/org/apache/maven/scm/maven-scm-provider-bazaar/1.7/maven-scm-provider-bazaar-1.7.jar
[INFO] Downloading: https://repo.maven.apache.org/maven2/org/apache/maven/scm/maven-scm-provider-clearcase/1.7/maven-scm-provider-clearcase-1.7.jar
[INFO] Downloading: https://repo.maven.apache.org/maven2/org/apache/maven/scm/maven-scm-provider-cvsexe/1.7/maven-scm-provider-cvsexe-1.7.jar
[INFO] Downloaded: https://repo.maven.apache.org/maven2/org/apache/maven/release/maven-release-manager/2.3.2/maven-release-manager-2.3.2.jar (181 KB at 2960.1 KB/sec)
[INFO] Downloading: https://repo.maven.apache.org/maven2/org/apache/maven/scm/maven-scm-provider-cvs-commons/1.7/maven-scm-provider-cvs-commons-1.7.jar
[INFO] Downloaded: https://repo.maven.apache.org/maven2/org/apache/maven/scm/maven-scm-provider-cvsexe/1.7/maven-scm-provider-cvsexe-1.7.jar (30 KB at 364.1 KB/sec)
[INFO] Downloading: https://repo.maven.apache.org/maven2/org/apache/maven/scm/maven-scm-provider-cvsjava/1.7/maven-scm-provider-cvsjava-1.7.jar
[INFO] Downloaded: https://repo.maven.apache.org/maven2/org/apache/maven/scm/maven-scm-provider-bazaar/1.7/maven-scm-provider-bazaar-1.7.jar (54 KB at 625.7 KB/sec)
[INFO] Downloading: https://repo.maven.apache.org/maven2/org/apache/maven/scm/maven-scm-provider-hg/1.7/maven-scm-provider-hg-1.7.jar
[INFO] Downloaded: https://repo.maven.apache.org/maven2/org/apache/maven/scm/maven-scm-provider-clearcase/1.7/maven-scm-provider-clearcase-1.7.jar (70 KB at 807.1 KB/sec)
[INFO] Downloading: https://repo.maven.apache.org/maven2/org/apache/maven/scm/maven-scm-provider-perforce/1.7/maven-scm-provider-perforce-1.7.jar
[INFO] Downloaded: https://repo.maven.apache.org/maven2/org/apache/maven/scm/maven-scm-provider-accurev/1.7/maven-scm-provider-accurev-1.7.jar (91 KB at 1002.3 KB/sec)
[INFO] Downloaded: https://repo.maven.apache.org/maven2/org/apache/maven/scm/maven-scm-provider-cvs-commons/1.7/maven-scm-provider-cvs-commons-1.7.jar (78 KB at 886.3 KB/sec)
[INFO] Downloading: https://repo.maven.apache.org/maven2/org/apache/maven/scm/maven-scm-provider-starteam/1.7/maven-scm-provider-starteam-1.7.jar
[INFO] Downloading: https://repo.maven.apache.org/maven2/org/apache/maven/scm/maven-scm-provider-synergy/1.7/maven-scm-provider-synergy-1.7.jar
[INFO] Downloaded: https://repo.maven.apache.org/maven2/org/apache/maven/scm/maven-scm-provider-cvsjava/1.7/maven-scm-provider-cvsjava-1.7.jar (43 KB at 428.4 KB/sec)
[INFO] Downloading: https://repo.maven.apache.org/maven2/org/apache/maven/scm/maven-scm-provider-vss/1.7/maven-scm-provider-vss-1.7.jar
[INFO] Downloaded: https://repo.maven.apache.org/maven2/org/apache/maven/scm/maven-scm-provider-hg/1.7/maven-scm-provider-hg-1.7.jar (64 KB at 610.6 KB/sec)
[INFO] Downloading: https://repo.maven.apache.org/maven2/org/apache/maven/scm/maven-scm-provider-tfs/1.7/maven-scm-provider-tfs-1.7.jar
[INFO] Downloaded: https://repo.maven.apache.org/maven2/org/apache/maven/scm/maven-scm-provider-synergy/1.7/maven-scm-provider-synergy-1.7.jar (57 KB at 524.1 KB/sec)
[INFO] Downloading: https://repo.maven.apache.org/maven2/org/apache/maven/scm/maven-scm-provider-integrity/1.7/maven-scm-provider-integrity-1.7.jar
[INFO] Downloaded: https://repo.maven.apache.org/maven2/org/apache/maven/scm/maven-scm-provider-starteam/1.7/maven-scm-provider-starteam-1.7.jar (73 KB at 666.0 KB/sec)
[INFO] Downloading: https://repo.maven.apache.org/maven2/org/apache/maven/scm/maven-scm-provider-jazz/1.7/maven-scm-provider-jazz-1.7.jar
[INFO] Downloaded: https://repo.maven.apache.org/maven2/org/apache/maven/scm/maven-scm-provider-perforce/1.7/maven-scm-provider-perforce-1.7.jar (80 KB at 731.8 KB/sec)
[INFO] Downloading: https://repo.maven.apache.org/maven2/org/apache/maven/scm/maven-scm-manager-plexus/1.7/maven-scm-manager-plexus-1.7.jar
[INFO] Downloaded: https://repo.maven.apache.org/maven2/org/apache/maven/scm/maven-scm-provider-vss/1.7/maven-scm-provider-vss-1.7.jar (67 KB at 553.1 KB/sec)
[INFO] Downloading: https://repo.maven.apache.org/maven2/org/apache/maven/scm/maven-scm-api/1.8.1/maven-scm-api-1.8.1.jar
[INFO] Downloaded: https://repo.maven.apache.org/maven2/org/apache/maven/scm/maven-scm-provider-tfs/1.7/maven-scm-provider-tfs-1.7.jar (41 KB at 338.1 KB/sec)
[INFO] Downloading: https://repo.maven.apache.org/maven2/org/apache/maven/scm/maven-scm-provider-gitexe/1.8.1/maven-scm-provider-gitexe-1.8.1.jar
[INFO] Downloaded: https://repo.maven.apache.org/maven2/org/apache/maven/scm/maven-scm-manager-plexus/1.7/maven-scm-manager-plexus-1.7.jar (11 KB at 81.9 KB/sec)
[INFO] Downloading: https://repo.maven.apache.org/maven2/org/apache/maven/scm/maven-scm-provider-git-commons/1.8.1/maven-scm-provider-git-commons-1.8.1.jar
[INFO] Downloaded: https://repo.maven.apache.org/maven2/org/apache/maven/scm/maven-scm-provider-integrity/1.7/maven-scm-provider-integrity-1.7.jar (76 KB at 597.7 KB/sec)
[INFO] Downloading: https://repo.maven.apache.org/maven2/org/apache/maven/scm/maven-scm-provider-svnexe/1.8.1/maven-scm-provider-svnexe-1.8.1.jar
[INFO] Downloaded: https://repo.maven.apache.org/maven2/org/apache/maven/scm/maven-scm-provider-jazz/1.7/maven-scm-provider-jazz-1.7.jar (64 KB at 493.7 KB/sec)
[INFO] Downloading: https://repo.maven.apache.org/maven2/org/apache/maven/scm/maven-scm-provider-svn-commons/1.8.1/maven-scm-provider-svn-commons-1.8.1.jar
[INFO] Downloaded: https://repo.maven.apache.org/maven2/org/apache/maven/scm/maven-scm-provider-gitexe/1.8.1/maven-scm-provider-gitexe-1.8.1.jar (63 KB at 442.0 KB/sec)
[INFO] Downloaded: https://repo.maven.apache.org/maven2/org/apache/maven/scm/maven-scm-api/1.8.1/maven-scm-api-1.8.1.jar (103 KB at 720.2 KB/sec)
[INFO] Downloaded: https://repo.maven.apache.org/maven2/org/apache/maven/scm/maven-scm-provider-git-commons/1.8.1/maven-scm-provider-git-commons-1.8.1.jar (37 KB at 260.1 KB/sec)
[INFO] Downloaded: https://repo.maven.apache.org/maven2/org/apache/maven/scm/maven-scm-provider-svn-commons/1.8.1/maven-scm-provider-svn-commons-1.8.1.jar (40 KB at 270.5 KB/sec)
[INFO] Downloaded: https://repo.maven.apache.org/maven2/org/apache/maven/scm/maven-scm-provider-svnexe/1.8.1/maven-scm-provider-svnexe-1.8.1.jar (76 KB at 513.7 KB/sec)
[INFO] Downloading: https://repo.maven.apache.org/maven2/org/apache/maven/wagon/wagon-provider-api/2.5/wagon-provider-api-2.5.jar
[INFO] Downloaded: https://repo.maven.apache.org/maven2/org/apache/maven/wagon/wagon-provider-api/2.5/wagon-provider-api-2.5.jar (52 KB at 2449.3 KB/sec)
[INFO] ------------------------------------------------------------------------
[INFO] Reactor Build Order:
[INFO]
[INFO] Tiles Request Framework
[INFO] Tiles request - API
[INFO] Tiles request - Servlet support
[INFO] Tiles Request - Wildcard file loading in Servlets
[INFO] Tiles - Portlet support
[INFO] Tiles - Wildcard file loading in Portlets
[INFO] Tiles Request - JSP support
[INFO] Tiles Request - Freemarker support
[INFO] Tiles Request - Velocity support
[INFO] Tiles request - Mustache support
[INFO] Tiles Request Assembly
[INFO]                                                                        
[INFO] ------------------------------------------------------------------------
[INFO] Building Tiles Request Framework 1.0.8-SNAPSHOT
[INFO] ------------------------------------------------------------------------
[INFO] Downloading: https://repo.maven.apache.org/maven2/org/apache/maven/plugins/maven-enforcer-plugin/1.2/maven-enforcer-plugin-1.2.pom
[INFO] Downloaded: https://repo.maven.apache.org/maven2/org/apache/maven/plugins/maven-enforcer-plugin/1.2/maven-enforcer-plugin-1.2.pom (6 KB at 316.5 KB/sec)
[INFO] Downloading: https://repo.maven.apache.org/maven2/org/apache/maven/enforcer/enforcer/1.2/enforcer-1.2.pom
[INFO] Downloaded: https://repo.maven.apache.org/maven2/org/apache/maven/enforcer/enforcer/1.2/enforcer-1.2.pom (11 KB at 631.1 KB/sec)
[INFO] Downloading: https://repo.maven.apache.org/maven2/org/apache/maven/plugins/maven-enforcer-plugin/1.2/maven-enforcer-plugin-1.2.jar
[INFO] Downloaded: https://repo.maven.apache.org/maven2/org/apache/maven/plugins/maven-enforcer-plugin/1.2/maven-enforcer-plugin-1.2.jar (25 KB at 1380.0 KB/sec)
[INFO] Downloading: https://repo.maven.apache.org/maven2/org/slf4j/slf4j-api/1.5.8/slf4j-api-1.5.8.jar
[INFO] Downloaded: https://repo.maven.apache.org/maven2/org/slf4j/slf4j-api/1.5.8/slf4j-api-1.5.8.jar (23 KB at 954.0 KB/sec)
[INFO]
[INFO] --- maven-clean-plugin:2.5:clean (default-clean) @ tiles-request ---
[INFO]
[INFO] --- maven-enforcer-plugin:1.2:enforce (enforce-java) @ tiles-request ---
[INFO] Downloading: https://repo.maven.apache.org/maven2/org/apache/maven/enforcer/enforcer-api/1.2/enforcer-api-1.2.pom
[INFO] Downloaded: https://repo.maven.apache.org/maven2/org/apache/maven/enforcer/enforcer-api/1.2/enforcer-api-1.2.pom (3 KB at 164.2 KB/sec)
[INFO] Downloading: https://repo.maven.apache.org/maven2/org/apache/maven/enforcer/enforcer-rules/1.2/enforcer-rules-1.2.pom
[INFO] Downloaded: https://repo.maven.apache.org/maven2/org/apache/maven/enforcer/enforcer-rules/1.2/enforcer-rules-1.2.pom (4 KB at 257.5 KB/sec)
[INFO] Downloading: https://repo.maven.apache.org/maven2/org/apache/maven/shared/maven-dependency-tree/2.0/maven-dependency-tree-2.0.pom
[INFO] Downloaded: https://repo.maven.apache.org/maven2/org/apache/maven/shared/maven-dependency-tree/2.0/maven-dependency-tree-2.0.pom (5 KB at 285.2 KB/sec)
[INFO] Downloading: https://repo.maven.apache.org/maven2/org/apache/maven/enforcer/enforcer-api/1.2/enforcer-api-1.2.jar
[INFO] Downloading: https://repo.maven.apache.org/maven2/org/apache/maven/enforcer/enforcer-rules/1.2/enforcer-rules-1.2.jar
[INFO] Downloading: https://repo.maven.apache.org/maven2/org/apache/maven/shared/maven-dependency-tree/2.0/maven-dependency-tree-2.0.jar
[INFO] Downloaded: https://repo.maven.apache.org/maven2/org/apache/maven/enforcer/enforcer-api/1.2/enforcer-api-1.2.jar (10 KB at 560.6 KB/sec)
[INFO] Downloaded: https://repo.maven.apache.org/maven2/org/apache/maven/shared/maven-dependency-tree/2.0/maven-dependency-tree-2.0.jar (55 KB at 2104.6 KB/sec)
[INFO] Downloaded: https://repo.maven.apache.org/maven2/org/apache/maven/enforcer/enforcer-rules/1.2/enforcer-rules-1.2.jar (75 KB at 2660.1 KB/sec)
[WARNING] Rule 0: org.apache.maven.plugins.enforcer.RequireJavaVersion failed with message:
Detected JDK Version: 1.8.0-144 is not in the allowed range [1.7.0-45,1.8).
[INFO] ------------------------------------------------------------------------
[INFO] Reactor Summary:
[INFO]
[INFO] Tiles Request Framework ............................ FAILURE [  3.763 s]
[INFO] Tiles request - API ................................ SKIPPED
[INFO] Tiles request - Servlet support .................... SKIPPED
[INFO] Tiles Request - Wildcard file loading in Servlets .. SKIPPED
[INFO] Tiles - Portlet support ............................ SKIPPED
[INFO] Tiles - Wildcard file loading in Portlets .......... SKIPPED
[INFO] Tiles Request - JSP support ........................ SKIPPED
[INFO] Tiles Request - Freemarker support ................. SKIPPED
[INFO] Tiles Request - Velocity support ................... SKIPPED
[INFO] Tiles request - Mustache support ................... SKIPPED
[INFO] Tiles Request Assembly ............................. SKIPPED
[INFO] ------------------------------------------------------------------------
[INFO] BUILD FAILURE
[INFO] ------------------------------------------------------------------------
[INFO] Total time: 17.500 s
[INFO] Finished at: 2017-09-04T11:38:53+00:00
[INFO] Final Memory: 21M/381M
[INFO] ------------------------------------------------------------------------
Waiting for Jenkins to finish collecting data
[ERROR] Failed to execute goal org.apache.maven.plugins:maven-enforcer-plugin:1.2:enforce (enforce-java) on project tiles-request: Some Enforcer rules have failed. Look above for specific messages explaining why the rule failed. -> [Help 1]
[ERROR]
[ERROR] To see the full stack trace of the errors, re-run Maven with the -e switch.
[ERROR] Re-run Maven using the -X switch to enable full debug logging.
[ERROR]
[ERROR] For more information about the errors and possible solutions, please read the following articles:
[ERROR] [Help 1] http://cwiki.apache.org/confluence/display/MAVEN/MojoExecutionException
[JENKINS] Archiving <https://builds.apache.org/job/Tiles-Request-1.0.x/ws/assembly/pom.xml> to org.apache.tiles/tiles-request-assembly/1.0.8-SNAPSHOT/tiles-request-assembly-1.0.8-SNAPSHOT.pom
[JENKINS] Archiving <https://builds.apache.org/job/Tiles-Request-1.0.x/ws/pom.xml> to org.apache.tiles/tiles-request/1.0.8-SNAPSHOT/tiles-request-1.0.8-SNAPSHOT.pom
[JENKINS] Archiving <https://builds.apache.org/job/Tiles-Request-1.0.x/ws/tiles-request-velocity/pom.xml> to org.apache.tiles/tiles-request-velocity/1.0.8-SNAPSHOT/tiles-request-velocity-1.0.8-SNAPSHOT.pom
[JENKINS] Archiving <https://builds.apache.org/job/Tiles-Request-1.0.x/ws/tiles-request-freemarker/pom.xml> to org.apache.tiles/tiles-request-freemarker/1.0.8-SNAPSHOT/tiles-request-freemarker-1.0.8-SNAPSHOT.pom
[JENKINS] Archiving <https://builds.apache.org/job/Tiles-Request-1.0.x/ws/tiles-request-servlet-wildcard/pom.xml> to org.apache.tiles/tiles-request-servlet-wildcard/1.0.8-SNAPSHOT/tiles-request-servlet-wildcard-1.0.8-SNAPSHOT.pom
[JENKINS] Archiving <https://builds.apache.org/job/Tiles-Request-1.0.x/ws/tiles-request-mustache/pom.xml> to org.apache.tiles/tiles-request-mustache/1.0.8-SNAPSHOT/tiles-request-mustache-1.0.8-SNAPSHOT.pom
[JENKINS] Archiving <https://builds.apache.org/job/Tiles-Request-1.0.x/ws/tiles-request-jsp/pom.xml> to org.apache.tiles/tiles-request-jsp/1.0.8-SNAPSHOT/tiles-request-jsp-1.0.8-SNAPSHOT.pom
[JENKINS] Archiving <https://builds.apache.org/job/Tiles-Request-1.0.x/ws/tiles-request-servlet/pom.xml> to org.apache.tiles/tiles-request-servlet/1.0.8-SNAPSHOT/tiles-request-servlet-1.0.8-SNAPSHOT.pom
[JENKINS] Archiving <https://builds.apache.org/job/Tiles-Request-1.0.x/ws/tiles-request-portlet-wildcard/pom.xml> to org.apache.tiles/tiles-request-portlet-wildcard/1.0.8-SNAPSHOT/tiles-request-portlet-wildcard-1.0.8-SNAPSHOT.pom
[JENKINS] Archiving <https://builds.apache.org/job/Tiles-Request-1.0.x/ws/tiles-request-api/pom.xml> to org.apache.tiles/tiles-request-api/1.0.8-SNAPSHOT/tiles-request-api-1.0.8-SNAPSHOT.pom
[JENKINS] Archiving <https://builds.apache.org/job/Tiles-Request-1.0.x/ws/tiles-request-portlet/pom.xml> to org.apache.tiles/tiles-request-portlet/1.0.8-SNAPSHOT/tiles-request-portlet-1.0.8-SNAPSHOT.pom
channel stopped
Reply | Threaded
Open this post in threaded view
|

Build failed in Jenkins: Tiles-Request-1.0.x #25

Apache Jenkins Server-2
See <https://builds.apache.org/job/Tiles-Request-1.0.x/25/display/redirect>

------------------------------------------
Started by an SCM change
[EnvInject] - Loading node environment variables.
Building remotely on H25 (couchdbtest ubuntu xenial) in workspace <https://builds.apache.org/job/Tiles-Request-1.0.x/ws/>
Updating https://svn.apache.org/repos/asf/tiles/request/branches/TREQ_1_0_X at revision '2017-09-04T11:45:49.270 +0000'
At revision 1807211

No changes for https://svn.apache.org/repos/asf/tiles/request/branches/TREQ_1_0_X since the previous build
Parsing POMs
Established TCP socket on 36130
maven35-agent.jar already up to date
maven35-interceptor.jar already up to date
maven3-interceptor-commons.jar already up to date
[Tiles-Request-1.0.x] $ /home/jenkins/tools/java/latest1.7/bin/java -Xmx2g -Xms256m -cp /home/jenkins/jenkins-slave/maven35-agent.jar:/home/jenkins/tools/maven/latest3/boot/plexus-classworlds-2.5.2.jar:/home/jenkins/tools/maven/latest3/conf/logging jenkins.maven3.agent.Maven35Main /home/jenkins/tools/maven/latest3/ /home/jenkins/jenkins-slave/slave.jar /home/jenkins/jenkins-slave/maven35-interceptor.jar /home/jenkins/jenkins-slave/maven3-interceptor-commons.jar 36130
<===[JENKINS REMOTING CAPACITY]===>   channel started
ERROR: ================================================================================
ERROR: Invalid project setup: jenkins/security/MasterToSlaveCallable : Unsupported major.minor version 52.0
ERROR: [JENKINS-18403][JENKINS-28294] JDK 'JDK 1.7 (latest)' not supported to run Maven projects.
ERROR: Maven projects have to be launched with a Java version greater or equal to the minimum version required by the master.
ERROR: Use the Maven JDK Toolchains (plugin) to build your maven project with an older JDK.
ERROR: Retrying with slave Java and setting compile/test properties to point to /home/jenkins/tools/java/latest1.7.
ERROR: ================================================================================
Established TCP socket on 39267
maven35-agent.jar already up to date
maven35-interceptor.jar already up to date
maven3-interceptor-commons.jar already up to date
[Tiles-Request-1.0.x] $ /usr/local/asfpackages/java/jdk1.8.0_131/jre/bin/java -Xmx2g -Xms256m -cp /home/jenkins/jenkins-slave/maven35-agent.jar:/home/jenkins/tools/maven/latest3/boot/plexus-classworlds-2.5.2.jar:/home/jenkins/tools/maven/latest3/conf/logging jenkins.maven3.agent.Maven35Main /home/jenkins/tools/maven/latest3/ /home/jenkins/jenkins-slave/slave.jar /home/jenkins/jenkins-slave/maven35-interceptor.jar /home/jenkins/jenkins-slave/maven3-interceptor-commons.jar 39267
<===[JENKINS REMOTING CAPACITY]===>   channel started
Executing Maven:  -B -f <https://builds.apache.org/job/Tiles-Request-1.0.x/ws/pom.xml> -Dmaven.repo.local=/home/jenkins/jenkins-slave/maven-repositories/1 clean install
[INFO] Scanning for projects...
[INFO] ------------------------------------------------------------------------
[INFO] Reactor Build Order:
[INFO]
[INFO] Tiles Request Framework
[INFO] Tiles request - API
[INFO] Tiles request - Servlet support
[INFO] Tiles Request - Wildcard file loading in Servlets
[INFO] Tiles - Portlet support
[INFO] Tiles - Wildcard file loading in Portlets
[INFO] Tiles Request - JSP support
[INFO] Tiles Request - Freemarker support
[INFO] Tiles Request - Velocity support
[INFO] Tiles request - Mustache support
[INFO] Tiles Request Assembly
[INFO]
[INFO] ------------------------------------------------------------------------
[INFO] Building Tiles Request Framework 1.0.8-SNAPSHOT
[INFO] ------------------------------------------------------------------------
[INFO]
[INFO] --- maven-clean-plugin:2.5:clean (default-clean) @ tiles-request ---
[INFO]
[INFO] --- maven-enforcer-plugin:1.2:enforce (enforce-java) @ tiles-request ---
[WARNING] Rule 0: org.apache.maven.plugins.enforcer.RequireJavaVersion failed with message:
Detected JDK Version: 1.8.0-131 is not in the allowed range [1.7.0-45,1.8).
[INFO] ------------------------------------------------------------------------
[INFO] Reactor Summary:
[INFO]
[INFO] Tiles Request Framework ............................ FAILURE [  3.985 s]
[INFO] Tiles request - API ................................ SKIPPED
[INFO] Tiles request - Servlet support .................... SKIPPED
[INFO] Tiles Request - Wildcard file loading in Servlets .. SKIPPED
[INFO] Tiles - Portlet support ............................ SKIPPED
[INFO] Tiles - Wildcard file loading in Portlets .......... SKIPPED
[INFO] Tiles Request - JSP support ........................ SKIPPED
[INFO] Tiles Request - Freemarker support ................. SKIPPED
[INFO] Tiles Request - Velocity support ................... SKIPPED
[INFO] Tiles request - Mustache support ................... SKIPPED
[INFO] Tiles Request Assembly ............................. SKIPPED
[INFO] ------------------------------------------------------------------------
[INFO] BUILD FAILURE
[INFO] ------------------------------------------------------------------------
[INFO] Total time: 17.758 s
[INFO] Finished at: 2017-09-04T11:46:35Z
[INFO] Final Memory: 16M/289M
[INFO] ------------------------------------------------------------------------
Waiting for Jenkins to finish collecting data
[ERROR] Failed to execute goal org.apache.maven.plugins:maven-enforcer-plugin:1.2:enforce (enforce-java) on project tiles-request: Some Enforcer rules have failed. Look above for specific messages explaining why the rule failed. -> [Help 1]
[ERROR]
[ERROR] To see the full stack trace of the errors, re-run Maven with the -e switch.
[ERROR] Re-run Maven using the -X switch to enable full debug logging.
[ERROR]
[ERROR] For more information about the errors and possible solutions, please read the following articles:
[ERROR] [Help 1] http://cwiki.apache.org/confluence/display/MAVEN/MojoExecutionException
[JENKINS] Archiving <https://builds.apache.org/job/Tiles-Request-1.0.x/ws/assembly/pom.xml> to org.apache.tiles/tiles-request-assembly/1.0.8-SNAPSHOT/tiles-request-assembly-1.0.8-SNAPSHOT.pom
[JENKINS] Archiving <https://builds.apache.org/job/Tiles-Request-1.0.x/ws/pom.xml> to org.apache.tiles/tiles-request/1.0.8-SNAPSHOT/tiles-request-1.0.8-SNAPSHOT.pom
[JENKINS] Archiving <https://builds.apache.org/job/Tiles-Request-1.0.x/ws/tiles-request-velocity/pom.xml> to org.apache.tiles/tiles-request-velocity/1.0.8-SNAPSHOT/tiles-request-velocity-1.0.8-SNAPSHOT.pom
[JENKINS] Archiving <https://builds.apache.org/job/Tiles-Request-1.0.x/ws/tiles-request-freemarker/pom.xml> to org.apache.tiles/tiles-request-freemarker/1.0.8-SNAPSHOT/tiles-request-freemarker-1.0.8-SNAPSHOT.pom
[JENKINS] Archiving <https://builds.apache.org/job/Tiles-Request-1.0.x/ws/tiles-request-servlet-wildcard/pom.xml> to org.apache.tiles/tiles-request-servlet-wildcard/1.0.8-SNAPSHOT/tiles-request-servlet-wildcard-1.0.8-SNAPSHOT.pom
[JENKINS] Archiving <https://builds.apache.org/job/Tiles-Request-1.0.x/ws/tiles-request-mustache/pom.xml> to org.apache.tiles/tiles-request-mustache/1.0.8-SNAPSHOT/tiles-request-mustache-1.0.8-SNAPSHOT.pom
[JENKINS] Archiving <https://builds.apache.org/job/Tiles-Request-1.0.x/ws/tiles-request-jsp/pom.xml> to org.apache.tiles/tiles-request-jsp/1.0.8-SNAPSHOT/tiles-request-jsp-1.0.8-SNAPSHOT.pom
[JENKINS] Archiving <https://builds.apache.org/job/Tiles-Request-1.0.x/ws/tiles-request-servlet/pom.xml> to org.apache.tiles/tiles-request-servlet/1.0.8-SNAPSHOT/tiles-request-servlet-1.0.8-SNAPSHOT.pom
[JENKINS] Archiving <https://builds.apache.org/job/Tiles-Request-1.0.x/ws/tiles-request-portlet-wildcard/pom.xml> to org.apache.tiles/tiles-request-portlet-wildcard/1.0.8-SNAPSHOT/tiles-request-portlet-wildcard-1.0.8-SNAPSHOT.pom
[JENKINS] Archiving <https://builds.apache.org/job/Tiles-Request-1.0.x/ws/tiles-request-api/pom.xml> to org.apache.tiles/tiles-request-api/1.0.8-SNAPSHOT/tiles-request-api-1.0.8-SNAPSHOT.pom
[JENKINS] Archiving <https://builds.apache.org/job/Tiles-Request-1.0.x/ws/tiles-request-portlet/pom.xml> to org.apache.tiles/tiles-request-portlet/1.0.8-SNAPSHOT/tiles-request-portlet-1.0.8-SNAPSHOT.pom
channel stopped
Reply | Threaded
Open this post in threaded view
|

Build failed in Jenkins: Tiles-Request-1.0.x #26

Apache Jenkins Server-2
See <https://builds.apache.org/job/Tiles-Request-1.0.x/26/display/redirect>

------------------------------------------
Started by an SCM change
[EnvInject] - Loading node environment variables.
Building remotely on H25 (couchdbtest ubuntu xenial) in workspace <https://builds.apache.org/job/Tiles-Request-1.0.x/ws/>
Updating https://svn.apache.org/repos/asf/tiles/request/branches/TREQ_1_0_X at revision '2017-09-04T11:48:07.096 +0000'
At revision 1807211

No changes for https://svn.apache.org/repos/asf/tiles/request/branches/TREQ_1_0_X since the previous build
Parsing POMs
Established TCP socket on 41684
maven35-agent.jar already up to date
maven35-interceptor.jar already up to date
maven3-interceptor-commons.jar already up to date
[Tiles-Request-1.0.x] $ /home/jenkins/tools/java/jdk1.7.0_79-unlimited-security/bin/java -Xmx2g -Xms256m -cp /home/jenkins/jenkins-slave/maven35-agent.jar:/home/jenkins/tools/maven/latest3/boot/plexus-classworlds-2.5.2.jar:/home/jenkins/tools/maven/latest3/conf/logging jenkins.maven3.agent.Maven35Main /home/jenkins/tools/maven/latest3/ /home/jenkins/jenkins-slave/slave.jar /home/jenkins/jenkins-slave/maven35-interceptor.jar /home/jenkins/jenkins-slave/maven3-interceptor-commons.jar 41684
<===[JENKINS REMOTING CAPACITY]===>   channel started
ERROR: ================================================================================
ERROR: Invalid project setup: jenkins/security/MasterToSlaveCallable : Unsupported major.minor version 52.0
ERROR: [JENKINS-18403][JENKINS-28294] JDK 'jdk-1.7.0_79 (unlimited security)' not supported to run Maven projects.
ERROR: Maven projects have to be launched with a Java version greater or equal to the minimum version required by the master.
ERROR: Use the Maven JDK Toolchains (plugin) to build your maven project with an older JDK.
ERROR: Retrying with slave Java and setting compile/test properties to point to /home/jenkins/tools/java/jdk1.7.0_79-unlimited-security.
ERROR: ================================================================================
Established TCP socket on 40140
maven35-agent.jar already up to date
maven35-interceptor.jar already up to date
maven3-interceptor-commons.jar already up to date
[Tiles-Request-1.0.x] $ /usr/local/asfpackages/java/jdk1.8.0_131/jre/bin/java -Xmx2g -Xms256m -cp /home/jenkins/jenkins-slave/maven35-agent.jar:/home/jenkins/tools/maven/latest3/boot/plexus-classworlds-2.5.2.jar:/home/jenkins/tools/maven/latest3/conf/logging jenkins.maven3.agent.Maven35Main /home/jenkins/tools/maven/latest3/ /home/jenkins/jenkins-slave/slave.jar /home/jenkins/jenkins-slave/maven35-interceptor.jar /home/jenkins/jenkins-slave/maven3-interceptor-commons.jar 40140
<===[JENKINS REMOTING CAPACITY]===>   channel started
Executing Maven:  -B -f <https://builds.apache.org/job/Tiles-Request-1.0.x/ws/pom.xml> -Dmaven.repo.local=/home/jenkins/jenkins-slave/maven-repositories/1 clean install
[INFO] Scanning for projects...
[INFO] ------------------------------------------------------------------------
[INFO] Reactor Build Order:
[INFO]
[INFO] Tiles Request Framework
[INFO] Tiles request - API
[INFO] Tiles request - Servlet support
[INFO] Tiles Request - Wildcard file loading in Servlets
[INFO] Tiles - Portlet support
[INFO] Tiles - Wildcard file loading in Portlets
[INFO] Tiles Request - JSP support
[INFO] Tiles Request - Freemarker support
[INFO] Tiles Request - Velocity support
[INFO] Tiles request - Mustache support
[INFO] Tiles Request Assembly
[INFO]
[INFO] ------------------------------------------------------------------------
[INFO] Building Tiles Request Framework 1.0.8-SNAPSHOT
[INFO] ------------------------------------------------------------------------
[INFO]
[INFO] --- maven-clean-plugin:2.5:clean (default-clean) @ tiles-request ---
[INFO]
[INFO] --- maven-enforcer-plugin:1.2:enforce (enforce-java) @ tiles-request ---
[WARNING] Rule 0: org.apache.maven.plugins.enforcer.RequireJavaVersion failed with message:
Detected JDK Version: 1.8.0-131 is not in the allowed range [1.7.0-45,1.8).
[INFO] ------------------------------------------------------------------------
[INFO] Reactor Summary:
[INFO]
[INFO] Tiles Request Framework ............................ FAILURE [  3.542 s]
[INFO] Tiles request - API ................................ SKIPPED
[INFO] Tiles request - Servlet support .................... SKIPPED
[INFO] Tiles Request - Wildcard file loading in Servlets .. SKIPPED
[INFO] Tiles - Portlet support ............................ SKIPPED
[INFO] Tiles - Wildcard file loading in Portlets .......... SKIPPED
[INFO] Tiles Request - JSP support ........................ SKIPPED
[INFO] Tiles Request - Freemarker support ................. SKIPPED
[INFO] Tiles Request - Velocity support ................... SKIPPED
[INFO] Tiles request - Mustache support ................... SKIPPED
[INFO] Tiles Request Assembly ............................. SKIPPED
[INFO] ------------------------------------------------------------------------
[INFO] BUILD FAILURE
[INFO] ------------------------------------------------------------------------
[INFO] Total time: 17.432 s
[INFO] Finished at: 2017-09-04T11:49:06Z
[INFO] Final Memory: 18M/293M
[INFO] ------------------------------------------------------------------------
[ERROR] Failed to execute goal org.apache.maven.plugins:maven-enforcer-plugin:1.2:enforce (enforce-java) on project tiles-request: Some Enforcer rules have failed. Look above for specific messages explaining why the rule failed. -> [Help 1]
[ERROR]
[ERROR] To see the full stack trace of the errors, re-run Maven with the -e switch.
[ERROR] Re-run Maven using the -X switch to enable full debug logging.
[ERROR]
[ERROR] For more information about the errors and possible solutions, please read the following articles:
[ERROR] [Help 1] http://cwiki.apache.org/confluence/display/MAVEN/MojoExecutionException
[JENKINS] Archiving <https://builds.apache.org/job/Tiles-Request-1.0.x/ws/assembly/pom.xml> to org.apache.tiles/tiles-request-assembly/1.0.8-SNAPSHOT/tiles-request-assembly-1.0.8-SNAPSHOT.pom
[JENKINS] Archiving <https://builds.apache.org/job/Tiles-Request-1.0.x/ws/pom.xml> to org.apache.tiles/tiles-request/1.0.8-SNAPSHOT/tiles-request-1.0.8-SNAPSHOT.pom
[JENKINS] Archiving <https://builds.apache.org/job/Tiles-Request-1.0.x/ws/tiles-request-velocity/pom.xml> to org.apache.tiles/tiles-request-velocity/1.0.8-SNAPSHOT/tiles-request-velocity-1.0.8-SNAPSHOT.pom
[JENKINS] Archiving <https://builds.apache.org/job/Tiles-Request-1.0.x/ws/tiles-request-freemarker/pom.xml> to org.apache.tiles/tiles-request-freemarker/1.0.8-SNAPSHOT/tiles-request-freemarker-1.0.8-SNAPSHOT.pom
[JENKINS] Archiving <https://builds.apache.org/job/Tiles-Request-1.0.x/ws/tiles-request-servlet-wildcard/pom.xml> to org.apache.tiles/tiles-request-servlet-wildcard/1.0.8-SNAPSHOT/tiles-request-servlet-wildcard-1.0.8-SNAPSHOT.pom
[JENKINS] Archiving <https://builds.apache.org/job/Tiles-Request-1.0.x/ws/tiles-request-mustache/pom.xml> to org.apache.tiles/tiles-request-mustache/1.0.8-SNAPSHOT/tiles-request-mustache-1.0.8-SNAPSHOT.pom
[JENKINS] Archiving <https://builds.apache.org/job/Tiles-Request-1.0.x/ws/tiles-request-jsp/pom.xml> to org.apache.tiles/tiles-request-jsp/1.0.8-SNAPSHOT/tiles-request-jsp-1.0.8-SNAPSHOT.pom
[JENKINS] Archiving <https://builds.apache.org/job/Tiles-Request-1.0.x/ws/tiles-request-servlet/pom.xml> to org.apache.tiles/tiles-request-servlet/1.0.8-SNAPSHOT/tiles-request-servlet-1.0.8-SNAPSHOT.pom
[JENKINS] Archiving <https://builds.apache.org/job/Tiles-Request-1.0.x/ws/tiles-request-portlet-wildcard/pom.xml> to org.apache.tiles/tiles-request-portlet-wildcard/1.0.8-SNAPSHOT/tiles-request-portlet-wildcard-1.0.8-SNAPSHOT.pom
[JENKINS] Archiving <https://builds.apache.org/job/Tiles-Request-1.0.x/ws/tiles-request-api/pom.xml> to org.apache.tiles/tiles-request-api/1.0.8-SNAPSHOT/tiles-request-api-1.0.8-SNAPSHOT.pom
[JENKINS] Archiving <https://builds.apache.org/job/Tiles-Request-1.0.x/ws/tiles-request-portlet/pom.xml> to org.apache.tiles/tiles-request-portlet/1.0.8-SNAPSHOT/tiles-request-portlet-1.0.8-SNAPSHOT.pom
channel stopped
Reply | Threaded
Open this post in threaded view
|

Build failed in Jenkins: Tiles-Request-1.0.x #27

Apache Jenkins Server-2
See <https://builds.apache.org/job/Tiles-Request-1.0.x/27/display/redirect>

------------------------------------------
[...truncated 40.47 KB...]
Parsing POMs
Downloaded artifact http://repo.maven.apache.org/maven2/org/apache/tiles/tiles-master/6/tiles-master-6.pom
Established TCP socket on 64845
maven35-agent.jar already up to date
maven35-interceptor.jar already up to date
maven3-interceptor-commons.jar already up to date
[Tiles-Request-1.0.x] $ f:\\jenkins\\tools\\java\\latest1.7/bin/java -Xmx2g -Xms256m -cp f:\jenkins\jenkins-slave\maven35-agent.jar;f:\jenkins\tools\maven\latest3\boot\plexus-classworlds-2.5.2.jar;f:\\jenkins\\tools\\maven\\latest3/conf/logging jenkins.maven3.agent.Maven35Main f:\\jenkins\\tools\\maven\\latest3 F:\jenkins\jenkins-slave\slave.jar f:\jenkins\jenkins-slave\maven35-interceptor.jar f:\jenkins\jenkins-slave\maven3-interceptor-commons.jar 64845
<===[JENKINS REMOTING CAPACITY]===>   channel started
ERROR: ================================================================================
ERROR: Invalid project setup: jenkins/security/MasterToSlaveCallable : Unsupported major.minor version 52.0
ERROR: [JENKINS-18403][JENKINS-28294] JDK 'JDK 1.7 (latest)' not supported to run Maven projects.
ERROR: Maven projects have to be launched with a Java version greater or equal to the minimum version required by the master.
ERROR: Use the Maven JDK Toolchains (plugin) to build your maven project with an older JDK.
ERROR: Retrying with slave Java and setting compile/test properties to point to f:\\jenkins\\tools\\java\\latest1.7.
ERROR: ================================================================================
Established TCP socket on 64849
maven35-agent.jar already up to date
maven35-interceptor.jar already up to date
maven3-interceptor-commons.jar already up to date
[Tiles-Request-1.0.x] $ "C:\Program Files\Java\jre1.8.0_121/bin/java" -Xmx2g -Xms256m -cp f:\jenkins\jenkins-slave\maven35-agent.jar;f:\jenkins\tools\maven\latest3\boot\plexus-classworlds-2.5.2.jar;f:\\jenkins\\tools\\maven\\latest3/conf/logging jenkins.maven3.agent.Maven35Main f:\\jenkins\\tools\\maven\\latest3 F:\jenkins\jenkins-slave\slave.jar f:\jenkins\jenkins-slave\maven35-interceptor.jar f:\jenkins\jenkins-slave\maven3-interceptor-commons.jar 64849
<===[JENKINS REMOTING CAPACITY]===>   channel started
Executing Maven:  -B -f <https://builds.apache.org/job/Tiles-Request-1.0.x/ws/pom.xml> -Dmaven.repo.local=f:\jenkins\jenkins-slave\maven-repositories\0 clean install
[INFO] Scanning for projects...
[INFO] Downloading: https://repo.maven.apache.org/maven2/org/apache/maven/plugins/maven-scm-publish-plugin/1.0-beta-2/maven-scm-publish-plugin-1.0-beta-2.pom
[INFO] Downloaded: https://repo.maven.apache.org/maven2/org/apache/maven/plugins/maven-scm-publish-plugin/1.0-beta-2/maven-scm-publish-plugin-1.0-beta-2.pom (6.7 kB at 15 kB/s)
[INFO] Downloading: https://repo.maven.apache.org/maven2/org/apache/maven/release/maven-release-manager/2.3.2/maven-release-manager-2.3.2.pom
[INFO] Downloaded: https://repo.maven.apache.org/maven2/org/apache/maven/release/maven-release-manager/2.3.2/maven-release-manager-2.3.2.pom (9.7 kB at 540 kB/s)
[INFO] Downloading: https://repo.maven.apache.org/maven2/org/apache/maven/release/maven-release/2.3.2/maven-release-2.3.2.pom
[INFO] Downloaded: https://repo.maven.apache.org/maven2/org/apache/maven/release/maven-release/2.3.2/maven-release-2.3.2.pom (8.6 kB at 616 kB/s)
[INFO] Downloading: https://repo.maven.apache.org/maven2/org/apache/maven/scm/maven-scm-providers-standard/1.7/maven-scm-providers-standard-1.7.pom
[INFO] Downloaded: https://repo.maven.apache.org/maven2/org/apache/maven/scm/maven-scm-providers-standard/1.7/maven-scm-providers-standard-1.7.pom (3.9 kB at 358 kB/s)
[INFO] Downloading: https://repo.maven.apache.org/maven2/org/apache/maven/scm/maven-scm-providers/1.7/maven-scm-providers-1.7.pom
[INFO] Downloaded: https://repo.maven.apache.org/maven2/org/apache/maven/scm/maven-scm-providers/1.7/maven-scm-providers-1.7.pom (3.7 kB at 340 kB/s)
[INFO] Downloading: https://repo.maven.apache.org/maven2/org/apache/maven/scm/maven-scm/1.7/maven-scm-1.7.pom
[INFO] Downloaded: https://repo.maven.apache.org/maven2/org/apache/maven/scm/maven-scm/1.7/maven-scm-1.7.pom (18 kB at 1.2 MB/s)
[INFO] Downloading: https://repo.maven.apache.org/maven2/org/apache/maven/scm/maven-scm-provider-accurev/1.7/maven-scm-provider-accurev-1.7.pom
[INFO] Downloaded: https://repo.maven.apache.org/maven2/org/apache/maven/scm/maven-scm-provider-accurev/1.7/maven-scm-provider-accurev-1.7.pom (3.3 kB at 328 kB/s)
[INFO] Downloading: https://repo.maven.apache.org/maven2/org/apache/maven/scm/maven-scm-api/1.7/maven-scm-api-1.7.pom
[INFO] Downloaded: https://repo.maven.apache.org/maven2/org/apache/maven/scm/maven-scm-api/1.7/maven-scm-api-1.7.pom (1.6 kB at 175 kB/s)
[INFO] Downloading: https://repo.maven.apache.org/maven2/org/apache/maven/scm/maven-scm-provider-bazaar/1.7/maven-scm-provider-bazaar-1.7.pom
[INFO] Downloaded: https://repo.maven.apache.org/maven2/org/apache/maven/scm/maven-scm-provider-bazaar/1.7/maven-scm-provider-bazaar-1.7.pom (2.1 kB at 228 kB/s)
[INFO] Downloading: https://repo.maven.apache.org/maven2/org/apache/maven/scm/maven-scm-provider-clearcase/1.7/maven-scm-provider-clearcase-1.7.pom
[INFO] Downloaded: https://repo.maven.apache.org/maven2/org/apache/maven/scm/maven-scm-provider-clearcase/1.7/maven-scm-provider-clearcase-1.7.pom (2.7 kB at 340 kB/s)
[INFO] Downloading: https://repo.maven.apache.org/maven2/org/apache/maven/scm/maven-scm-provider-cvsexe/1.7/maven-scm-provider-cvsexe-1.7.pom
[INFO] Downloaded: https://repo.maven.apache.org/maven2/org/apache/maven/scm/maven-scm-provider-cvsexe/1.7/maven-scm-provider-cvsexe-1.7.pom (2.7 kB at 268 kB/s)
[INFO] Downloading: https://repo.maven.apache.org/maven2/org/apache/maven/scm/maven-scm-providers-cvs/1.7/maven-scm-providers-cvs-1.7.pom
[INFO] Downloaded: https://repo.maven.apache.org/maven2/org/apache/maven/scm/maven-scm-providers-cvs/1.7/maven-scm-providers-cvs-1.7.pom (1.7 kB at 190 kB/s)
[INFO] Downloading: https://repo.maven.apache.org/maven2/org/apache/maven/scm/maven-scm-provider-cvs-commons/1.7/maven-scm-provider-cvs-commons-1.7.pom
[INFO] Downloaded: https://repo.maven.apache.org/maven2/org/apache/maven/scm/maven-scm-provider-cvs-commons/1.7/maven-scm-provider-cvs-commons-1.7.pom (2.4 kB at 270 kB/s)
[INFO] Downloading: https://repo.maven.apache.org/maven2/org/apache/maven/scm/maven-scm-provider-cvsjava/1.7/maven-scm-provider-cvsjava-1.7.pom
[INFO] Downloaded: https://repo.maven.apache.org/maven2/org/apache/maven/scm/maven-scm-provider-cvsjava/1.7/maven-scm-provider-cvsjava-1.7.pom (2.6 kB at 261 kB/s)
[INFO] Downloading: https://repo.maven.apache.org/maven2/org/apache/maven/scm/maven-scm-provider-gitexe/1.7/maven-scm-provider-gitexe-1.7.pom
[INFO] Downloaded: https://repo.maven.apache.org/maven2/org/apache/maven/scm/maven-scm-provider-gitexe/1.7/maven-scm-provider-gitexe-1.7.pom (2.4 kB at 299 kB/s)
[INFO] Downloading: https://repo.maven.apache.org/maven2/org/apache/maven/scm/maven-scm-providers-git/1.7/maven-scm-providers-git-1.7.pom
[INFO] Downloaded: https://repo.maven.apache.org/maven2/org/apache/maven/scm/maven-scm-providers-git/1.7/maven-scm-providers-git-1.7.pom (2.2 kB at 221 kB/s)
[INFO] Downloading: https://repo.maven.apache.org/maven2/org/apache/maven/scm/maven-scm-provider-git-commons/1.7/maven-scm-provider-git-commons-1.7.pom
[INFO] Downloaded: https://repo.maven.apache.org/maven2/org/apache/maven/scm/maven-scm-provider-git-commons/1.7/maven-scm-provider-git-commons-1.7.pom (2.3 kB at 251 kB/s)
[INFO] Downloading: https://repo.maven.apache.org/maven2/org/apache/maven/scm/maven-scm-provider-hg/1.7/maven-scm-provider-hg-1.7.pom
[INFO] Downloaded: https://repo.maven.apache.org/maven2/org/apache/maven/scm/maven-scm-provider-hg/1.7/maven-scm-provider-hg-1.7.pom (2.4 kB at 272 kB/s)
[INFO] Downloading: https://repo.maven.apache.org/maven2/org/apache/maven/scm/maven-scm-provider-perforce/1.7/maven-scm-provider-perforce-1.7.pom
[INFO] Downloaded: https://repo.maven.apache.org/maven2/org/apache/maven/scm/maven-scm-provider-perforce/1.7/maven-scm-provider-perforce-1.7.pom (2.6 kB at 329 kB/s)
[INFO] Downloading: https://repo.maven.apache.org/maven2/org/apache/maven/scm/maven-scm-provider-starteam/1.7/maven-scm-provider-starteam-1.7.pom
[INFO] Downloaded: https://repo.maven.apache.org/maven2/org/apache/maven/scm/maven-scm-provider-starteam/1.7/maven-scm-provider-starteam-1.7.pom (2.6 kB at 322 kB/s)
[INFO] Downloading: https://repo.maven.apache.org/maven2/org/apache/maven/scm/maven-scm-provider-svnexe/1.7/maven-scm-provider-svnexe-1.7.pom
[INFO] Downloaded: https://repo.maven.apache.org/maven2/org/apache/maven/scm/maven-scm-provider-svnexe/1.7/maven-scm-provider-svnexe-1.7.pom (2.5 kB at 313 kB/s)
[INFO] Downloading: https://repo.maven.apache.org/maven2/org/apache/maven/scm/maven-scm-providers-svn/1.7/maven-scm-providers-svn-1.7.pom
[INFO] Downloaded: https://repo.maven.apache.org/maven2/org/apache/maven/scm/maven-scm-providers-svn/1.7/maven-scm-providers-svn-1.7.pom (2.1 kB at 193 kB/s)
[INFO] Downloading: https://repo.maven.apache.org/maven2/org/apache/maven/scm/maven-scm-provider-svn-commons/1.7/maven-scm-provider-svn-commons-1.7.pom
[INFO] Downloaded: https://repo.maven.apache.org/maven2/org/apache/maven/scm/maven-scm-provider-svn-commons/1.7/maven-scm-provider-svn-commons-1.7.pom (2.7 kB at 338 kB/s)
[INFO] Downloading: https://repo.maven.apache.org/maven2/org/apache/maven/scm/maven-scm-provider-synergy/1.7/maven-scm-provider-synergy-1.7.pom
[INFO] Downloaded: https://repo.maven.apache.org/maven2/org/apache/maven/scm/maven-scm-provider-synergy/1.7/maven-scm-provider-synergy-1.7.pom (2.0 kB at 67 kB/s)
[INFO] Downloading: https://repo.maven.apache.org/maven2/org/apache/maven/scm/maven-scm-provider-vss/1.7/maven-scm-provider-vss-1.7.pom
[INFO] Downloaded: https://repo.maven.apache.org/maven2/org/apache/maven/scm/maven-scm-provider-vss/1.7/maven-scm-provider-vss-1.7.pom (2.6 kB at 285 kB/s)
[INFO] Downloading: https://repo.maven.apache.org/maven2/org/apache/maven/scm/maven-scm-provider-tfs/1.7/maven-scm-provider-tfs-1.7.pom
[INFO] Downloaded: https://repo.maven.apache.org/maven2/org/apache/maven/scm/maven-scm-provider-tfs/1.7/maven-scm-provider-tfs-1.7.pom (2.9 kB at 317 kB/s)
[INFO] Downloading: https://repo.maven.apache.org/maven2/org/apache/maven/scm/maven-scm-provider-integrity/1.7/maven-scm-provider-integrity-1.7.pom
[INFO] Downloaded: https://repo.maven.apache.org/maven2/org/apache/maven/scm/maven-scm-provider-integrity/1.7/maven-scm-provider-integrity-1.7.pom (4.3 kB at 477 kB/s)
[INFO] Downloading: https://repo.maven.apache.org/maven2/org/apache/maven/scm/maven-scm-provider-jazz/1.7/maven-scm-provider-jazz-1.7.pom
[INFO] Downloaded: https://repo.maven.apache.org/maven2/org/apache/maven/scm/maven-scm-provider-jazz/1.7/maven-scm-provider-jazz-1.7.pom (3.6 kB at 405 kB/s)
[INFO] Downloading: https://repo.maven.apache.org/maven2/org/apache/maven/scm/maven-scm-manager-plexus/1.7/maven-scm-manager-plexus-1.7.pom
[INFO] Downloaded: https://repo.maven.apache.org/maven2/org/apache/maven/scm/maven-scm-manager-plexus/1.7/maven-scm-manager-plexus-1.7.pom (2.2 kB at 270 kB/s)
[INFO] Downloading: https://repo.maven.apache.org/maven2/org/apache/maven/scm/maven-scm-managers/1.7/maven-scm-managers-1.7.pom
[INFO] Downloaded: https://repo.maven.apache.org/maven2/org/apache/maven/scm/maven-scm-managers/1.7/maven-scm-managers-1.7.pom (1.5 kB at 165 kB/s)
[INFO] Downloading: https://repo.maven.apache.org/maven2/org/apache/maven/scm/maven-scm-api/1.8.1/maven-scm-api-1.8.1.pom
[INFO] Downloaded: https://repo.maven.apache.org/maven2/org/apache/maven/scm/maven-scm-api/1.8.1/maven-scm-api-1.8.1.pom (1.6 kB at 175 kB/s)
[INFO] Downloading: https://repo.maven.apache.org/maven2/org/apache/maven/scm/maven-scm/1.8.1/maven-scm-1.8.1.pom
[INFO] Downloaded: https://repo.maven.apache.org/maven2/org/apache/maven/scm/maven-scm/1.8.1/maven-scm-1.8.1.pom (22 kB at 2.0 MB/s)
[INFO] Downloading: https://repo.maven.apache.org/maven2/org/apache/maven/scm/maven-scm-provider-gitexe/1.8.1/maven-scm-provider-gitexe-1.8.1.pom
[INFO] Downloaded: https://repo.maven.apache.org/maven2/org/apache/maven/scm/maven-scm-provider-gitexe/1.8.1/maven-scm-provider-gitexe-1.8.1.pom (2.6 kB at 263 kB/s)
[INFO] Downloading: https://repo.maven.apache.org/maven2/org/apache/maven/scm/maven-scm-providers-git/1.8.1/maven-scm-providers-git-1.8.1.pom
[INFO] Downloaded: https://repo.maven.apache.org/maven2/org/apache/maven/scm/maven-scm-providers-git/1.8.1/maven-scm-providers-git-1.8.1.pom (2.2 kB at 276 kB/s)
[INFO] Downloading: https://repo.maven.apache.org/maven2/org/apache/maven/scm/maven-scm-providers/1.8.1/maven-scm-providers-1.8.1.pom
[INFO] Downloaded: https://repo.maven.apache.org/maven2/org/apache/maven/scm/maven-scm-providers/1.8.1/maven-scm-providers-1.8.1.pom (3.7 kB at 374 kB/s)
[INFO] Downloading: https://repo.maven.apache.org/maven2/org/apache/maven/scm/maven-scm-provider-git-commons/1.8.1/maven-scm-provider-git-commons-1.8.1.pom
[INFO] Downloaded: https://repo.maven.apache.org/maven2/org/apache/maven/scm/maven-scm-provider-git-commons/1.8.1/maven-scm-provider-git-commons-1.8.1.pom (2.3 kB at 113 kB/s)
[INFO] Downloading: https://repo.maven.apache.org/maven2/org/apache/maven/scm/maven-scm-provider-svnexe/1.8.1/maven-scm-provider-svnexe-1.8.1.pom
[INFO] Downloaded: https://repo.maven.apache.org/maven2/org/apache/maven/scm/maven-scm-provider-svnexe/1.8.1/maven-scm-provider-svnexe-1.8.1.pom (2.5 kB at 280 kB/s)
[INFO] Downloading: https://repo.maven.apache.org/maven2/org/apache/maven/scm/maven-scm-providers-svn/1.8.1/maven-scm-providers-svn-1.8.1.pom
[INFO] Downloaded: https://repo.maven.apache.org/maven2/org/apache/maven/scm/maven-scm-providers-svn/1.8.1/maven-scm-providers-svn-1.8.1.pom (2.1 kB at 266 kB/s)
[INFO] Downloading: https://repo.maven.apache.org/maven2/org/apache/maven/scm/maven-scm-provider-svn-commons/1.8.1/maven-scm-provider-svn-commons-1.8.1.pom
[INFO] Downloaded: https://repo.maven.apache.org/maven2/org/apache/maven/scm/maven-scm-provider-svn-commons/1.8.1/maven-scm-provider-svn-commons-1.8.1.pom (2.7 kB at 270 kB/s)
[INFO] Downloading: https://repo.maven.apache.org/maven2/org/apache/maven/plugins/maven-scm-publish-plugin/1.0-beta-2/maven-scm-publish-plugin-1.0-beta-2.jar
[INFO] Downloading: https://repo.maven.apache.org/maven2/org/apache/maven/release/maven-release-manager/2.3.2/maven-release-manager-2.3.2.jar
[INFO] Downloading: https://repo.maven.apache.org/maven2/org/apache/maven/scm/maven-scm-provider-bazaar/1.7/maven-scm-provider-bazaar-1.7.jar
[INFO] Downloading: https://repo.maven.apache.org/maven2/org/apache/maven/scm/maven-scm-provider-clearcase/1.7/maven-scm-provider-clearcase-1.7.jar
[INFO] Downloading: https://repo.maven.apache.org/maven2/org/apache/maven/scm/maven-scm-provider-accurev/1.7/maven-scm-provider-accurev-1.7.jar
[INFO] Downloaded: https://repo.maven.apache.org/maven2/org/apache/maven/plugins/maven-scm-publish-plugin/1.0-beta-2/maven-scm-publish-plugin-1.0-beta-2.jar (35 kB at 1.1 MB/s)
[INFO] Downloading: https://repo.maven.apache.org/maven2/org/apache/maven/scm/maven-scm-provider-cvsexe/1.7/maven-scm-provider-cvsexe-1.7.jar
[INFO] Downloaded: https://repo.maven.apache.org/maven2/org/apache/maven/scm/maven-scm-provider-cvsexe/1.7/maven-scm-provider-cvsexe-1.7.jar (30 kB at 597 kB/s)
[INFO] Downloading: https://repo.maven.apache.org/maven2/org/apache/maven/scm/maven-scm-provider-cvs-commons/1.7/maven-scm-provider-cvs-commons-1.7.jar
[INFO] Downloaded: https://repo.maven.apache.org/maven2/org/apache/maven/scm/maven-scm-provider-bazaar/1.7/maven-scm-provider-bazaar-1.7.jar (54 kB at 598 kB/s)
[INFO] Downloading: https://repo.maven.apache.org/maven2/org/apache/maven/scm/maven-scm-provider-cvsjava/1.7/maven-scm-provider-cvsjava-1.7.jar
[INFO] Downloaded: https://repo.maven.apache.org/maven2/org/apache/maven/scm/maven-scm-provider-cvs-commons/1.7/maven-scm-provider-cvs-commons-1.7.jar (80 kB at 868 kB/s)
[INFO] Downloading: https://repo.maven.apache.org/maven2/org/apache/maven/scm/maven-scm-provider-hg/1.7/maven-scm-provider-hg-1.7.jar
[INFO] Downloaded: https://repo.maven.apache.org/maven2/org/apache/maven/scm/maven-scm-provider-clearcase/1.7/maven-scm-provider-clearcase-1.7.jar (71 kB at 613 kB/s)
[INFO] Downloading: https://repo.maven.apache.org/maven2/org/apache/maven/scm/maven-scm-provider-perforce/1.7/maven-scm-provider-perforce-1.7.jar
[INFO] Downloaded: https://repo.maven.apache.org/maven2/org/apache/maven/scm/maven-scm-provider-cvsjava/1.7/maven-scm-provider-cvsjava-1.7.jar (43 kB at 310 kB/s)
[INFO] Downloading: https://repo.maven.apache.org/maven2/org/apache/maven/scm/maven-scm-provider-starteam/1.7/maven-scm-provider-starteam-1.7.jar
[INFO] Downloaded: https://repo.maven.apache.org/maven2/org/apache/maven/scm/maven-scm-provider-perforce/1.7/maven-scm-provider-perforce-1.7.jar (82 kB at 567 kB/s)
[INFO] Downloading: https://repo.maven.apache.org/maven2/org/apache/maven/scm/maven-scm-provider-synergy/1.7/maven-scm-provider-synergy-1.7.jar
[INFO] Downloaded: https://repo.maven.apache.org/maven2/org/apache/maven/scm/maven-scm-provider-hg/1.7/maven-scm-provider-hg-1.7.jar (65 kB at 445 kB/s)
[INFO] Downloading: https://repo.maven.apache.org/maven2/org/apache/maven/scm/maven-scm-provider-vss/1.7/maven-scm-provider-vss-1.7.jar
[INFO] Downloaded: https://repo.maven.apache.org/maven2/org/apache/maven/scm/maven-scm-provider-accurev/1.7/maven-scm-provider-accurev-1.7.jar (92 kB at 600 kB/s)
[INFO] Downloading: https://repo.maven.apache.org/maven2/org/apache/maven/scm/maven-scm-provider-tfs/1.7/maven-scm-provider-tfs-1.7.jar
[INFO] Downloaded: https://repo.maven.apache.org/maven2/org/apache/maven/release/maven-release-manager/2.3.2/maven-release-manager-2.3.2.jar (185 kB at 1.1 MB/s)
[INFO] Downloading: https://repo.maven.apache.org/maven2/org/apache/maven/scm/maven-scm-provider-integrity/1.7/maven-scm-provider-integrity-1.7.jar
[INFO] Downloaded: https://repo.maven.apache.org/maven2/org/apache/maven/scm/maven-scm-provider-synergy/1.7/maven-scm-provider-synergy-1.7.jar (57 kB at 354 kB/s)
[INFO] Downloading: https://repo.maven.apache.org/maven2/org/apache/maven/scm/maven-scm-provider-jazz/1.7/maven-scm-provider-jazz-1.7.jar
[INFO] Downloaded: https://repo.maven.apache.org/maven2/org/apache/maven/scm/maven-scm-provider-vss/1.7/maven-scm-provider-vss-1.7.jar (69 kB at 415 kB/s)
[INFO] Downloading: https://repo.maven.apache.org/maven2/org/apache/maven/scm/maven-scm-manager-plexus/1.7/maven-scm-manager-plexus-1.7.jar
[INFO] Downloaded: https://repo.maven.apache.org/maven2/org/apache/maven/scm/maven-scm-provider-tfs/1.7/maven-scm-provider-tfs-1.7.jar (42 kB at 233 kB/s)
[INFO] Downloading: https://repo.maven.apache.org/maven2/org/apache/maven/scm/maven-scm-api/1.8.1/maven-scm-api-1.8.1.jar
[INFO] Downloaded: https://repo.maven.apache.org/maven2/org/apache/maven/scm/maven-scm-provider-jazz/1.7/maven-scm-provider-jazz-1.7.jar (65 kB at 349 kB/s)
[INFO] Downloading: https://repo.maven.apache.org/maven2/org/apache/maven/scm/maven-scm-provider-gitexe/1.8.1/maven-scm-provider-gitexe-1.8.1.jar
[INFO] Downloaded: https://repo.maven.apache.org/maven2/org/apache/maven/scm/maven-scm-provider-starteam/1.7/maven-scm-provider-starteam-1.7.jar (74 kB at 377 kB/s)
[INFO] Downloading: https://repo.maven.apache.org/maven2/org/apache/maven/scm/maven-scm-provider-git-commons/1.8.1/maven-scm-provider-git-commons-1.8.1.jar
[INFO] Downloaded: https://repo.maven.apache.org/maven2/org/apache/maven/scm/maven-scm-provider-integrity/1.7/maven-scm-provider-integrity-1.7.jar (78 kB at 393 kB/s)
[INFO] Downloading: https://repo.maven.apache.org/maven2/org/apache/maven/scm/maven-scm-provider-svnexe/1.8.1/maven-scm-provider-svnexe-1.8.1.jar
[INFO] Downloaded: https://repo.maven.apache.org/maven2/org/apache/maven/scm/maven-scm-manager-plexus/1.7/maven-scm-manager-plexus-1.7.jar (11 kB at 52 kB/s)
[INFO] Downloading: https://repo.maven.apache.org/maven2/org/apache/maven/scm/maven-scm-provider-svn-commons/1.8.1/maven-scm-provider-svn-commons-1.8.1.jar
[INFO] Downloaded: https://repo.maven.apache.org/maven2/org/apache/maven/scm/maven-scm-api/1.8.1/maven-scm-api-1.8.1.jar (105 kB at 505 kB/s)
[INFO] Downloaded: https://repo.maven.apache.org/maven2/org/apache/maven/scm/maven-scm-provider-git-commons/1.8.1/maven-scm-provider-git-commons-1.8.1.jar (38 kB at 177 kB/s)
[INFO] Downloaded: https://repo.maven.apache.org/maven2/org/apache/maven/scm/maven-scm-provider-gitexe/1.8.1/maven-scm-provider-gitexe-1.8.1.jar (64 kB at 290 kB/s)
[INFO] Downloaded: https://repo.maven.apache.org/maven2/org/apache/maven/scm/maven-scm-provider-svn-commons/1.8.1/maven-scm-provider-svn-commons-1.8.1.jar (40 kB at 180 kB/s)
[INFO] Downloaded: https://repo.maven.apache.org/maven2/org/apache/maven/scm/maven-scm-provider-svnexe/1.8.1/maven-scm-provider-svnexe-1.8.1.jar (77 kB at 335 kB/s)
[INFO] Downloading: https://repo.maven.apache.org/maven2/org/apache/maven/wagon/wagon-ssh/2.5/wagon-ssh-2.5.pom
[INFO] Downloaded: https://repo.maven.apache.org/maven2/org/apache/maven/wagon/wagon-ssh/2.5/wagon-ssh-2.5.pom (5.7 kB at 520 kB/s)
[INFO] Downloading: https://repo.maven.apache.org/maven2/org/apache/maven/wagon/wagon-providers/2.5/wagon-providers-2.5.pom
[INFO] Downloaded: https://repo.maven.apache.org/maven2/org/apache/maven/wagon/wagon-providers/2.5/wagon-providers-2.5.pom (2.7 kB at 341 kB/s)
[INFO] Downloading: https://repo.maven.apache.org/maven2/org/apache/maven/wagon/wagon/2.5/wagon-2.5.pom
[INFO] Downloaded: https://repo.maven.apache.org/maven2/org/apache/maven/wagon/wagon/2.5/wagon-2.5.pom (20 kB at 1.8 MB/s)
[INFO] Downloading: https://repo.maven.apache.org/maven2/org/apache/maven/wagon/wagon-ssh-common/2.5/wagon-ssh-common-2.5.pom
[INFO] Downloaded: https://repo.maven.apache.org/maven2/org/apache/maven/wagon/wagon-ssh-common/2.5/wagon-ssh-common-2.5.pom (1.8 kB at 204 kB/s)
[INFO] Downloading: https://repo.maven.apache.org/maven2/org/apache/maven/wagon/wagon-provider-api/2.5/wagon-provider-api-2.5.pom
[INFO] Downloaded: https://repo.maven.apache.org/maven2/org/apache/maven/wagon/wagon-provider-api/2.5/wagon-provider-api-2.5.pom (1.7 kB at 216 kB/s)
[INFO] Downloading: https://repo.maven.apache.org/maven2/org/apache/maven/wagon/wagon-ssh/2.5/wagon-ssh-2.5.jar
[INFO] Downloading: https://repo.maven.apache.org/maven2/org/apache/maven/wagon/wagon-provider-api/2.5/wagon-provider-api-2.5.jar
[INFO] Downloading: https://repo.maven.apache.org/maven2/org/apache/maven/wagon/wagon-ssh-common/2.5/wagon-ssh-common-2.5.jar
[INFO] Downloaded: https://repo.maven.apache.org/maven2/org/apache/maven/wagon/wagon-provider-api/2.5/wagon-provider-api-2.5.jar (53 kB at 3.3 MB/s)
[INFO] Downloaded: https://repo.maven.apache.org/maven2/org/apache/maven/wagon/wagon-ssh-common/2.5/wagon-ssh-common-2.5.jar (25 kB at 1.2 MB/s)
[INFO] Downloaded: https://repo.maven.apache.org/maven2/org/apache/maven/wagon/wagon-ssh/2.5/wagon-ssh-2.5.jar (29 kB at 1.3 MB/s)
[INFO] ------------------------------------------------------------------------
[INFO] Reactor Build Order:
[INFO]
[INFO] Tiles Request Framework
[INFO] Tiles request - API
[INFO] Tiles request - Servlet support
[INFO] Tiles Request - Wildcard file loading in Servlets
[INFO] Tiles - Portlet support
[INFO] Tiles - Wildcard file loading in Portlets
[INFO] Tiles Request - JSP support
[INFO] Tiles Request - Freemarker support
[INFO] Tiles Request - Velocity support
[INFO] Tiles request - Mustache support
[INFO] Tiles Request Assembly
[INFO]
[INFO] ------------------------------------------------------------------------
[INFO] Building Tiles Request Framework 1.0.8-SNAPSHOT
[INFO] ------------------------------------------------------------------------
[INFO] Downloading: https://repo.maven.apache.org/maven2/org/apache/maven/plugins/maven-enforcer-plugin/1.2/maven-enforcer-plugin-1.2.pom
[INFO] Downloaded: https://repo.maven.apache.org/maven2/org/apache/maven/plugins/maven-enforcer-plugin/1.2/maven-enforcer-plugin-1.2.pom (5.8 kB at 583 kB/s)
[INFO] Downloading: https://repo.maven.apache.org/maven2/org/apache/maven/enforcer/enforcer/1.2/enforcer-1.2.pom
[INFO] Downloaded: https://repo.maven.apache.org/maven2/org/apache/maven/enforcer/enforcer/1.2/enforcer-1.2.pom (11 kB at 1.1 MB/s)
[INFO] Downloading: https://repo.maven.apache.org/maven2/org/apache/maven/plugins/maven-enforcer-plugin/1.2/maven-enforcer-plugin-1.2.jar
[INFO] Downloaded: https://repo.maven.apache.org/maven2/org/apache/maven/plugins/maven-enforcer-plugin/1.2/maven-enforcer-plugin-1.2.jar (25 kB at 2.0 MB/s)
[INFO] Downloading: https://repo.maven.apache.org/maven2/org/slf4j/slf4j-simple/1.7.6/slf4j-simple-1.7.6.pom
[INFO] Downloaded: https://repo.maven.apache.org/maven2/org/slf4j/slf4j-simple/1.7.6/slf4j-simple-1.7.6.pom (1.5 kB at 147 kB/s)
[INFO] Downloading: https://repo.maven.apache.org/maven2/org/slf4j/slf4j-simple/1.7.6/slf4j-simple-1.7.6.jar
[INFO] Downloading: https://repo.maven.apache.org/maven2/org/slf4j/slf4j-api/1.5.8/slf4j-api-1.5.8.jar
[INFO] Downloaded: https://repo.maven.apache.org/maven2/org/slf4j/slf4j-api/1.5.8/slf4j-api-1.5.8.jar (23 kB at 1.7 MB/s)
[INFO] Downloaded: https://repo.maven.apache.org/maven2/org/slf4j/slf4j-simple/1.7.6/slf4j-simple-1.7.6.jar (11 kB at 668 kB/s)
[INFO]
[INFO] --- maven-clean-plugin:2.5:clean (default-clean) @ tiles-request ---
[INFO]
[INFO] --- maven-enforcer-plugin:1.2:enforce (enforce-java) @ tiles-request ---
[INFO] Downloading: https://repo.maven.apache.org/maven2/org/apache/maven/enforcer/enforcer-api/1.2/enforcer-api-1.2.pom
[INFO] Downloaded: https://repo.maven.apache.org/maven2/org/apache/maven/enforcer/enforcer-api/1.2/enforcer-api-1.2.pom (2.9 kB at 220 kB/s)
[INFO] Downloading: https://repo.maven.apache.org/maven2/org/apache/maven/enforcer/enforcer-rules/1.2/enforcer-rules-1.2.pom
[INFO] Downloaded: https://repo.maven.apache.org/maven2/org/apache/maven/enforcer/enforcer-rules/1.2/enforcer-rules-1.2.pom (3.7 kB at 231 kB/s)
[INFO] Downloading: https://repo.maven.apache.org/maven2/org/apache/maven/shared/maven-dependency-tree/2.0/maven-dependency-tree-2.0.pom
[INFO] Downloaded: https://repo.maven.apache.org/maven2/org/apache/maven/shared/maven-dependency-tree/2.0/maven-dependency-tree-2.0.pom (4.7 kB at 519 kB/s)
[INFO] Downloading: https://repo.maven.apache.org/maven2/org/apache/maven/enforcer/enforcer-api/1.2/enforcer-api-1.2.jar
[INFO] Downloading: https://repo.maven.apache.org/maven2/org/apache/maven/enforcer/enforcer-rules/1.2/enforcer-rules-1.2.jar
[INFO] Downloading: https://repo.maven.apache.org/maven2/org/apache/maven/shared/maven-dependency-tree/2.0/maven-dependency-tree-2.0.jar
[INFO] Downloaded: https://repo.maven.apache.org/maven2/org/apache/maven/enforcer/enforcer-api/1.2/enforcer-api-1.2.jar (9.8 kB at 542 kB/s)
[INFO] Downloaded: https://repo.maven.apache.org/maven2/org/apache/maven/shared/maven-dependency-tree/2.0/maven-dependency-tree-2.0.jar (56 kB at 2.9 MB/s)
[INFO] Downloaded: https://repo.maven.apache.org/maven2/org/apache/maven/enforcer/enforcer-rules/1.2/enforcer-rules-1.2.jar (76 kB at 2.1 MB/s)
[WARNING] Rule 0: org.apache.maven.plugins.enforcer.RequireJavaVersion failed with message:
Detected JDK Version: 1.8.0-121 is not in the allowed range [1.7.0-45,1.8).
[INFO] ------------------------------------------------------------------------
[INFO] Reactor Summary:
[INFO]
[INFO] Tiles Request Framework ............................ FAILURE [  1.358 s]
[INFO] Tiles request - API ................................ SKIPPED
[INFO] Tiles request - Servlet support .................... SKIPPED
[INFO] Tiles Request - Wildcard file loading in Servlets .. SKIPPED
[INFO] Tiles - Portlet support ............................ SKIPPED
[INFO] Tiles - Wildcard file loading in Portlets .......... SKIPPED
[INFO] Tiles Request - JSP support ........................ SKIPPED
[INFO] Tiles Request - Freemarker support ................. SKIPPED
[INFO] Tiles Request - Velocity support ................... SKIPPED
[INFO] Tiles request - Mustache support ................... SKIPPED
[INFO] Tiles Request Assembly ............................. SKIPPED
[INFO] ------------------------------------------------------------------------
[INFO] BUILD FAILURE
[INFO] ------------------------------------------------------------------------
[INFO] Total time: 6.787 s
[INFO] Finished at: 2017-09-04T11:53:46Z
[INFO] Final Memory: 21M/362M
[INFO] ------------------------------------------------------------------------
[ERROR] Failed to execute goal org.apache.maven.plugins:maven-enforcer-plugin:1.2:enforce (enforce-java) on project tiles-request: Some Enforcer rules have failed. Look above for specific messages explaining why the rule failed. -> [Help 1]
[ERROR]
[ERROR] To see the full stack trace of the errors, re-run Maven with the -e switch.
[ERROR] Re-run Maven using the -X switch to enable full debug logging.
[ERROR]
[ERROR] For more information about the errors and possible solutions, please read the following articles:
[ERROR] [Help 1] http://cwiki.apache.org/confluence/display/MAVEN/MojoExecutionException
[JENKINS] Archiving F:\jenkins\jenkins-slave\workspace\Tiles-Request-1.0.x\assembly\pom.xml to org.apache.tiles/tiles-request-assembly/1.0.8-SNAPSHOT/tiles-request-assembly-1.0.8-SNAPSHOT.pom
[JENKINS] Archiving <https://builds.apache.org/job/Tiles-Request-1.0.x/ws/pom.xml> to org.apache.tiles/tiles-request/1.0.8-SNAPSHOT/tiles-request-1.0.8-SNAPSHOT.pom
[JENKINS] Archiving F:\jenkins\jenkins-slave\workspace\Tiles-Request-1.0.x\tiles-request-velocity\pom.xml to org.apache.tiles/tiles-request-velocity/1.0.8-SNAPSHOT/tiles-request-velocity-1.0.8-SNAPSHOT.pom
[JENKINS] Archiving F:\jenkins\jenkins-slave\workspace\Tiles-Request-1.0.x\tiles-request-freemarker\pom.xml to org.apache.tiles/tiles-request-freemarker/1.0.8-SNAPSHOT/tiles-request-freemarker-1.0.8-SNAPSHOT.pom
[JENKINS] Archiving F:\jenkins\jenkins-slave\workspace\Tiles-Request-1.0.x\tiles-request-servlet-wildcard\pom.xml to org.apache.tiles/tiles-request-servlet-wildcard/1.0.8-SNAPSHOT/tiles-request-servlet-wildcard-1.0.8-SNAPSHOT.pom
[JENKINS] Archiving F:\jenkins\jenkins-slave\workspace\Tiles-Request-1.0.x\tiles-request-mustache\pom.xml to org.apache.tiles/tiles-request-mustache/1.0.8-SNAPSHOT/tiles-request-mustache-1.0.8-SNAPSHOT.pom
[JENKINS] Archiving F:\jenkins\jenkins-slave\workspace\Tiles-Request-1.0.x\tiles-request-jsp\pom.xml to org.apache.tiles/tiles-request-jsp/1.0.8-SNAPSHOT/tiles-request-jsp-1.0.8-SNAPSHOT.pom
[JENKINS] Archiving F:\jenkins\jenkins-slave\workspace\Tiles-Request-1.0.x\tiles-request-servlet\pom.xml to org.apache.tiles/tiles-request-servlet/1.0.8-SNAPSHOT/tiles-request-servlet-1.0.8-SNAPSHOT.pom
[JENKINS] Archiving F:\jenkins\jenkins-slave\workspace\Tiles-Request-1.0.x\tiles-request-portlet-wildcard\pom.xml to org.apache.tiles/tiles-request-portlet-wildcard/1.0.8-SNAPSHOT/tiles-request-portlet-wildcard-1.0.8-SNAPSHOT.pom
[JENKINS] Archiving F:\jenkins\jenkins-slave\workspace\Tiles-Request-1.0.x\tiles-request-api\pom.xml to org.apache.tiles/tiles-request-api/1.0.8-SNAPSHOT/tiles-request-api-1.0.8-SNAPSHOT.pom
[JENKINS] Archiving F:\jenkins\jenkins-slave\workspace\Tiles-Request-1.0.x\tiles-request-portlet\pom.xml to org.apache.tiles/tiles-request-portlet/1.0.8-SNAPSHOT/tiles-request-portlet-1.0.8-SNAPSHOT.pom
channel stopped
Reply | Threaded
Open this post in threaded view
|

Build failed in Jenkins: Tiles-Request-1.0.x #28

Apache Jenkins Server-2
See <https://builds.apache.org/job/Tiles-Request-1.0.x/28/display/redirect>

------------------------------------------
Started by an SCM change
[EnvInject] - Loading node environment variables.
Building remotely on H25 (couchdbtest ubuntu xenial) in workspace <https://builds.apache.org/job/Tiles-Request-1.0.x/ws/>
Updating https://svn.apache.org/repos/asf/tiles/request/branches/TREQ_1_0_X at revision '2017-09-04T12:07:03.230 +0000'
At revision 1807213

No changes for https://svn.apache.org/repos/asf/tiles/request/branches/TREQ_1_0_X since the previous build
Parsing POMs
Established TCP socket on 42428
maven35-agent.jar already up to date
maven35-interceptor.jar already up to date
maven3-interceptor-commons.jar already up to date
[Tiles-Request-1.0.x] $ /home/jenkins/tools/java/latest1.7/bin/java -Xmx2g -Xms256m -cp /home/jenkins/jenkins-slave/maven35-agent.jar:/home/jenkins/tools/maven/latest3/boot/plexus-classworlds-2.5.2.jar:/home/jenkins/tools/maven/latest3/conf/logging jenkins.maven3.agent.Maven35Main /home/jenkins/tools/maven/latest3/ /home/jenkins/jenkins-slave/slave.jar /home/jenkins/jenkins-slave/maven35-interceptor.jar /home/jenkins/jenkins-slave/maven3-interceptor-commons.jar 42428
<===[JENKINS REMOTING CAPACITY]===>   channel started
ERROR: ================================================================================
ERROR: Invalid project setup: jenkins/security/MasterToSlaveCallable : Unsupported major.minor version 52.0
ERROR: [JENKINS-18403][JENKINS-28294] JDK 'JDK 1.7 (latest)' not supported to run Maven projects.
ERROR: Maven projects have to be launched with a Java version greater or equal to the minimum version required by the master.
ERROR: Use the Maven JDK Toolchains (plugin) to build your maven project with an older JDK.
ERROR: Retrying with slave Java and setting compile/test properties to point to /home/jenkins/tools/java/latest1.7.
ERROR: ================================================================================
Established TCP socket on 33575
maven35-agent.jar already up to date
maven35-interceptor.jar already up to date
maven3-interceptor-commons.jar already up to date
[Tiles-Request-1.0.x] $ /usr/local/asfpackages/java/jdk1.8.0_131/jre/bin/java -Xmx2g -Xms256m -cp /home/jenkins/jenkins-slave/maven35-agent.jar:/home/jenkins/tools/maven/latest3/boot/plexus-classworlds-2.5.2.jar:/home/jenkins/tools/maven/latest3/conf/logging jenkins.maven3.agent.Maven35Main /home/jenkins/tools/maven/latest3/ /home/jenkins/jenkins-slave/slave.jar /home/jenkins/jenkins-slave/maven35-interceptor.jar /home/jenkins/jenkins-slave/maven3-interceptor-commons.jar 33575
<===[JENKINS REMOTING CAPACITY]===>   channel started
Executing Maven:  -B -f <https://builds.apache.org/job/Tiles-Request-1.0.x/ws/pom.xml> -Dmaven.repo.local=/home/jenkins/jenkins-slave/maven-repositories/0 clean install
[INFO] Scanning for projects...
[INFO] ------------------------------------------------------------------------
[INFO] Reactor Build Order:
[INFO]
[INFO] Tiles Request Framework
[INFO] Tiles request - API
[INFO] Tiles request - Servlet support
[INFO] Tiles Request - Wildcard file loading in Servlets
[INFO] Tiles - Portlet support
[INFO] Tiles - Wildcard file loading in Portlets
[INFO] Tiles Request - JSP support
[INFO] Tiles Request - Freemarker support
[INFO] Tiles Request - Velocity support
[INFO] Tiles request - Mustache support
[INFO] Tiles Request Assembly
[INFO]
[INFO] ------------------------------------------------------------------------
[INFO] Building Tiles Request Framework 1.0.8-SNAPSHOT
[INFO] ------------------------------------------------------------------------
[INFO]
[INFO] --- maven-clean-plugin:2.5:clean (default-clean) @ tiles-request ---
[INFO]
[INFO] --- maven-enforcer-plugin:1.2:enforce (enforce-java) @ tiles-request ---
[WARNING] Rule 0: org.apache.maven.plugins.enforcer.RequireJavaVersion failed with message:
Detected JDK Version: 1.8.0-131 is not in the allowed range [1.7.0-45,1.8).
[INFO] ------------------------------------------------------------------------
[INFO] Reactor Summary:
[INFO]
[INFO] Tiles Request Framework ............................ FAILURE [  3.704 s]
[INFO] Tiles request - API ................................ SKIPPED
[INFO] Tiles request - Servlet support .................... SKIPPED
[INFO] Tiles Request - Wildcard file loading in Servlets .. SKIPPED
[INFO] Tiles - Portlet support ............................ SKIPPED
[INFO] Tiles - Wildcard file loading in Portlets .......... SKIPPED
[INFO] Tiles Request - JSP support ........................ SKIPPED
[INFO] Tiles Request - Freemarker support ................. SKIPPED
[INFO] Tiles Request - Velocity support ................... SKIPPED
[INFO] Tiles request - Mustache support ................... SKIPPED
[INFO] Tiles Request Assembly ............................. SKIPPED
[INFO] ------------------------------------------------------------------------
[INFO] BUILD FAILURE
[INFO] ------------------------------------------------------------------------
[INFO] Total time: 17.647 s
[INFO] Finished at: 2017-09-04T12:08:05Z
[INFO] Final Memory: 17M/300M
[INFO] ------------------------------------------------------------------------
[ERROR] Failed to execute goal org.apache.maven.plugins:maven-enforcer-plugin:1.2:enforce (enforce-java) on project tiles-request: Some Enforcer rules have failed. Look above for specific messages explaining why the rule failed. -> [Help 1]
[ERROR]
[ERROR] To see the full stack trace of the errors, re-run Maven with the -e switch.
[ERROR] Re-run Maven using the -X switch to enable full debug logging.
[ERROR]
[ERROR] For more information about the errors and possible solutions, please read the following articles:
[ERROR] [Help 1] http://cwiki.apache.org/confluence/display/MAVEN/MojoExecutionException
[JENKINS] Archiving <https://builds.apache.org/job/Tiles-Request-1.0.x/ws/assembly/pom.xml> to org.apache.tiles/tiles-request-assembly/1.0.8-SNAPSHOT/tiles-request-assembly-1.0.8-SNAPSHOT.pom
[JENKINS] Archiving <https://builds.apache.org/job/Tiles-Request-1.0.x/ws/pom.xml> to org.apache.tiles/tiles-request/1.0.8-SNAPSHOT/tiles-request-1.0.8-SNAPSHOT.pom
[JENKINS] Archiving <https://builds.apache.org/job/Tiles-Request-1.0.x/ws/tiles-request-velocity/pom.xml> to org.apache.tiles/tiles-request-velocity/1.0.8-SNAPSHOT/tiles-request-velocity-1.0.8-SNAPSHOT.pom
[JENKINS] Archiving <https://builds.apache.org/job/Tiles-Request-1.0.x/ws/tiles-request-freemarker/pom.xml> to org.apache.tiles/tiles-request-freemarker/1.0.8-SNAPSHOT/tiles-request-freemarker-1.0.8-SNAPSHOT.pom
[JENKINS] Archiving <https://builds.apache.org/job/Tiles-Request-1.0.x/ws/tiles-request-servlet-wildcard/pom.xml> to org.apache.tiles/tiles-request-servlet-wildcard/1.0.8-SNAPSHOT/tiles-request-servlet-wildcard-1.0.8-SNAPSHOT.pom
[JENKINS] Archiving <https://builds.apache.org/job/Tiles-Request-1.0.x/ws/tiles-request-mustache/pom.xml> to org.apache.tiles/tiles-request-mustache/1.0.8-SNAPSHOT/tiles-request-mustache-1.0.8-SNAPSHOT.pom
[JENKINS] Archiving <https://builds.apache.org/job/Tiles-Request-1.0.x/ws/tiles-request-jsp/pom.xml> to org.apache.tiles/tiles-request-jsp/1.0.8-SNAPSHOT/tiles-request-jsp-1.0.8-SNAPSHOT.pom
[JENKINS] Archiving <https://builds.apache.org/job/Tiles-Request-1.0.x/ws/tiles-request-servlet/pom.xml> to org.apache.tiles/tiles-request-servlet/1.0.8-SNAPSHOT/tiles-request-servlet-1.0.8-SNAPSHOT.pom
[JENKINS] Archiving <https://builds.apache.org/job/Tiles-Request-1.0.x/ws/tiles-request-portlet-wildcard/pom.xml> to org.apache.tiles/tiles-request-portlet-wildcard/1.0.8-SNAPSHOT/tiles-request-portlet-wildcard-1.0.8-SNAPSHOT.pom
[JENKINS] Archiving <https://builds.apache.org/job/Tiles-Request-1.0.x/ws/tiles-request-api/pom.xml> to org.apache.tiles/tiles-request-api/1.0.8-SNAPSHOT/tiles-request-api-1.0.8-SNAPSHOT.pom
[JENKINS] Archiving <https://builds.apache.org/job/Tiles-Request-1.0.x/ws/tiles-request-portlet/pom.xml> to org.apache.tiles/tiles-request-portlet/1.0.8-SNAPSHOT/tiles-request-portlet-1.0.8-SNAPSHOT.pom
channel stopped
Reply | Threaded
Open this post in threaded view
|

Build failed in Jenkins: Tiles-Request-1.0.x #29

Apache Jenkins Server-2
See <https://builds.apache.org/job/Tiles-Request-1.0.x/29/display/redirect?page=changes>

Changes:

[mck] Upgrade procedure for uploading assemblies to https://dist.apache.org/repos/dist/dev as per http://www.apache.org/legal/release-policy.html#host-rc

------------------------------------------
Started by an SCM change
[EnvInject] - Loading node environment variables.
Building remotely on H25 (couchdbtest ubuntu xenial) in workspace <https://builds.apache.org/job/Tiles-Request-1.0.x/ws/>
Updating https://svn.apache.org/repos/asf/tiles/request/branches/TREQ_1_0_X at revision '2017-09-05T01:44:33.112 +0000'
U         assembly/pom.xml
U         src/site/apt/dev/release.apt
At revision 1807308

Parsing POMs
Modules changed, recalculating dependency graph
Established TCP socket on 41091
maven35-agent.jar already up to date
maven35-interceptor.jar already up to date
maven3-interceptor-commons.jar already up to date
[Tiles-Request-1.0.x] $ /home/jenkins/tools/java/latest1.7/bin/java -Xmx2g -Xms256m -cp /home/jenkins/jenkins-slave/maven35-agent.jar:/home/jenkins/tools/maven/latest3/boot/plexus-classworlds-2.5.2.jar:/home/jenkins/tools/maven/latest3/conf/logging jenkins.maven3.agent.Maven35Main /home/jenkins/tools/maven/latest3/ /home/jenkins/jenkins-slave/slave.jar /home/jenkins/jenkins-slave/maven35-interceptor.jar /home/jenkins/jenkins-slave/maven3-interceptor-commons.jar 41091
<===[JENKINS REMOTING CAPACITY]===>   channel started
ERROR: ================================================================================
ERROR: Invalid project setup: jenkins/security/MasterToSlaveCallable : Unsupported major.minor version 52.0
ERROR: [JENKINS-18403][JENKINS-28294] JDK 'JDK 1.7 (latest)' not supported to run Maven projects.
ERROR: Maven projects have to be launched with a Java version greater or equal to the minimum version required by the master.
ERROR: Use the Maven JDK Toolchains (plugin) to build your maven project with an older JDK.
ERROR: Retrying with slave Java and setting compile/test properties to point to /home/jenkins/tools/java/latest1.7.
ERROR: ================================================================================
Established TCP socket on 46838
maven35-agent.jar already up to date
maven35-interceptor.jar already up to date
maven3-interceptor-commons.jar already up to date
[Tiles-Request-1.0.x] $ /usr/local/asfpackages/java/jdk1.8.0_131/jre/bin/java -Xmx2g -Xms256m -cp /home/jenkins/jenkins-slave/maven35-agent.jar:/home/jenkins/tools/maven/latest3/boot/plexus-classworlds-2.5.2.jar:/home/jenkins/tools/maven/latest3/conf/logging jenkins.maven3.agent.Maven35Main /home/jenkins/tools/maven/latest3/ /home/jenkins/jenkins-slave/slave.jar /home/jenkins/jenkins-slave/maven35-interceptor.jar /home/jenkins/jenkins-slave/maven3-interceptor-commons.jar 46838
<===[JENKINS REMOTING CAPACITY]===>   channel started
Executing Maven:  -B -f <https://builds.apache.org/job/Tiles-Request-1.0.x/ws/pom.xml> -Dmaven.repo.local=/home/jenkins/jenkins-slave/maven-repositories/0 clean install
[INFO] Scanning for projects...
[INFO] ------------------------------------------------------------------------
[INFO] Reactor Build Order:
[INFO]
[INFO] Tiles Request Framework
[INFO] Tiles request - API
[INFO] Tiles request - Servlet support
[INFO] Tiles Request - Wildcard file loading in Servlets
[INFO] Tiles - Portlet support
[INFO] Tiles - Wildcard file loading in Portlets
[INFO] Tiles Request - JSP support
[INFO] Tiles Request - Freemarker support
[INFO] Tiles Request - Velocity support
[INFO] Tiles request - Mustache support
[INFO] Tiles Request Assembly
[INFO]
[INFO] ------------------------------------------------------------------------
[INFO] Building Tiles Request Framework 1.0.8-SNAPSHOT
[INFO] ------------------------------------------------------------------------
[INFO]
[INFO] --- maven-clean-plugin:2.5:clean (default-clean) @ tiles-request ---
[INFO]
[INFO] --- maven-enforcer-plugin:1.2:enforce (enforce-java) @ tiles-request ---
[WARNING] Rule 0: org.apache.maven.plugins.enforcer.RequireJavaVersion failed with message:
Detected JDK Version: 1.8.0-131 is not in the allowed range [1.7.0-45,1.8).
[INFO] ------------------------------------------------------------------------
[INFO] Reactor Summary:
[INFO]
[INFO] Tiles Request Framework ............................ FAILURE [  3.641 s]
[INFO] Tiles request - API ................................ SKIPPED
[INFO] Tiles request - Servlet support .................... SKIPPED
[INFO] Tiles Request - Wildcard file loading in Servlets .. SKIPPED
[INFO] Tiles - Portlet support ............................ SKIPPED
[INFO] Tiles - Wildcard file loading in Portlets .......... SKIPPED
[INFO] Tiles Request - JSP support ........................ SKIPPED
[INFO] Tiles Request - Freemarker support ................. SKIPPED
[INFO] Tiles Request - Velocity support ................... SKIPPED
[INFO] Tiles request - Mustache support ................... SKIPPED
[INFO] Tiles Request Assembly ............................. SKIPPED
[INFO] ------------------------------------------------------------------------
[INFO] BUILD FAILURE
[INFO] ------------------------------------------------------------------------
[INFO] Total time: 17.314 s
[INFO] Finished at: 2017-09-05T01:48:20Z
[INFO] Final Memory: 16M/298M
[INFO] ------------------------------------------------------------------------
Waiting for Jenkins to finish collecting data
[ERROR] Failed to execute goal org.apache.maven.plugins:maven-enforcer-plugin:1.2:enforce (enforce-java) on project tiles-request: Some Enforcer rules have failed. Look above for specific messages explaining why the rule failed. -> [Help 1]
[ERROR]
[ERROR] To see the full stack trace of the errors, re-run Maven with the -e switch.
[ERROR] Re-run Maven using the -X switch to enable full debug logging.
[ERROR]
[ERROR] For more information about the errors and possible solutions, please read the following articles:
[ERROR] [Help 1] http://cwiki.apache.org/confluence/display/MAVEN/MojoExecutionException
[JENKINS] Archiving <https://builds.apache.org/job/Tiles-Request-1.0.x/ws/assembly/pom.xml> to org.apache.tiles/tiles-request-assembly/1.0.8-SNAPSHOT/tiles-request-assembly-1.0.8-SNAPSHOT.pom
[JENKINS] Archiving <https://builds.apache.org/job/Tiles-Request-1.0.x/ws/pom.xml> to org.apache.tiles/tiles-request/1.0.8-SNAPSHOT/tiles-request-1.0.8-SNAPSHOT.pom
[JENKINS] Archiving <https://builds.apache.org/job/Tiles-Request-1.0.x/ws/tiles-request-velocity/pom.xml> to org.apache.tiles/tiles-request-velocity/1.0.8-SNAPSHOT/tiles-request-velocity-1.0.8-SNAPSHOT.pom
[JENKINS] Archiving <https://builds.apache.org/job/Tiles-Request-1.0.x/ws/tiles-request-freemarker/pom.xml> to org.apache.tiles/tiles-request-freemarker/1.0.8-SNAPSHOT/tiles-request-freemarker-1.0.8-SNAPSHOT.pom
[JENKINS] Archiving <https://builds.apache.org/job/Tiles-Request-1.0.x/ws/tiles-request-servlet-wildcard/pom.xml> to org.apache.tiles/tiles-request-servlet-wildcard/1.0.8-SNAPSHOT/tiles-request-servlet-wildcard-1.0.8-SNAPSHOT.pom
[JENKINS] Archiving <https://builds.apache.org/job/Tiles-Request-1.0.x/ws/tiles-request-mustache/pom.xml> to org.apache.tiles/tiles-request-mustache/1.0.8-SNAPSHOT/tiles-request-mustache-1.0.8-SNAPSHOT.pom
[JENKINS] Archiving <https://builds.apache.org/job/Tiles-Request-1.0.x/ws/tiles-request-jsp/pom.xml> to org.apache.tiles/tiles-request-jsp/1.0.8-SNAPSHOT/tiles-request-jsp-1.0.8-SNAPSHOT.pom
[JENKINS] Archiving <https://builds.apache.org/job/Tiles-Request-1.0.x/ws/tiles-request-servlet/pom.xml> to org.apache.tiles/tiles-request-servlet/1.0.8-SNAPSHOT/tiles-request-servlet-1.0.8-SNAPSHOT.pom
[JENKINS] Archiving <https://builds.apache.org/job/Tiles-Request-1.0.x/ws/tiles-request-portlet-wildcard/pom.xml> to org.apache.tiles/tiles-request-portlet-wildcard/1.0.8-SNAPSHOT/tiles-request-portlet-wildcard-1.0.8-SNAPSHOT.pom
[JENKINS] Archiving <https://builds.apache.org/job/Tiles-Request-1.0.x/ws/tiles-request-api/pom.xml> to org.apache.tiles/tiles-request-api/1.0.8-SNAPSHOT/tiles-request-api-1.0.8-SNAPSHOT.pom
[JENKINS] Archiving <https://builds.apache.org/job/Tiles-Request-1.0.x/ws/tiles-request-portlet/pom.xml> to org.apache.tiles/tiles-request-portlet/1.0.8-SNAPSHOT/tiles-request-portlet-1.0.8-SNAPSHOT.pom
channel stopped