Build failed in Jenkins: Tiles-Framework #23

classic Classic list List threaded Threaded
2 messages Options
Reply | Threaded
Open this post in threaded view
|

Build failed in Jenkins: Tiles-Framework #23

Apache Jenkins Server-2
See <https://builds.apache.org/job/Tiles-Framework/23/display/redirect?page=changes>

Changes:

[mck] use Tiles Master 7

------------------------------------------
[...truncated 90.87 KB...]
AU        tiles-core/src/test/resources/org/apache/tiles/config/defs1_en_US.xml
AU        tiles-core/src/test/resources/org/apache/tiles/config/defs1_fr_CA.xml
AU        tiles-core/src/test/resources/org/apache/tiles/config/tiles-defs-2.1.xml
AU        tiles-core/src/test/resources/org/apache/tiles/config/tiles-defs.xml
AU        tiles-core/src/test/resources/org/apache/tiles/config/defs1.xml
AU        tiles-core/src/test/resources/org/apache/tiles/config/defs2.xml
AU        tiles-core/src/test/resources/org/apache/tiles/config/defs3.xml
AU        tiles-core/src/test/resources/org/apache/tiles/config/temp-defs.xml
AU        tiles-core/src/test/resources/org/apache/tiles/config/defs-tiles-513.xml
AU        tiles-core/src/test/resources/org/apache/tiles/config/invalid-defs.xml
AU        tiles-core/src/test/resources/org/apache/tiles/config/malformed-defs.xml
AU        tiles-core/src/test/resources/org/apache/tiles/config/defs-wildcard.xml
AU        tiles-core/src/test/resources/org/apache/tiles/config/defs_regression_TILES-352.xml
AU        tiles-core/src/test/resources/org/apache/tiles/config/defs1_fr.xml
AU        tiles-core/src/test/resources/org/apache/tiles/config/tiles-defs-2.1_it.xml
A         tiles-core/src/main
A         tiles-core/src/main/java
A         tiles-core/src/main/java/org
A         tiles-core/src/main/java/org/apache
A         tiles-core/src/main/java/org/apache/tiles
A         tiles-core/src/main/java/org/apache/tiles/doc-files
AU        tiles-core/src/main/java/org/apache/tiles/doc-files/image001.gif
A         tiles-core/src/main/java/org/apache/tiles/renderer
AU        tiles-core/src/main/java/org/apache/tiles/renderer/DefinitionRenderer.java
AU        tiles-core/src/main/java/org/apache/tiles/renderer/package-info.java
A         tiles-core/src/main/java/org/apache/tiles/factory
AU        tiles-core/src/main/java/org/apache/tiles/factory/TilesContainerFactoryException.java
AU        tiles-core/src/main/java/org/apache/tiles/factory/BasicTilesContainerFactory.java
AU        tiles-core/src/main/java/org/apache/tiles/factory/AbstractTilesContainerFactory.java
AU        tiles-core/src/main/java/org/apache/tiles/factory/package-info.java
A         tiles-core/src/main/java/org/apache/tiles/awareness
AU        tiles-core/src/main/java/org/apache/tiles/awareness/TilesContainerAware.java
AU        tiles-core/src/main/java/org/apache/tiles/awareness/package-info.java
A         tiles-core/src/main/java/org/apache/tiles/definition
AU        tiles-core/src/main/java/org/apache/tiles/definition/RefreshMonitor.java
A         tiles-core/src/main/java/org/apache/tiles/definition/digester
AU        tiles-core/src/main/java/org/apache/tiles/definition/digester/DigesterDefinitionsReaderException.java
AU        tiles-core/src/main/java/org/apache/tiles/definition/digester/package-info.java
AU        tiles-core/src/main/java/org/apache/tiles/definition/digester/DigesterDefinitionsReader.java
AU        tiles-core/src/main/java/org/apache/tiles/definition/NoSuchDefinitionException.java
A         tiles-core/src/main/java/org/apache/tiles/definition/pattern
AU        tiles-core/src/main/java/org/apache/tiles/definition/pattern/DefinitionPatternMatcherFactory.java
AU        tiles-core/src/main/java/org/apache/tiles/definition/pattern/package-info.java
AU        tiles-core/src/main/java/org/apache/tiles/definition/pattern/PatternRecognizer.java
AU        tiles-core/src/main/java/org/apache/tiles/definition/pattern/PatternDefinitionResolver.java
AU        tiles-core/src/main/java/org/apache/tiles/definition/pattern/PatternDefinitionResolverAware.java
A         tiles-core/src/main/java/org/apache/tiles/definition/pattern/wildcard
AU        tiles-core/src/main/java/org/apache/tiles/definition/pattern/wildcard/WildcardDefinitionPatternMatcherFactory.java
AU        tiles-core/src/main/java/org/apache/tiles/definition/pattern/wildcard/WildcardDefinitionPatternMatcher.java
AU        tiles-core/src/main/java/org/apache/tiles/definition/pattern/wildcard/package-info.java
AU        tiles-core/src/main/java/org/apache/tiles/definition/pattern/BasicPatternDefinitionResolver.java
AU        tiles-core/src/main/java/org/apache/tiles/definition/pattern/DefinitionPatternMatcher.java
A         tiles-core/src/main/java/org/apache/tiles/definition/pattern/regexp
AU        tiles-core/src/main/java/org/apache/tiles/definition/pattern/regexp/RegexpDefinitionPatternMatcherFactory.java
AU        tiles-core/src/main/java/org/apache/tiles/definition/pattern/regexp/package-info.java
AU        tiles-core/src/main/java/org/apache/tiles/definition/pattern/regexp/RegexpDefinitionPatternMatcher.java
AU        tiles-core/src/main/java/org/apache/tiles/definition/pattern/PatternUtil.java
AU        tiles-core/src/main/java/org/apache/tiles/definition/pattern/AbstractPatternDefinitionResolver.java
AU        tiles-core/src/main/java/org/apache/tiles/definition/pattern/PrefixedPatternDefinitionResolver.java
AU        tiles-core/src/main/java/org/apache/tiles/definition/DefinitionsReader.java
AU        tiles-core/src/main/java/org/apache/tiles/definition/UnresolvingLocaleDefinitionsFactory.java
AU        tiles-core/src/main/java/org/apache/tiles/definition/DefinitionsFactoryException.java
AU        tiles-core/src/main/java/org/apache/tiles/definition/DefinitionsFactory.java
AU        tiles-core/src/main/java/org/apache/tiles/definition/FactoryNotFoundException.java
AU        tiles-core/src/main/java/org/apache/tiles/definition/LocaleDefinitionsFactory.java
A         tiles-core/src/main/java/org/apache/tiles/definition/dao
AU        tiles-core/src/main/java/org/apache/tiles/definition/dao/ResolvingLocaleUrlDefinitionDAO.java
AU        tiles-core/src/main/java/org/apache/tiles/definition/dao/BaseLocaleUrlDefinitionDAO.java
AU        tiles-core/src/main/java/org/apache/tiles/definition/dao/CachingLocaleUrlDefinitionDAO.java
AU        tiles-core/src/main/java/org/apache/tiles/definition/dao/DefinitionDAO.java
AU        tiles-core/src/main/java/org/apache/tiles/definition/dao/LocaleUrlDefinitionDAO.java
AU        tiles-core/src/main/java/org/apache/tiles/definition/dao/package-info.java
AU        tiles-core/src/main/java/org/apache/tiles/definition/package-info.java
A         tiles-core/src/main/java/org/apache/tiles/util
AU        tiles-core/src/main/java/org/apache/tiles/util/CombinedBeanInfo.java
AU        tiles-core/src/main/java/org/apache/tiles/util/package-info.java
AU        tiles-core/src/main/java/org/apache/tiles/util/WildcardHelper.java
A         tiles-core/src/main/java/org/apache/tiles/locale
AU        tiles-core/src/main/java/org/apache/tiles/locale/LocaleResolver.java
A         tiles-core/src/main/java/org/apache/tiles/locale/impl
AU        tiles-core/src/main/java/org/apache/tiles/locale/impl/DefaultLocaleResolver.java
AU        tiles-core/src/main/java/org/apache/tiles/locale/impl/package-info.java
AU        tiles-core/src/main/java/org/apache/tiles/locale/package-info.java
A         tiles-core/src/main/java/org/apache/tiles/preparer
A         tiles-core/src/main/java/org/apache/tiles/preparer/factory
AU        tiles-core/src/main/java/org/apache/tiles/preparer/factory/PreparerFactory.java
AU        tiles-core/src/main/java/org/apache/tiles/preparer/factory/BasicPreparerFactory.java
AU        tiles-core/src/main/java/org/apache/tiles/preparer/factory/NoSuchPreparerException.java
AU        tiles-core/src/main/java/org/apache/tiles/preparer/factory/package-info.java
A         tiles-core/src/main/java/org/apache/tiles/impl
AU        tiles-core/src/main/java/org/apache/tiles/impl/InvalidTemplateException.java
A         tiles-core/src/main/java/org/apache/tiles/impl/mgmt
AU        tiles-core/src/main/java/org/apache/tiles/impl/mgmt/package-info.java
AU        tiles-core/src/main/java/org/apache/tiles/impl/mgmt/CachingTilesContainer.java
AU        tiles-core/src/main/java/org/apache/tiles/impl/package-info.java
AU        tiles-core/src/main/java/org/apache/tiles/impl/BasicTilesContainer.java
A         tiles-core/src/main/java/org/apache/tiles/evaluator
AU        tiles-core/src/main/java/org/apache/tiles/evaluator/BasicAttributeEvaluatorFactory.java
A         tiles-core/src/main/java/org/apache/tiles/evaluator/impl
AU        tiles-core/src/main/java/org/apache/tiles/evaluator/impl/DirectAttributeEvaluator.java
AU        tiles-core/src/main/java/org/apache/tiles/evaluator/impl/package-info.java
AU        tiles-core/src/main/java/org/apache/tiles/evaluator/package-info.java
AU        tiles-core/src/main/java/org/apache/tiles/evaluator/AttributeEvaluator.java
AU        tiles-core/src/main/java/org/apache/tiles/evaluator/EvaluationException.java
AU        tiles-core/src/main/java/org/apache/tiles/evaluator/AbstractAttributeEvaluator.java
AU        tiles-core/src/main/java/org/apache/tiles/evaluator/AttributeEvaluatorFactory.java
AU        tiles-core/src/main/java/org/apache/tiles/evaluator/AttributeEvaluatorFactoryAware.java
A         tiles-core/src/main/java/org/apache/tiles/startup
AU        tiles-core/src/main/java/org/apache/tiles/startup/AbstractTilesInitializer.java
AU        tiles-core/src/main/java/org/apache/tiles/startup/DefaultTilesInitializer.java
AU        tiles-core/src/main/java/org/apache/tiles/startup/TilesInitializer.java
AU        tiles-core/src/main/java/org/apache/tiles/startup/package-info.java
A         tiles-core/src/main/java/org/apache/tiles/context
AU        tiles-core/src/main/java/org/apache/tiles/context/TilesRequestContextHolder.java
AU        tiles-core/src/main/java/org/apache/tiles/context/package-info.java
A         tiles-core/src/main/resources
A         tiles-core/src/main/resources/org
A         tiles-core/src/main/resources/org/apache
A         tiles-core/src/main/resources/org/apache/tiles
A         tiles-core/src/main/resources/org/apache/tiles/resources
AU        tiles-core/src/main/resources/org/apache/tiles/resources/tiles-config_3_0.dtd
AU        tiles-core/src/main/resources/NOTICE.txt
AU        tiles-core/src/main/resources/LICENSE.txt
A         tiles-core/src/site
AU        tiles-core/src/site/site.xml
 U        .
At revision 1807478

Parsing POMs
Downloaded artifact http://repo.maven.apache.org/maven2/org/apache/tiles/tiles-master/7/tiles-master-7.pom
Modules changed, recalculating dependency graph
Established TCP socket on 44457
maven33-agent.jar already up to date
maven33-interceptor.jar already up to date
maven3-interceptor-commons.jar already up to date
[Tiles-Framework] $ /home/jenkins/tools/java/latest1.7/bin/java -Xmx2g -Xms256m -cp /home/jenkins/jenkins-slave/maven33-agent.jar:/home/jenkins/tools/maven/apache-maven-3.3.9/boot/plexus-classworlds-2.5.2.jar:/home/jenkins/tools/maven/apache-maven-3.3.9/conf/logging jenkins.maven3.agent.Maven33Main /home/jenkins/tools/maven/apache-maven-3.3.9 /home/jenkins/jenkins-slave/slave.jar /home/jenkins/jenkins-slave/maven33-interceptor.jar /home/jenkins/jenkins-slave/maven3-interceptor-commons.jar 44457
<===[JENKINS REMOTING CAPACITY]===>   channel started
ERROR: ================================================================================
ERROR: Invalid project setup: jenkins/security/MasterToSlaveCallable : Unsupported major.minor version 52.0
ERROR: [JENKINS-18403][JENKINS-28294] JDK 'JDK 1.7 (latest)' not supported to run Maven projects.
ERROR: Maven projects have to be launched with a Java version greater or equal to the minimum version required by the master.
ERROR: Use the Maven JDK Toolchains (plugin) to build your maven project with an older JDK.
ERROR: Retrying with slave Java and setting compile/test properties to point to /home/jenkins/tools/java/latest1.7.
ERROR: ================================================================================
Established TCP socket on 58418
maven33-agent.jar already up to date
maven33-interceptor.jar already up to date
maven3-interceptor-commons.jar already up to date
[Tiles-Framework] $ /usr/local/asfpackages/java/jdk1.8.0_131/jre/bin/java -Xmx2g -Xms256m -cp /home/jenkins/jenkins-slave/maven33-agent.jar:/home/jenkins/tools/maven/apache-maven-3.3.9/boot/plexus-classworlds-2.5.2.jar:/home/jenkins/tools/maven/apache-maven-3.3.9/conf/logging jenkins.maven3.agent.Maven33Main /home/jenkins/tools/maven/apache-maven-3.3.9 /home/jenkins/jenkins-slave/slave.jar /home/jenkins/jenkins-slave/maven33-interceptor.jar /home/jenkins/jenkins-slave/maven3-interceptor-commons.jar 58418
<===[JENKINS REMOTING CAPACITY]===>   channel started
Executing Maven:  -B -f <https://builds.apache.org/job/Tiles-Framework/ws/pom.xml> -Dmaven.repo.local=/home/jenkins/jenkins-slave/maven-repositories/1 clean install
[INFO] Scanning for projects...
[INFO] Downloading: https://repo.maven.apache.org/maven2/org/apache/maven/wagon/wagon-ssh/2.12/wagon-ssh-2.12.pom
[INFO] Downloaded: https://repo.maven.apache.org/maven2/org/apache/maven/wagon/wagon-ssh/2.12/wagon-ssh-2.12.pom (7 KB at 13.5 KB/sec)
[INFO] Downloading: https://repo.maven.apache.org/maven2/org/apache/maven/wagon/wagon-ssh-common/2.12/wagon-ssh-common-2.12.pom
[INFO] Downloaded: https://repo.maven.apache.org/maven2/org/apache/maven/wagon/wagon-ssh-common/2.12/wagon-ssh-common-2.12.pom (2 KB at 98.7 KB/sec)
[INFO] Downloading: https://repo.maven.apache.org/maven2/org/apache/maven/wagon/wagon-ssh/2.12/wagon-ssh-2.12.jar
[INFO] Downloading: https://repo.maven.apache.org/maven2/org/apache/maven/wagon/wagon-ssh-common/2.12/wagon-ssh-common-2.12.jar
[INFO] Downloaded: https://repo.maven.apache.org/maven2/org/apache/maven/wagon/wagon-ssh/2.12/wagon-ssh-2.12.jar (31 KB at 770.4 KB/sec)
[INFO] Downloaded: https://repo.maven.apache.org/maven2/org/apache/maven/wagon/wagon-ssh-common/2.12/wagon-ssh-common-2.12.jar (27 KB at 394.8 KB/sec)
[INFO] ------------------------------------------------------------------------
[INFO] Reactor Build Order:
[INFO]
[INFO] Tiles 3
[INFO] Tiles - API
[INFO] Tiles - Core Library
[INFO] Tiles - Template Technologies Support
[INFO] Tiles - Servlet support
[INFO] Tiles - JSP support
[INFO] Tiles - FreeMarker Support
[INFO] Tiles - Velocity Support
[INFO] Tiles - EL support
[INFO] Tiles - MVEL support
[INFO] Tiles - OGNL support
[INFO] Tiles - Compatibility
[INFO] Tiles - Extras
[INFO] Tiles test webapp module collector
[INFO] Tiles - Test webapp common classes
[INFO] Tiles - Test webapp alternate configuration
[INFO] Tiles - Test webapp database configuration
[INFO] Tiles - Apps - Test
[INFO] Tiles Assembly
[INFO]                                                                        
[INFO] ------------------------------------------------------------------------
[INFO] Building Tiles 3 3.1-SNAPSHOT
[INFO] ------------------------------------------------------------------------
[INFO]
[INFO] --- maven-clean-plugin:3.0.0:clean (default-clean) @ tiles-parent ---
[INFO]
[INFO] --- maven-enforcer-plugin:1.4.1:enforce (enforce-java) @ tiles-parent ---
[WARNING] Rule 0: org.apache.maven.plugins.enforcer.RequireJavaVersion failed with message:
Detected JDK Version: 1.8.0-131 is not in the allowed range [1.8.0-144,1.9).
[INFO] ------------------------------------------------------------------------
[INFO] Reactor Summary:
[INFO]
[INFO] Tiles 3 ............................................ FAILURE [  3.877 s]
[INFO] Tiles - API ........................................ SKIPPED
[INFO] Tiles - Core Library ............................... SKIPPED
[INFO] Tiles - Template Technologies Support .............. SKIPPED
[INFO] Tiles - Servlet support ............................ SKIPPED
[INFO] Tiles - JSP support ................................ SKIPPED
[INFO] Tiles - FreeMarker Support ......................... SKIPPED
[INFO] Tiles - Velocity Support ........................... SKIPPED
[INFO] Tiles - EL support ................................. SKIPPED
[INFO] Tiles - MVEL support ............................... SKIPPED
[INFO] Tiles - OGNL support ............................... SKIPPED
[INFO] Tiles - Compatibility .............................. SKIPPED
[INFO] Tiles - Extras ..................................... SKIPPED
[INFO] Tiles test webapp module collector ................. SKIPPED
[INFO] Tiles - Test webapp common classes ................. SKIPPED
[INFO] Tiles - Test webapp alternate configuration ........ SKIPPED
[INFO] Tiles - Test webapp database configuration ......... SKIPPED
[INFO] Tiles - Apps - Test ................................ SKIPPED
[INFO] Tiles Assembly ..................................... SKIPPED
[INFO] ------------------------------------------------------------------------
[INFO] BUILD FAILURE
[INFO] ------------------------------------------------------------------------
[INFO] Total time: 36.549 s
[INFO] Finished at: 2017-09-06T12:45:03+00:00
[INFO] Final Memory: 21M/296M
[INFO] ------------------------------------------------------------------------
Waiting for Jenkins to finish collecting data
[ERROR] Failed to execute goal org.apache.maven.plugins:maven-enforcer-plugin:1.4.1:enforce (enforce-java) on project tiles-parent: Some Enforcer rules have failed. Look above for specific messages explaining why the rule failed. -> [Help 1]
[ERROR]
[ERROR] To see the full stack trace of the errors, re-run Maven with the -e switch.
[ERROR] Re-run Maven using the -X switch to enable full debug logging.
[ERROR]
[ERROR] For more information about the errors and possible solutions, please read the following articles:
[ERROR] [Help 1] http://cwiki.apache.org/confluence/display/MAVEN/MojoExecutionException
[JENKINS] Archiving <https://builds.apache.org/job/Tiles-Framework/ws/tiles-compat/pom.xml> to org.apache.tiles/tiles-compat/3.1-SNAPSHOT/tiles-compat-3.1-SNAPSHOT.pom
[JENKINS] Archiving <https://builds.apache.org/job/Tiles-Framework/ws/pom.xml> to org.apache.tiles/tiles-parent/3.1-SNAPSHOT/tiles-parent-3.1-SNAPSHOT.pom
[JENKINS] Archiving <https://builds.apache.org/job/Tiles-Framework/ws/tiles-velocity/pom.xml> to org.apache.tiles/tiles-velocity/3.1-SNAPSHOT/tiles-velocity-3.1-SNAPSHOT.pom
[JENKINS] Archiving <https://builds.apache.org/job/Tiles-Framework/ws/tiles-test-pom/tiles-test-common/pom.xml> to org.apache.tiles/tiles-test-common/3.1-SNAPSHOT/tiles-test-common-3.1-SNAPSHOT.pom
[JENKINS] Archiving <https://builds.apache.org/job/Tiles-Framework/ws/tiles-jsp/pom.xml> to org.apache.tiles/tiles-jsp/3.1-SNAPSHOT/tiles-jsp-3.1-SNAPSHOT.pom
[JENKINS] Archiving <https://builds.apache.org/job/Tiles-Framework/ws/tiles-servlet/pom.xml> to org.apache.tiles/tiles-servlet/3.1-SNAPSHOT/tiles-servlet-3.1-SNAPSHOT.pom
[JENKINS] Archiving <https://builds.apache.org/job/Tiles-Framework/ws/tiles-template/pom.xml> to org.apache.tiles/tiles-template/3.1-SNAPSHOT/tiles-template-3.1-SNAPSHOT.pom
[JENKINS] Archiving <https://builds.apache.org/job/Tiles-Framework/ws/tiles-test-pom/tiles-test-db/pom.xml> to org.apache.tiles/tiles-test-db/3.1-SNAPSHOT/tiles-test-db-3.1-SNAPSHOT.pom
[JENKINS] Archiving <https://builds.apache.org/job/Tiles-Framework/ws/tiles-core/pom.xml> to org.apache.tiles/tiles-core/3.1-SNAPSHOT/tiles-core-3.1-SNAPSHOT.pom
[JENKINS] Archiving <https://builds.apache.org/job/Tiles-Framework/ws/tiles-freemarker/pom.xml> to org.apache.tiles/tiles-freemarker/3.1-SNAPSHOT/tiles-freemarker-3.1-SNAPSHOT.pom
[JENKINS] Archiving <https://builds.apache.org/job/Tiles-Framework/ws/tiles-extras/pom.xml> to org.apache.tiles/tiles-extras/3.1-SNAPSHOT/tiles-extras-3.1-SNAPSHOT.pom
[JENKINS] Archiving <https://builds.apache.org/job/Tiles-Framework/ws/tiles-test-pom/pom.xml> to org.apache.tiles/tiles-test-pom/3.1-SNAPSHOT/tiles-test-pom-3.1-SNAPSHOT.pom
[JENKINS] Archiving <https://builds.apache.org/job/Tiles-Framework/ws/tiles-api/pom.xml> to org.apache.tiles/tiles-api/3.1-SNAPSHOT/tiles-api-3.1-SNAPSHOT.pom
[JENKINS] Archiving <https://builds.apache.org/job/Tiles-Framework/ws/tiles-mvel/pom.xml> to org.apache.tiles/tiles-mvel/3.1-SNAPSHOT/tiles-mvel-3.1-SNAPSHOT.pom
[JENKINS] Archiving <https://builds.apache.org/job/Tiles-Framework/ws/assembly/pom.xml> to org.apache.tiles/tiles-assembly/3.1-SNAPSHOT/tiles-assembly-3.1-SNAPSHOT.pom
[JENKINS] Archiving <https://builds.apache.org/job/Tiles-Framework/ws/tiles-test-pom/tiles-test-alt/pom.xml> to org.apache.tiles/tiles-test-alt/3.1-SNAPSHOT/tiles-test-alt-3.1-SNAPSHOT.pom
[JENKINS] Archiving <https://builds.apache.org/job/Tiles-Framework/ws/tiles-ognl/pom.xml> to org.apache.tiles/tiles-ognl/3.1-SNAPSHOT/tiles-ognl-3.1-SNAPSHOT.pom
[JENKINS] Archiving <https://builds.apache.org/job/Tiles-Framework/ws/tiles-el/pom.xml> to org.apache.tiles/tiles-el/3.1-SNAPSHOT/tiles-el-3.1-SNAPSHOT.pom
[JENKINS] Archiving <https://builds.apache.org/job/Tiles-Framework/ws/tiles-test-pom/tiles-test/pom.xml> to org.apache.tiles/tiles-test/3.1-SNAPSHOT/tiles-test-3.1-SNAPSHOT.pom
channel stopped
Reply | Threaded
Open this post in threaded view
|

Jenkins build is back to normal : Tiles-Framework #24

Apache Jenkins Server-2