Build failed in Jenkins: Tiles-AutoTag #20

classic Classic list List threaded Threaded
1 message Options
Reply | Threaded
Open this post in threaded view
|

Build failed in Jenkins: Tiles-AutoTag #20

Apache Jenkins Server-2
See <https://builds.apache.org/job/Tiles-AutoTag/20/display/redirect?page=changes>

Changes:

[mck] fix generation of digests and signatures in assembly subproject

------------------------------------------
[...truncated 22.43 KB...]
A         maven-autotag-plugin/src/test/java/org/apache/tiles/autotag
A         maven-autotag-plugin/src/test/java/org/apache/tiles/autotag/plugin
AU        maven-autotag-plugin/src/test/java/org/apache/tiles/autotag/plugin/CreateDescriptorMojoTest.java
AU        maven-autotag-plugin/src/test/java/org/apache/tiles/autotag/plugin/GenerateJspMojoTest.java
A         maven-autotag-plugin/src/test/java/org/apache/tiles/autotag/plugin/internal
AU        maven-autotag-plugin/src/test/java/org/apache/tiles/autotag/plugin/internal/ExampleExecutableModel.java
A         maven-autotag-plugin/src/test/java/org/apache/tiles/autotag/plugin/internal/ExampleRequest.java
AU        maven-autotag-plugin/src/test/java/org/apache/tiles/autotag/plugin/internal/NotFeasibleExampleModel.java
AU        maven-autotag-plugin/src/test/java/org/apache/tiles/autotag/plugin/internal/ExampleExcluded.java
AU        maven-autotag-plugin/src/test/java/org/apache/tiles/autotag/plugin/internal/AnnotatedExampleModel.java
AU        maven-autotag-plugin/src/test/java/org/apache/tiles/autotag/plugin/internal/ExampleModel.java
AU        maven-autotag-plugin/src/test/java/org/apache/tiles/autotag/plugin/GenerateVelocityMojoTest.java
AU        maven-autotag-plugin/src/test/java/org/apache/tiles/autotag/plugin/AbstractGenerateMojoTest.java
AU        maven-autotag-plugin/src/test/java/org/apache/tiles/autotag/plugin/GenerateFreemarkerMojoTest.java
A         maven-autotag-plugin/src/main
A         maven-autotag-plugin/src/main/java
A         maven-autotag-plugin/src/main/java/org
A         maven-autotag-plugin/src/main/java/org/apache
A         maven-autotag-plugin/src/main/java/org/apache/tiles
A         maven-autotag-plugin/src/main/java/org/apache/tiles/autotag
A         maven-autotag-plugin/src/main/java/org/apache/tiles/autotag/plugin
AU        maven-autotag-plugin/src/main/java/org/apache/tiles/autotag/plugin/GenerateJspMojo.java
AU        maven-autotag-plugin/src/main/java/org/apache/tiles/autotag/plugin/GenerateVelocityMojo.java
AU        maven-autotag-plugin/src/main/java/org/apache/tiles/autotag/plugin/AbstractGenerateMojo.java
AU        maven-autotag-plugin/src/main/java/org/apache/tiles/autotag/plugin/GenerateFreemarkerMojo.java
AU        maven-autotag-plugin/src/main/java/org/apache/tiles/autotag/plugin/package-info.java
AU        maven-autotag-plugin/src/main/java/org/apache/tiles/autotag/plugin/CreateDescriptorMojo.java
A         maven-autotag-plugin/src/main/resources
A         maven-autotag-plugin/src/main/resources/META-INF
A         maven-autotag-plugin/src/main/resources/META-INF/m2e
A         maven-autotag-plugin/src/main/resources/META-INF/m2e/lifecycle-mapping-metadata.xml
A         maven-autotag-plugin/src/site
A         maven-autotag-plugin/src/site/site.xml
AU        maven-autotag-plugin/pom.xml
A         tiles-autotag-freemarker-runtime
A         tiles-autotag-freemarker-runtime/src
A         tiles-autotag-freemarker-runtime/src/test
A         tiles-autotag-freemarker-runtime/src/test/java
A         tiles-autotag-freemarker-runtime/src/test/java/org
A         tiles-autotag-freemarker-runtime/src/test/java/org/apache
A         tiles-autotag-freemarker-runtime/src/test/java/org/apache/tiles
A         tiles-autotag-freemarker-runtime/src/test/java/org/apache/tiles/autotag
A         tiles-autotag-freemarker-runtime/src/test/java/org/apache/tiles/autotag/freemarker
A         tiles-autotag-freemarker-runtime/src/test/java/org/apache/tiles/autotag/freemarker/runtime
A         tiles-autotag-freemarker-runtime/src/test/resources
A         tiles-autotag-freemarker-runtime/src/main
A         tiles-autotag-freemarker-runtime/src/main/resources
A         tiles-autotag-freemarker-runtime/src/main/java
A         tiles-autotag-freemarker-runtime/src/main/java/org
A         tiles-autotag-freemarker-runtime/src/main/java/org/apache
A         tiles-autotag-freemarker-runtime/src/main/java/org/apache/tiles
A         tiles-autotag-freemarker-runtime/src/main/java/org/apache/tiles/autotag
A         tiles-autotag-freemarker-runtime/src/main/java/org/apache/tiles/autotag/freemarker
A         tiles-autotag-freemarker-runtime/src/main/java/org/apache/tiles/autotag/freemarker/runtime
A         tiles-autotag-freemarker-runtime/src/site
A         src
A         src/site
A         src/site/site.xml
A         src/site/apt
A         src/site/apt/taglib.apt
A         src/site/apt/dev
A         src/site/apt/dev/release.apt
A         src/site/apt/plugin.apt
A         src/site/xdoc
A         src/site/xdoc/index.xml
A         src/site/xdoc/dev
A         src/site/xdoc/dev/building.xml
A         src/site/xdoc/dev/snapshots.xml
 U        .
At revision 1814497

Parsing POMs
Downloaded artifact http://repo.maven.apache.org/maven2/org/apache/tiles/tiles-master/7/tiles-master-7.pom
Modules changed, recalculating dependency graph
Established TCP socket on 50650
maven33-agent.jar already up to date
maven33-interceptor.jar already up to date
maven3-interceptor-commons.jar already up to date
[Tiles-AutoTag] $ /home/jenkins/tools/java/latest1.9/bin/java -Xmx2g -Xms256m -cp /home/jenkins/jenkins-slave/maven33-agent.jar:/home/jenkins/tools/maven/apache-maven-3.3.9/boot/plexus-classworlds-2.5.2.jar:/home/jenkins/tools/maven/apache-maven-3.3.9/conf/logging jenkins.maven3.agent.Maven33Main /home/jenkins/tools/maven/apache-maven-3.3.9 /home/jenkins/jenkins-slave/slave.jar /home/jenkins/jenkins-slave/maven33-interceptor.jar /home/jenkins/jenkins-slave/maven3-interceptor-commons.jar 50650
<===[JENKINS REMOTING CAPACITY]===>   channel started
WARNING: An illegal reflective access operation has occurred
WARNING: Illegal reflective access by hudson.remoting.RemoteClassLoader (file:/home/jenkins/jenkins-slave/slave.jar) to method java.lang.ClassLoader.getClassLoadingLock(java.lang.String)
WARNING: Please consider reporting this to the maintainers of hudson.remoting.RemoteClassLoader
WARNING: Use --illegal-access=warn to enable warnings of further illegal reflective access operations
WARNING: All illegal access operations will be denied in a future release
Executing Maven:  -B -f <https://builds.apache.org/job/Tiles-AutoTag/ws/pom.xml> -Dmaven.repo.local=/home/jenkins/jenkins-slave/maven-repositories/1 clean install checkstyle:checkstyle
[INFO] Scanning for projects...
[INFO] Downloading: https://repo.maven.apache.org/maven2/org/apache/maven/wagon/wagon-ssh/2.12/wagon-ssh-2.12.pom
[INFO] Downloaded: https://repo.maven.apache.org/maven2/org/apache/maven/wagon/wagon-ssh/2.12/wagon-ssh-2.12.pom (7 KB at 17.3 KB/sec)
[INFO] Downloading: https://repo.maven.apache.org/maven2/org/apache/maven/wagon/wagon-ssh-common/2.12/wagon-ssh-common-2.12.pom
[INFO] Downloaded: https://repo.maven.apache.org/maven2/org/apache/maven/wagon/wagon-ssh-common/2.12/wagon-ssh-common-2.12.pom (2 KB at 94.0 KB/sec)
[INFO] Downloading: https://repo.maven.apache.org/maven2/org/apache/maven/wagon/wagon-ssh/2.12/wagon-ssh-2.12.jar
[INFO] Downloading: https://repo.maven.apache.org/maven2/org/apache/maven/wagon/wagon-ssh-common/2.12/wagon-ssh-common-2.12.jar
[INFO] Downloaded: https://repo.maven.apache.org/maven2/org/apache/maven/wagon/wagon-ssh/2.12/wagon-ssh-2.12.jar (31 KB at 716.6 KB/sec)
[INFO] Downloaded: https://repo.maven.apache.org/maven2/org/apache/maven/wagon/wagon-ssh-common/2.12/wagon-ssh-common-2.12.jar (27 KB at 394.8 KB/sec)
[INFO] Downloading: https://repo.maven.apache.org/maven2/org/apache/maven/release/maven-release-manager/2.3.2/maven-release-manager-2.3.2.pom
[INFO] Downloaded: https://repo.maven.apache.org/maven2/org/apache/maven/release/maven-release-manager/2.3.2/maven-release-manager-2.3.2.pom (10 KB at 271.0 KB/sec)
[INFO] Downloading: https://repo.maven.apache.org/maven2/org/apache/maven/scm/maven-scm-providers-standard/1.7/maven-scm-providers-standard-1.7.pom
[INFO] Downloaded: https://repo.maven.apache.org/maven2/org/apache/maven/scm/maven-scm-providers-standard/1.7/maven-scm-providers-standard-1.7.pom (4 KB at 98.7 KB/sec)
[INFO] Downloading: https://repo.maven.apache.org/maven2/org/apache/maven/scm/maven-scm-providers/1.7/maven-scm-providers-1.7.pom
[INFO] Downloaded: https://repo.maven.apache.org/maven2/org/apache/maven/scm/maven-scm-providers/1.7/maven-scm-providers-1.7.pom (4 KB at 107.3 KB/sec)
[INFO] Downloading: https://repo.maven.apache.org/maven2/org/apache/maven/scm/maven-scm/1.7/maven-scm-1.7.pom
[INFO] Downloaded: https://repo.maven.apache.org/maven2/org/apache/maven/scm/maven-scm/1.7/maven-scm-1.7.pom (18 KB at 369.6 KB/sec)
[INFO] Downloading: https://repo.maven.apache.org/maven2/org/apache/maven/scm/maven-scm-provider-accurev/1.7/maven-scm-provider-accurev-1.7.pom
[INFO] Downloaded: https://repo.maven.apache.org/maven2/org/apache/maven/scm/maven-scm-provider-accurev/1.7/maven-scm-provider-accurev-1.7.pom (4 KB at 128.0 KB/sec)
[INFO] Downloading: https://repo.maven.apache.org/maven2/org/apache/maven/scm/maven-scm-api/1.7/maven-scm-api-1.7.pom
[INFO] Downloaded: https://repo.maven.apache.org/maven2/org/apache/maven/scm/maven-scm-api/1.7/maven-scm-api-1.7.pom (2 KB at 39.5 KB/sec)
[INFO] Downloading: https://repo.maven.apache.org/maven2/org/apache/maven/scm/maven-scm-provider-bazaar/1.7/maven-scm-provider-bazaar-1.7.pom
[INFO] Downloaded: https://repo.maven.apache.org/maven2/org/apache/maven/scm/maven-scm-provider-bazaar/1.7/maven-scm-provider-bazaar-1.7.pom (3 KB at 118.0 KB/sec)
[INFO] Downloading: https://repo.maven.apache.org/maven2/org/apache/maven/scm/maven-scm-provider-clearcase/1.7/maven-scm-provider-clearcase-1.7.pom
[INFO] Downloaded: https://repo.maven.apache.org/maven2/org/apache/maven/scm/maven-scm-provider-clearcase/1.7/maven-scm-provider-clearcase-1.7.pom (3 KB at 156.1 KB/sec)
[INFO] Downloading: https://repo.maven.apache.org/maven2/org/apache/maven/scm/maven-scm-provider-cvsexe/1.7/maven-scm-provider-cvsexe-1.7.pom
[INFO] Downloaded: https://repo.maven.apache.org/maven2/org/apache/maven/scm/maven-scm-provider-cvsexe/1.7/maven-scm-provider-cvsexe-1.7.pom (3 KB at 79.4 KB/sec)
[INFO] Downloading: https://repo.maven.apache.org/maven2/org/apache/maven/scm/maven-scm-providers-cvs/1.7/maven-scm-providers-cvs-1.7.pom
[INFO] Downloaded: https://repo.maven.apache.org/maven2/org/apache/maven/scm/maven-scm-providers-cvs/1.7/maven-scm-providers-cvs-1.7.pom (2 KB at 104.3 KB/sec)
[INFO] Downloading: https://repo.maven.apache.org/maven2/org/apache/maven/scm/maven-scm-provider-cvs-commons/1.7/maven-scm-provider-cvs-commons-1.7.pom
[INFO] Downloaded: https://repo.maven.apache.org/maven2/org/apache/maven/scm/maven-scm-provider-cvs-commons/1.7/maven-scm-provider-cvs-commons-1.7.pom (3 KB at 148.1 KB/sec)
[INFO] Downloading: https://repo.maven.apache.org/maven2/org/apache/maven/scm/maven-scm-provider-cvsjava/1.7/maven-scm-provider-cvsjava-1.7.pom
[INFO] Downloaded: https://repo.maven.apache.org/maven2/org/apache/maven/scm/maven-scm-provider-cvsjava/1.7/maven-scm-provider-cvsjava-1.7.pom (3 KB at 115.8 KB/sec)
[INFO] Downloading: https://repo.maven.apache.org/maven2/org/apache/maven/scm/maven-scm-provider-gitexe/1.7/maven-scm-provider-gitexe-1.7.pom
[INFO] Downloaded: https://repo.maven.apache.org/maven2/org/apache/maven/scm/maven-scm-provider-gitexe/1.7/maven-scm-provider-gitexe-1.7.pom (3 KB at 97.2 KB/sec)
[INFO] Downloading: https://repo.maven.apache.org/maven2/org/apache/maven/scm/maven-scm-providers-git/1.7/maven-scm-providers-git-1.7.pom
[INFO] Downloaded: https://repo.maven.apache.org/maven2/org/apache/maven/scm/maven-scm-providers-git/1.7/maven-scm-providers-git-1.7.pom (3 KB at 127.0 KB/sec)
[INFO] Downloading: https://repo.maven.apache.org/maven2/org/apache/maven/scm/maven-scm-provider-git-commons/1.7/maven-scm-provider-git-commons-1.7.pom
[INFO] Downloaded: https://repo.maven.apache.org/maven2/org/apache/maven/scm/maven-scm-provider-git-commons/1.7/maven-scm-provider-git-commons-1.7.pom (3 KB at 129.8 KB/sec)
[INFO] Downloading: https://repo.maven.apache.org/maven2/org/apache/maven/scm/maven-scm-provider-hg/1.7/maven-scm-provider-hg-1.7.pom
[INFO] Downloaded: https://repo.maven.apache.org/maven2/org/apache/maven/scm/maven-scm-provider-hg/1.7/maven-scm-provider-hg-1.7.pom (3 KB at 149.2 KB/sec)
[INFO] Downloading: https://repo.maven.apache.org/maven2/org/apache/maven/scm/maven-scm-provider-perforce/1.7/maven-scm-provider-perforce-1.7.pom
[INFO] Downloaded: https://repo.maven.apache.org/maven2/org/apache/maven/scm/maven-scm-provider-perforce/1.7/maven-scm-provider-perforce-1.7.pom (3 KB at 151.0 KB/sec)
[INFO] Downloading: https://repo.maven.apache.org/maven2/org/apache/maven/scm/maven-scm-provider-starteam/1.7/maven-scm-provider-starteam-1.7.pom
[INFO] Downloaded: https://repo.maven.apache.org/maven2/org/apache/maven/scm/maven-scm-provider-starteam/1.7/maven-scm-provider-starteam-1.7.pom (3 KB at 100.6 KB/sec)
[INFO] Downloading: https://repo.maven.apache.org/maven2/org/apache/maven/scm/maven-scm-provider-svnexe/1.7/maven-scm-provider-svnexe-1.7.pom
[INFO] Downloaded: https://repo.maven.apache.org/maven2/org/apache/maven/scm/maven-scm-provider-svnexe/1.7/maven-scm-provider-svnexe-1.7.pom (3 KB at 153.0 KB/sec)
[INFO] Downloading: https://repo.maven.apache.org/maven2/org/apache/maven/scm/maven-scm-providers-svn/1.7/maven-scm-providers-svn-1.7.pom
[INFO] Downloaded: https://repo.maven.apache.org/maven2/org/apache/maven/scm/maven-scm-providers-svn/1.7/maven-scm-providers-svn-1.7.pom (3 KB at 129.6 KB/sec)
[INFO] Downloading: https://repo.maven.apache.org/maven2/org/apache/maven/scm/maven-scm-provider-svn-commons/1.7/maven-scm-provider-svn-commons-1.7.pom
[INFO] Downloaded: https://repo.maven.apache.org/maven2/org/apache/maven/scm/maven-scm-provider-svn-commons/1.7/maven-scm-provider-svn-commons-1.7.pom (3 KB at 164.8 KB/sec)
[INFO] Downloading: https://repo.maven.apache.org/maven2/org/apache/maven/scm/maven-scm-provider-synergy/1.7/maven-scm-provider-synergy-1.7.pom
[INFO] Downloaded: https://repo.maven.apache.org/maven2/org/apache/maven/scm/maven-scm-provider-synergy/1.7/maven-scm-provider-synergy-1.7.pom (2 KB at 73.3 KB/sec)
[INFO] Downloading: https://repo.maven.apache.org/maven2/org/apache/maven/scm/maven-scm-provider-vss/1.7/maven-scm-provider-vss-1.7.pom
[INFO] Downloaded: https://repo.maven.apache.org/maven2/org/apache/maven/scm/maven-scm-provider-vss/1.7/maven-scm-provider-vss-1.7.pom (3 KB at 147.3 KB/sec)
[INFO] Downloading: https://repo.maven.apache.org/maven2/org/apache/maven/scm/maven-scm-provider-tfs/1.7/maven-scm-provider-tfs-1.7.pom
[INFO] Downloaded: https://repo.maven.apache.org/maven2/org/apache/maven/scm/maven-scm-provider-tfs/1.7/maven-scm-provider-tfs-1.7.pom (3 KB at 155.0 KB/sec)
[INFO] Downloading: https://repo.maven.apache.org/maven2/org/apache/maven/scm/maven-scm-provider-integrity/1.7/maven-scm-provider-integrity-1.7.pom
[INFO] Downloaded: https://repo.maven.apache.org/maven2/org/apache/maven/scm/maven-scm-provider-integrity/1.7/maven-scm-provider-integrity-1.7.pom (5 KB at 127.0 KB/sec)
[INFO] Downloading: https://repo.maven.apache.org/maven2/org/apache/maven/scm/maven-scm-provider-jazz/1.7/maven-scm-provider-jazz-1.7.pom
[INFO] Downloaded: https://repo.maven.apache.org/maven2/org/apache/maven/scm/maven-scm-provider-jazz/1.7/maven-scm-provider-jazz-1.7.pom (4 KB at 209.3 KB/sec)
[INFO] Downloading: https://repo.maven.apache.org/maven2/org/apache/maven/scm/maven-scm-manager-plexus/1.7/maven-scm-manager-plexus-1.7.pom
[INFO] Downloaded: https://repo.maven.apache.org/maven2/org/apache/maven/scm/maven-scm-manager-plexus/1.7/maven-scm-manager-plexus-1.7.pom (3 KB at 124.3 KB/sec)
[INFO] Downloading: https://repo.maven.apache.org/maven2/org/apache/maven/scm/maven-scm-managers/1.7/maven-scm-managers-1.7.pom
[INFO] Downloaded: https://repo.maven.apache.org/maven2/org/apache/maven/scm/maven-scm-managers/1.7/maven-scm-managers-1.7.pom (2 KB at 85.5 KB/sec)
[INFO] Downloading: https://repo.maven.apache.org/maven2/org/apache/maven/release/maven-release-manager/2.3.2/maven-release-manager-2.3.2.jar
[INFO] Downloading: https://repo.maven.apache.org/maven2/org/apache/maven/scm/maven-scm-provider-accurev/1.7/maven-scm-provider-accurev-1.7.jar
[INFO] Downloading: https://repo.maven.apache.org/maven2/org/apache/maven/scm/maven-scm-provider-bazaar/1.7/maven-scm-provider-bazaar-1.7.jar
[INFO] Downloading: https://repo.maven.apache.org/maven2/org/apache/maven/scm/maven-scm-provider-clearcase/1.7/maven-scm-provider-clearcase-1.7.jar
[INFO] Downloading: https://repo.maven.apache.org/maven2/org/apache/maven/scm/maven-scm-provider-cvsexe/1.7/maven-scm-provider-cvsexe-1.7.jar
[INFO] Downloaded: https://repo.maven.apache.org/maven2/org/apache/maven/scm/maven-scm-provider-accurev/1.7/maven-scm-provider-accurev-1.7.jar (91 KB at 1529.0 KB/sec)
[INFO] Downloading: https://repo.maven.apache.org/maven2/org/apache/maven/scm/maven-scm-provider-cvs-commons/1.7/maven-scm-provider-cvs-commons-1.7.jar
[INFO] Downloaded: https://repo.maven.apache.org/maven2/org/apache/maven/release/maven-release-manager/2.3.2/maven-release-manager-2.3.2.jar (181 KB at 2912.4 KB/sec)
[INFO] Downloading: https://repo.maven.apache.org/maven2/org/apache/maven/scm/maven-scm-provider-cvsjava/1.7/maven-scm-provider-cvsjava-1.7.jar
[INFO] Downloaded: https://repo.maven.apache.org/maven2/org/apache/maven/scm/maven-scm-provider-cvsexe/1.7/maven-scm-provider-cvsexe-1.7.jar (30 KB at 404.5 KB/sec)
[INFO] Downloading: https://repo.maven.apache.org/maven2/org/apache/maven/scm/maven-scm-provider-hg/1.7/maven-scm-provider-hg-1.7.jar
[INFO] Downloaded: https://repo.maven.apache.org/maven2/org/apache/maven/scm/maven-scm-provider-bazaar/1.7/maven-scm-provider-bazaar-1.7.jar (54 KB at 699.8 KB/sec)
[INFO] Downloading: https://repo.maven.apache.org/maven2/org/apache/maven/scm/maven-scm-provider-perforce/1.7/maven-scm-provider-perforce-1.7.jar
[INFO] Downloaded: https://repo.maven.apache.org/maven2/org/apache/maven/scm/maven-scm-provider-cvsjava/1.7/maven-scm-provider-cvsjava-1.7.jar (43 KB at 481.9 KB/sec)
[INFO] Downloading: https://repo.maven.apache.org/maven2/org/apache/maven/scm/maven-scm-provider-starteam/1.7/maven-scm-provider-starteam-1.7.jar
[INFO] Downloaded: https://repo.maven.apache.org/maven2/org/apache/maven/scm/maven-scm-provider-clearcase/1.7/maven-scm-provider-clearcase-1.7.jar (70 KB at 754.5 KB/sec)
[INFO] Downloading: https://repo.maven.apache.org/maven2/org/apache/maven/scm/maven-scm-provider-synergy/1.7/maven-scm-provider-synergy-1.7.jar
[INFO] Downloaded: https://repo.maven.apache.org/maven2/org/apache/maven/scm/maven-scm-provider-hg/1.7/maven-scm-provider-hg-1.7.jar (64 KB at 582.6 KB/sec)
[INFO] Downloading: https://repo.maven.apache.org/maven2/org/apache/maven/scm/maven-scm-provider-vss/1.7/maven-scm-provider-vss-1.7.jar
[INFO] Downloaded: https://repo.maven.apache.org/maven2/org/apache/maven/scm/maven-scm-provider-perforce/1.7/maven-scm-provider-perforce-1.7.jar (80 KB at 705.9 KB/sec)
[INFO] Downloading: https://repo.maven.apache.org/maven2/org/apache/maven/scm/maven-scm-provider-tfs/1.7/maven-scm-provider-tfs-1.7.jar
[INFO] Downloaded: https://repo.maven.apache.org/maven2/org/apache/maven/scm/maven-scm-provider-cvs-commons/1.7/maven-scm-provider-cvs-commons-1.7.jar (78 KB at 614.1 KB/sec)
[INFO] Downloading: https://repo.maven.apache.org/maven2/org/apache/maven/scm/maven-scm-provider-integrity/1.7/maven-scm-provider-integrity-1.7.jar
[INFO] Downloaded: https://repo.maven.apache.org/maven2/org/apache/maven/scm/maven-scm-provider-starteam/1.7/maven-scm-provider-starteam-1.7.jar (73 KB at 571.6 KB/sec)
[INFO] Downloading: https://repo.maven.apache.org/maven2/org/apache/maven/scm/maven-scm-provider-jazz/1.7/maven-scm-provider-jazz-1.7.jar
[INFO] Downloaded: https://repo.maven.apache.org/maven2/org/apache/maven/scm/maven-scm-provider-synergy/1.7/maven-scm-provider-synergy-1.7.jar (57 KB at 424.8 KB/sec)
[INFO] Downloading: https://repo.maven.apache.org/maven2/org/apache/maven/scm/maven-scm-manager-plexus/1.7/maven-scm-manager-plexus-1.7.jar
[INFO] Downloaded: https://repo.maven.apache.org/maven2/org/apache/maven/scm/maven-scm-provider-tfs/1.7/maven-scm-provider-tfs-1.7.jar (41 KB at 296.5 KB/sec)
[INFO] Downloaded: https://repo.maven.apache.org/maven2/org/apache/maven/scm/maven-scm-provider-vss/1.7/maven-scm-provider-vss-1.7.jar (67 KB at 485.0 KB/sec)
[INFO] Downloaded: https://repo.maven.apache.org/maven2/org/apache/maven/scm/maven-scm-manager-plexus/1.7/maven-scm-manager-plexus-1.7.jar (11 KB at 69.7 KB/sec)
[INFO] Downloaded: https://repo.maven.apache.org/maven2/org/apache/maven/scm/maven-scm-provider-integrity/1.7/maven-scm-provider-integrity-1.7.jar (76 KB at 499.4 KB/sec)
[INFO] Downloaded: https://repo.maven.apache.org/maven2/org/apache/maven/scm/maven-scm-provider-jazz/1.7/maven-scm-provider-jazz-1.7.jar (64 KB at 403.1 KB/sec)
[INFO] ------------------------------------------------------------------------
[INFO] Reactor Build Order:
[INFO]
[INFO] Autotags
[INFO] Autotag - Core runtime
[INFO] Autotag - Core
[INFO] Tiles Autotag - JSP tags automatic generation
[INFO] Autotag - Freemarker support
[INFO] Autotag - Velocity support
[INFO] maven-autotag-plugin Maven Mojo
[INFO] Tiles Autotag Assembly
[INFO] Downloading: https://repo.maven.apache.org/maven2/org/apache/maven/plugins/maven-site-scm-publish-plugin/1.1/maven-site-scm-publish-plugin-1.1.pom
[WARNING] The POM for org.apache.maven.plugins:maven-site-scm-publish-plugin:jar:1.1 is missing, no dependency information available
[INFO] Downloading: https://repo.maven.apache.org/maven2/org/apache/maven/plugins/maven-site-scm-publish-plugin/1.1/maven-site-scm-publish-plugin-1.1.jar
[WARNING] Failed to retrieve plugin descriptor for org.apache.maven.plugins:maven-site-scm-publish-plugin:1.1: Plugin org.apache.maven.plugins:maven-site-scm-publish-plugin:1.1 or one of its dependencies could not be resolved: Could not find artifact org.apache.maven.plugins:maven-site-scm-publish-plugin:jar:1.1 in central (https://repo.maven.apache.org/maven2)
[INFO] Downloading: https://repo.maven.apache.org/maven2/org/codehaus/mojo/wagon-maven-plugin/1.0-beta-5/wagon-maven-plugin-1.0-beta-5.pom
[INFO] Downloaded: https://repo.maven.apache.org/maven2/org/codehaus/mojo/wagon-maven-plugin/1.0-beta-5/wagon-maven-plugin-1.0-beta-5.pom (6 KB at 41.8 KB/sec)
[INFO] Downloading: https://repo.maven.apache.org/maven2/org/codehaus/mojo/wagon-maven-plugin/1.0-beta-5/wagon-maven-plugin-1.0-beta-5.jar
[INFO] Downloaded: https://repo.maven.apache.org/maven2/org/codehaus/mojo/wagon-maven-plugin/1.0-beta-5/wagon-maven-plugin-1.0-beta-5.jar (50 KB at 292.9 KB/sec)
[INFO]                                                                        
[INFO] ------------------------------------------------------------------------
[INFO] Building Autotags 1.3-SNAPSHOT
[INFO] ------------------------------------------------------------------------
[WARNING] The POM for org.apache.maven.plugins:maven-site-scm-publish-plugin:jar:1.1 is missing, no dependency information available
[WARNING] Failed to retrieve plugin descriptor for org.apache.maven.plugins:maven-site-scm-publish-plugin:1.1: Plugin org.apache.maven.plugins:maven-site-scm-publish-plugin:1.1 or one of its dependencies could not be resolved: Failure to find org.apache.maven.plugins:maven-site-scm-publish-plugin:jar:1.1 in https://repo.maven.apache.org/maven2 was cached in the local repository, resolution will not be reattempted until the update interval of central has elapsed or updates are forced
[INFO]
[INFO] --- maven-clean-plugin:3.0.0:clean (default-clean) @ tiles-autotag ---
[INFO]
[INFO] --- maven-enforcer-plugin:1.4.1:enforce (enforce-java) @ tiles-autotag ---
[WARNING] Rule 0: org.apache.maven.plugins.enforcer.RequireJavaVersion failed with message:
Detected JDK Version: 9.0.1 is not in the allowed range [1.8.0-144,1.9).
[INFO] ------------------------------------------------------------------------
[INFO] Reactor Summary:
[INFO]
[INFO] Autotags ........................................... FAILURE [  2.309 s]
[INFO] Autotag - Core runtime ............................. SKIPPED
[INFO] Autotag - Core ..................................... SKIPPED
[INFO] Tiles Autotag - JSP tags automatic generation ...... SKIPPED
[INFO] Autotag - Freemarker support ....................... SKIPPED
[INFO] Autotag - Velocity support ......................... SKIPPED
[INFO] maven-autotag-plugin Maven Mojo .................... SKIPPED
[INFO] Tiles Autotag Assembly ............................. SKIPPED
[INFO] ------------------------------------------------------------------------
[INFO] BUILD FAILURE
[INFO] ------------------------------------------------------------------------
[INFO] Total time: 17.634 s
[INFO] Finished at: 2017-11-07T12:23:11+00:00
[INFO] Final Memory: 27M/256M
[INFO] ------------------------------------------------------------------------
Waiting for Jenkins to finish collecting data
[ERROR] Failed to execute goal org.apache.maven.plugins:maven-enforcer-plugin:1.4.1:enforce (enforce-java) on project tiles-autotag: Some Enforcer rules have failed. Look above for specific messages explaining why the rule failed. -> [Help 1]
[ERROR]
[ERROR] To see the full stack trace of the errors, re-run Maven with the -e switch.
[ERROR] Re-run Maven using the -X switch to enable full debug logging.
[ERROR]
[ERROR] For more information about the errors and possible solutions, please read the following articles:
[ERROR] [Help 1] http://cwiki.apache.org/confluence/display/MAVEN/MojoExecutionException
[JENKINS] Archiving <https://builds.apache.org/job/Tiles-AutoTag/ws/pom.xml> to org.apache.tiles/tiles-autotag/1.3-SNAPSHOT/tiles-autotag-1.3-SNAPSHOT.pom
[JENKINS] Archiving <https://builds.apache.org/job/Tiles-AutoTag/ws/tiles-autotag-velocity/pom.xml> to org.apache.tiles/tiles-autotag-velocity/1.3-SNAPSHOT/tiles-autotag-velocity-1.3-SNAPSHOT.pom
[JENKINS] Archiving <https://builds.apache.org/job/Tiles-AutoTag/ws/maven-autotag-plugin/pom.xml> to org.apache.tiles.autotag.plugin/maven-autotag-plugin/1.3-SNAPSHOT/maven-autotag-plugin-1.3-SNAPSHOT.pom
[JENKINS] Archiving <https://builds.apache.org/job/Tiles-AutoTag/ws/tiles-autotag-core/pom.xml> to org.apache.tiles/tiles-autotag-core/1.3-SNAPSHOT/tiles-autotag-core-1.3-SNAPSHOT.pom
[JENKINS] Archiving <https://builds.apache.org/job/Tiles-AutoTag/ws/assembly/pom.xml> to org.apache.tiles/tiles-autotag-assembly/1.3-SNAPSHOT/tiles-autotag-assembly-1.3-SNAPSHOT.pom
[JENKINS] Archiving <https://builds.apache.org/job/Tiles-AutoTag/ws/tiles-autotag-core-runtime/pom.xml> to org.apache.tiles/tiles-autotag-core-runtime/1.3-SNAPSHOT/tiles-autotag-core-runtime-1.3-SNAPSHOT.pom
[JENKINS] Archiving <https://builds.apache.org/job/Tiles-AutoTag/ws/tiles-autotag-jsp/pom.xml> to org.apache.tiles/tiles-autotag-jsp/1.3-SNAPSHOT/tiles-autotag-jsp-1.3-SNAPSHOT.pom
[JENKINS] Archiving <https://builds.apache.org/job/Tiles-AutoTag/ws/tiles-autotag-freemarker/pom.xml> to org.apache.tiles/tiles-autotag-freemarker/1.3-SNAPSHOT/tiles-autotag-freemarker-1.3-SNAPSHOT.pom
channel stopped