Build failed in Jenkins: Tiles-AutoTag #16

classic Classic list List threaded Threaded
2 messages Options
Reply | Threaded
Open this post in threaded view
|

Build failed in Jenkins: Tiles-AutoTag #16

Apache Jenkins Server-2
See <https://builds.apache.org/job/Tiles-AutoTag/16/display/redirect?page=changes>

Changes:

[mck] use Tiles Master 7

------------------------------------------
[...truncated 16.23 KB...]
A         maven-autotag-plugin/src/site/site.xml
AU        maven-autotag-plugin/pom.xml
A         tiles-autotag-freemarker-runtime
A         tiles-autotag-freemarker-runtime/src
A         tiles-autotag-freemarker-runtime/src/main
A         tiles-autotag-freemarker-runtime/src/main/java
A         tiles-autotag-freemarker-runtime/src/main/java/org
A         tiles-autotag-freemarker-runtime/src/main/java/org/apache
A         tiles-autotag-freemarker-runtime/src/main/java/org/apache/tiles
A         tiles-autotag-freemarker-runtime/src/main/java/org/apache/tiles/autotag
A         tiles-autotag-freemarker-runtime/src/main/java/org/apache/tiles/autotag/freemarker
A         tiles-autotag-freemarker-runtime/src/main/java/org/apache/tiles/autotag/freemarker/runtime
A         tiles-autotag-freemarker-runtime/src/main/resources
A         tiles-autotag-freemarker-runtime/src/site
A         tiles-autotag-freemarker-runtime/src/test
A         tiles-autotag-freemarker-runtime/src/test/resources
A         tiles-autotag-freemarker-runtime/src/test/java
A         tiles-autotag-freemarker-runtime/src/test/java/org
A         tiles-autotag-freemarker-runtime/src/test/java/org/apache
A         tiles-autotag-freemarker-runtime/src/test/java/org/apache/tiles
A         tiles-autotag-freemarker-runtime/src/test/java/org/apache/tiles/autotag
A         tiles-autotag-freemarker-runtime/src/test/java/org/apache/tiles/autotag/freemarker
A         tiles-autotag-freemarker-runtime/src/test/java/org/apache/tiles/autotag/freemarker/runtime
A         src
A         src/site
A         src/site/xdoc
A         src/site/xdoc/index.xml
A         src/site/xdoc/dev
A         src/site/xdoc/dev/snapshots.xml
A         src/site/xdoc/dev/building.xml
A         src/site/site.xml
A         src/site/apt
A         src/site/apt/taglib.apt
A         src/site/apt/dev
A         src/site/apt/dev/release.apt
A         src/site/apt/plugin.apt
A         tiles-autotag-core
A         tiles-autotag-core/src
A         tiles-autotag-core/src/main
A         tiles-autotag-core/src/main/java
A         tiles-autotag-core/src/main/java/org
A         tiles-autotag-core/src/main/java/org/apache
A         tiles-autotag-core/src/main/java/org/apache/tiles
A         tiles-autotag-core/src/main/java/org/apache/tiles/autotag
A         tiles-autotag-core/src/main/java/org/apache/tiles/autotag/core
A         tiles-autotag-core/src/main/java/org/apache/tiles/autotag/core/OutputLocator.java
AU        tiles-autotag-core/src/main/java/org/apache/tiles/autotag/core/package-info.java
AU        tiles-autotag-core/src/main/java/org/apache/tiles/autotag/core/AutotagRuntimeException.java
A         tiles-autotag-core/src/main/java/org/apache/tiles/autotag/core/DirectoryOutputLocator.java
AU        tiles-autotag-core/src/main/java/org/apache/tiles/autotag/core/QDoxTemplateSuiteFactory.java
AU        tiles-autotag-core/src/main/java/org/apache/tiles/autotag/core/ClassParseException.java
A         tiles-autotag-core/src/main/java/org/apache/tiles/autotag/generate
AU        tiles-autotag-core/src/main/java/org/apache/tiles/autotag/generate/BasicTemplateGenerator.java
AU        tiles-autotag-core/src/main/java/org/apache/tiles/autotag/generate/package-info.java
AU        tiles-autotag-core/src/main/java/org/apache/tiles/autotag/generate/TemplateClassGenerator.java
AU        tiles-autotag-core/src/main/java/org/apache/tiles/autotag/generate/TemplateGeneratorBuilder.java
AU        tiles-autotag-core/src/main/java/org/apache/tiles/autotag/generate/TemplateGeneratorFactory.java
AU        tiles-autotag-core/src/main/java/org/apache/tiles/autotag/generate/AbstractTemplateClassGenerator.java
AU        tiles-autotag-core/src/main/java/org/apache/tiles/autotag/generate/TemplateSuiteGenerator.java
AU        tiles-autotag-core/src/main/java/org/apache/tiles/autotag/generate/AbstractTemplateSuiteGenerator.java
AU        tiles-autotag-core/src/main/java/org/apache/tiles/autotag/generate/TemplateGenerator.java
A         tiles-autotag-core/src/main/java/org/apache/tiles/autotag/tool
AU        tiles-autotag-core/src/main/java/org/apache/tiles/autotag/tool/StringTool.java
AU        tiles-autotag-core/src/main/java/org/apache/tiles/autotag/tool/package-info.java
A         tiles-autotag-core/src/main/java/org/apache/tiles/autotag/model
AU        tiles-autotag-core/src/main/java/org/apache/tiles/autotag/model/TemplateMethod.java
AU        tiles-autotag-core/src/main/java/org/apache/tiles/autotag/model/TemplateParameter.java
AU        tiles-autotag-core/src/main/java/org/apache/tiles/autotag/model/TemplateSuiteFactory.java
AU        tiles-autotag-core/src/main/java/org/apache/tiles/autotag/model/TemplateClass.java
AU        tiles-autotag-core/src/main/java/org/apache/tiles/autotag/model/package-info.java
AU        tiles-autotag-core/src/main/java/org/apache/tiles/autotag/model/TemplateSuite.java
A         tiles-autotag-core/src/main/resources
A         tiles-autotag-core/src/main/resources/org
A         tiles-autotag-core/src/main/resources/org/apache
A         tiles-autotag-core/src/main/resources/org/apache/tiles
A         tiles-autotag-core/src/main/resources/org/apache/tiles/autotag
AU        tiles-autotag-core/src/main/resources/org/apache/tiles/autotag/velocity.properties
A         tiles-autotag-core/src/site
A         tiles-autotag-core/src/site/site.xml
A         tiles-autotag-core/src/test
A         tiles-autotag-core/src/test/java
A         tiles-autotag-core/src/test/java/org
A         tiles-autotag-core/src/test/java/org/apache
A         tiles-autotag-core/src/test/java/org/apache/tiles
A         tiles-autotag-core/src/test/java/org/apache/tiles/autotag
A         tiles-autotag-core/src/test/java/org/apache/tiles/autotag/tool
AU        tiles-autotag-core/src/test/java/org/apache/tiles/autotag/tool/StringToolTest.java
A         tiles-autotag-core/src/test/java/org/apache/tiles/autotag/model
AU        tiles-autotag-core/src/test/java/org/apache/tiles/autotag/model/TemplateMethodTest.java
AU        tiles-autotag-core/src/test/java/org/apache/tiles/autotag/model/TemplateParameterTest.java
AU        tiles-autotag-core/src/test/java/org/apache/tiles/autotag/model/TemplateClassTest.java
AU        tiles-autotag-core/src/test/java/org/apache/tiles/autotag/model/TemplateSuiteTest.java
A         tiles-autotag-core/src/test/java/org/apache/tiles/autotag/core
AU        tiles-autotag-core/src/test/java/org/apache/tiles/autotag/core/QDoxTemplateSuiteFactoryTest.java
A         tiles-autotag-core/src/test/java/org/apache/tiles/autotag/core/internal
AU        tiles-autotag-core/src/test/java/org/apache/tiles/autotag/core/internal/NotFeasibleExampleModel.java
AU        tiles-autotag-core/src/test/java/org/apache/tiles/autotag/core/internal/ExampleExcluded.java
AU        tiles-autotag-core/src/test/java/org/apache/tiles/autotag/core/internal/AnnotatedExampleModel.java
AU        tiles-autotag-core/src/test/java/org/apache/tiles/autotag/core/internal/ExampleModel.java
AU        tiles-autotag-core/src/test/java/org/apache/tiles/autotag/core/internal/ExampleExecutableModel.java
A         tiles-autotag-core/src/test/java/org/apache/tiles/autotag/core/internal/ExampleRequest.java
AU        tiles-autotag-core/src/test/java/org/apache/tiles/autotag/core/ClassParseExceptionTest.java
AU        tiles-autotag-core/src/test/java/org/apache/tiles/autotag/core/AutotagRuntimeExceptionTest.java
A         tiles-autotag-core/src/test/java/org/apache/tiles/autotag/generate
AU        tiles-autotag-core/src/test/java/org/apache/tiles/autotag/generate/TemplateGeneratorBuilderTest.java
AU        tiles-autotag-core/src/test/java/org/apache/tiles/autotag/generate/AbstractTemplateClassGeneratorTest.java
AU        tiles-autotag-core/src/test/java/org/apache/tiles/autotag/generate/AbstractTemplateSuiteGeneratorTest.java
AU        tiles-autotag-core/src/test/java/org/apache/tiles/autotag/generate/BasicTemplateGeneratorTest.java
A         tiles-autotag-core/src/test/resources
AU        tiles-autotag-core/pom.xml
A         tiles-autotag-core-runtime
AU        tiles-autotag-core-runtime/pom.xml
A         tiles-autotag-core-runtime/src
A         tiles-autotag-core-runtime/src/main
A         tiles-autotag-core-runtime/src/main/java
A         tiles-autotag-core-runtime/src/main/java/org
A         tiles-autotag-core-runtime/src/main/java/org/apache
A         tiles-autotag-core-runtime/src/main/java/org/apache/tiles
A         tiles-autotag-core-runtime/src/main/java/org/apache/tiles/autotag
A         tiles-autotag-core-runtime/src/main/java/org/apache/tiles/autotag/core
A         tiles-autotag-core-runtime/src/main/java/org/apache/tiles/autotag/core/runtime
AU        tiles-autotag-core-runtime/src/main/java/org/apache/tiles/autotag/core/runtime/AbstractModelBody.java
A         tiles-autotag-core-runtime/src/main/java/org/apache/tiles/autotag/core/runtime/composition
AU        tiles-autotag-core-runtime/src/main/java/org/apache/tiles/autotag/core/runtime/package-info.java
AU        tiles-autotag-core-runtime/src/main/java/org/apache/tiles/autotag/core/runtime/AutotagRuntime.java
A         tiles-autotag-core-runtime/src/main/java/org/apache/tiles/autotag/core/runtime/annotation
AU        tiles-autotag-core-runtime/src/main/java/org/apache/tiles/autotag/core/runtime/annotation/package-info.java
AU        tiles-autotag-core-runtime/src/main/java/org/apache/tiles/autotag/core/runtime/annotation/Parameter.java
A         tiles-autotag-core-runtime/src/main/java/org/apache/tiles/autotag/core/runtime/util
AU        tiles-autotag-core-runtime/src/main/java/org/apache/tiles/autotag/core/runtime/util/package-info.java
AU        tiles-autotag-core-runtime/src/main/java/org/apache/tiles/autotag/core/runtime/util/NullWriter.java
AU        tiles-autotag-core-runtime/src/main/java/org/apache/tiles/autotag/core/runtime/ModelBody.java
A         tiles-autotag-core-runtime/src/main/resources
A         tiles-autotag-core-runtime/src/site
A         tiles-autotag-core-runtime/src/site/site.xml
A         tiles-autotag-core-runtime/src/test
A         tiles-autotag-core-runtime/src/test/java
A         tiles-autotag-core-runtime/src/test/java/org
A         tiles-autotag-core-runtime/src/test/java/org/apache
A         tiles-autotag-core-runtime/src/test/java/org/apache/tiles
A         tiles-autotag-core-runtime/src/test/java/org/apache/tiles/autotag
A         tiles-autotag-core-runtime/src/test/java/org/apache/tiles/autotag/core
A         tiles-autotag-core-runtime/src/test/java/org/apache/tiles/autotag/core/runtime
AU        tiles-autotag-core-runtime/src/test/java/org/apache/tiles/autotag/core/runtime/AbstractModelBodyTest.java
A         tiles-autotag-core-runtime/src/test/java/org/apache/tiles/autotag/core/runtime/composition
A         tiles-autotag-core-runtime/src/test/java/org/apache/tiles/autotag/core/runtime/util
AU        tiles-autotag-core-runtime/src/test/java/org/apache/tiles/autotag/core/runtime/util/NullWriterTest.java
A         tiles-autotag-core-runtime/src/test/resources
AU        pom.xml
 U        .
At revision 1807476

Parsing POMs
Downloaded artifact http://repo.maven.apache.org/maven2/org/apache/tiles/tiles-master/7/tiles-master-7.pom
Modules changed, recalculating dependency graph
Established TCP socket on 55938
maven33-agent.jar already up to date
maven33-interceptor.jar already up to date
maven3-interceptor-commons.jar already up to date
[Tiles-AutoTag] $ /home/jenkins/tools/java/latest1.7/bin/java -Xmx2g -Xms256m -cp /home/jenkins/jenkins-slave/maven33-agent.jar:/home/jenkins/tools/maven/apache-maven-3.3.9/boot/plexus-classworlds-2.5.2.jar:/home/jenkins/tools/maven/apache-maven-3.3.9/conf/logging jenkins.maven3.agent.Maven33Main /home/jenkins/tools/maven/apache-maven-3.3.9 /home/jenkins/jenkins-slave/slave.jar /home/jenkins/jenkins-slave/maven33-interceptor.jar /home/jenkins/jenkins-slave/maven3-interceptor-commons.jar 55938
<===[JENKINS REMOTING CAPACITY]===>   channel started
ERROR: ================================================================================
ERROR: Invalid project setup: jenkins/security/MasterToSlaveCallable : Unsupported major.minor version 52.0
ERROR: [JENKINS-18403][JENKINS-28294] JDK 'JDK 1.7 (latest)' not supported to run Maven projects.
ERROR: Maven projects have to be launched with a Java version greater or equal to the minimum version required by the master.
ERROR: Use the Maven JDK Toolchains (plugin) to build your maven project with an older JDK.
ERROR: Retrying with slave Java and setting compile/test properties to point to /home/jenkins/tools/java/latest1.7.
ERROR: ================================================================================
Established TCP socket on 44846
maven33-agent.jar already up to date
maven33-interceptor.jar already up to date
maven3-interceptor-commons.jar already up to date
[Tiles-AutoTag] $ /usr/local/asfpackages/java/jdk1.8.0_131/jre/bin/java -Xmx2g -Xms256m -cp /home/jenkins/jenkins-slave/maven33-agent.jar:/home/jenkins/tools/maven/apache-maven-3.3.9/boot/plexus-classworlds-2.5.2.jar:/home/jenkins/tools/maven/apache-maven-3.3.9/conf/logging jenkins.maven3.agent.Maven33Main /home/jenkins/tools/maven/apache-maven-3.3.9 /home/jenkins/jenkins-slave/slave.jar /home/jenkins/jenkins-slave/maven33-interceptor.jar /home/jenkins/jenkins-slave/maven3-interceptor-commons.jar 44846
<===[JENKINS REMOTING CAPACITY]===>   channel started
Executing Maven:  -B -f <https://builds.apache.org/job/Tiles-AutoTag/ws/pom.xml> -Dmaven.repo.local=/home/jenkins/jenkins-slave/maven-repositories/1 clean install checkstyle:checkstyle
[INFO] Scanning for projects...
[INFO] Downloading: https://repo.maven.apache.org/maven2/org/apache/maven/wagon/wagon-ssh/2.12/wagon-ssh-2.12.pom
[INFO] Downloaded: https://repo.maven.apache.org/maven2/org/apache/maven/wagon/wagon-ssh/2.12/wagon-ssh-2.12.pom (7 KB at 12.7 KB/sec)
[INFO] Downloading: https://repo.maven.apache.org/maven2/org/apache/maven/wagon/wagon-ssh-common/2.12/wagon-ssh-common-2.12.pom
[INFO] Downloaded: https://repo.maven.apache.org/maven2/org/apache/maven/wagon/wagon-ssh-common/2.12/wagon-ssh-common-2.12.pom (2 KB at 49.3 KB/sec)
[INFO] Downloading: https://repo.maven.apache.org/maven2/org/apache/maven/wagon/wagon-ssh/2.12/wagon-ssh-2.12.jar
[INFO] Downloading: https://repo.maven.apache.org/maven2/org/apache/maven/wagon/wagon-ssh-common/2.12/wagon-ssh-common-2.12.jar
[INFO] Downloaded: https://repo.maven.apache.org/maven2/org/apache/maven/wagon/wagon-ssh/2.12/wagon-ssh-2.12.jar (31 KB at 428.0 KB/sec)
[INFO] Downloaded: https://repo.maven.apache.org/maven2/org/apache/maven/wagon/wagon-ssh-common/2.12/wagon-ssh-common-2.12.jar (27 KB at 250.5 KB/sec)
[INFO] ------------------------------------------------------------------------
[INFO] Reactor Build Order:
[INFO]
[INFO] Autotags
[INFO] Autotag - Core runtime
[INFO] Autotag - Core
[INFO] Tiles Autotag - JSP tags automatic generation
[INFO] Autotag - Freemarker support
[INFO] Autotag - Velocity support
[INFO] maven-autotag-plugin Maven Mojo
[INFO] Tiles Autotag Assembly
[INFO] Downloading: https://repo.maven.apache.org/maven2/org/apache/maven/plugins/maven-site-scm-publish-plugin/1.1/maven-site-scm-publish-plugin-1.1.pom
[WARNING] The POM for org.apache.maven.plugins:maven-site-scm-publish-plugin:jar:1.1 is missing, no dependency information available
[INFO] Downloading: https://repo.maven.apache.org/maven2/org/apache/maven/plugins/maven-site-scm-publish-plugin/1.1/maven-site-scm-publish-plugin-1.1.jar
[WARNING] Failed to retrieve plugin descriptor for org.apache.maven.plugins:maven-site-scm-publish-plugin:1.1: Plugin org.apache.maven.plugins:maven-site-scm-publish-plugin:1.1 or one of its dependencies could not be resolved: Could not find artifact org.apache.maven.plugins:maven-site-scm-publish-plugin:jar:1.1 in central (https://repo.maven.apache.org/maven2)
[INFO] Downloading: https://repo.maven.apache.org/maven2/org/codehaus/mojo/wagon-maven-plugin/1.0-beta-5/wagon-maven-plugin-1.0-beta-5.pom
[INFO] Downloaded: https://repo.maven.apache.org/maven2/org/codehaus/mojo/wagon-maven-plugin/1.0-beta-5/wagon-maven-plugin-1.0-beta-5.pom (6 KB at 65.1 KB/sec)
[INFO] Downloading: https://repo.maven.apache.org/maven2/org/codehaus/mojo/wagon-maven-plugin/1.0-beta-5/wagon-maven-plugin-1.0-beta-5.jar
[INFO] Downloaded: https://repo.maven.apache.org/maven2/org/codehaus/mojo/wagon-maven-plugin/1.0-beta-5/wagon-maven-plugin-1.0-beta-5.jar (50 KB at 697.1 KB/sec)
[INFO]                                                                        
[INFO] ------------------------------------------------------------------------
[INFO] Building Autotags 1.3-SNAPSHOT
[INFO] ------------------------------------------------------------------------
[WARNING] The POM for org.apache.maven.plugins:maven-site-scm-publish-plugin:jar:1.1 is missing, no dependency information available
[WARNING] Failed to retrieve plugin descriptor for org.apache.maven.plugins:maven-site-scm-publish-plugin:1.1: Plugin org.apache.maven.plugins:maven-site-scm-publish-plugin:1.1 or one of its dependencies could not be resolved: Failure to find org.apache.maven.plugins:maven-site-scm-publish-plugin:jar:1.1 in https://repo.maven.apache.org/maven2 was cached in the local repository, resolution will not be reattempted until the update interval of central has elapsed or updates are forced
[INFO]
[INFO] --- maven-clean-plugin:3.0.0:clean (default-clean) @ tiles-autotag ---
[INFO]
[INFO] --- maven-enforcer-plugin:1.4.1:enforce (enforce-java) @ tiles-autotag ---
[WARNING] Rule 0: org.apache.maven.plugins.enforcer.RequireJavaVersion failed with message:
Detected JDK Version: 1.8.0-131 is not in the allowed range [1.8.0-144,1.9).
[INFO] ------------------------------------------------------------------------
[INFO] Reactor Summary:
[INFO]
[INFO] Autotags ........................................... FAILURE [  2.550 s]
[INFO] Autotag - Core runtime ............................. SKIPPED
[INFO] Autotag - Core ..................................... SKIPPED
[INFO] Tiles Autotag - JSP tags automatic generation ...... SKIPPED
[INFO] Autotag - Freemarker support ....................... SKIPPED
[INFO] Autotag - Velocity support ......................... SKIPPED
[INFO] maven-autotag-plugin Maven Mojo .................... SKIPPED
[INFO] Tiles Autotag Assembly ............................. SKIPPED
[INFO] ------------------------------------------------------------------------
[INFO] BUILD FAILURE
[INFO] ------------------------------------------------------------------------
[INFO] Total time: 14.465 s
[INFO] Finished at: 2017-09-06T12:20:58+00:00
[INFO] Final Memory: 28M/396M
[INFO] ------------------------------------------------------------------------
[ERROR] Failed to execute goal org.apache.maven.plugins:maven-enforcer-plugin:1.4.1:enforce (enforce-java) on project tiles-autotag: Some Enforcer rules have failed. Look above for specific messages explaining why the rule failed. -> [Help 1]
[ERROR]
[ERROR] To see the full stack trace of the errors, re-run Maven with the -e switch.
[ERROR] Re-run Maven using the -X switch to enable full debug logging.
[ERROR]
[ERROR] For more information about the errors and possible solutions, please read the following articles:
[ERROR] [Help 1] http://cwiki.apache.org/confluence/display/MAVEN/MojoExecutionException
[JENKINS] Archiving <https://builds.apache.org/job/Tiles-AutoTag/ws/pom.xml> to org.apache.tiles/tiles-autotag/1.3-SNAPSHOT/tiles-autotag-1.3-SNAPSHOT.pom
[JENKINS] Archiving <https://builds.apache.org/job/Tiles-AutoTag/ws/tiles-autotag-velocity/pom.xml> to org.apache.tiles/tiles-autotag-velocity/1.3-SNAPSHOT/tiles-autotag-velocity-1.3-SNAPSHOT.pom
[JENKINS] Archiving <https://builds.apache.org/job/Tiles-AutoTag/ws/maven-autotag-plugin/pom.xml> to org.apache.tiles.autotag.plugin/maven-autotag-plugin/1.3-SNAPSHOT/maven-autotag-plugin-1.3-SNAPSHOT.pom
[JENKINS] Archiving <https://builds.apache.org/job/Tiles-AutoTag/ws/tiles-autotag-core/pom.xml> to org.apache.tiles/tiles-autotag-core/1.3-SNAPSHOT/tiles-autotag-core-1.3-SNAPSHOT.pom
[JENKINS] Archiving <https://builds.apache.org/job/Tiles-AutoTag/ws/assembly/pom.xml> to org.apache.tiles/tiles-autotag-assembly/1.3-SNAPSHOT/tiles-autotag-assembly-1.3-SNAPSHOT.pom
[JENKINS] Archiving <https://builds.apache.org/job/Tiles-AutoTag/ws/tiles-autotag-core-runtime/pom.xml> to org.apache.tiles/tiles-autotag-core-runtime/1.3-SNAPSHOT/tiles-autotag-core-runtime-1.3-SNAPSHOT.pom
[JENKINS] Archiving <https://builds.apache.org/job/Tiles-AutoTag/ws/tiles-autotag-jsp/pom.xml> to org.apache.tiles/tiles-autotag-jsp/1.3-SNAPSHOT/tiles-autotag-jsp-1.3-SNAPSHOT.pom
[JENKINS] Archiving <https://builds.apache.org/job/Tiles-AutoTag/ws/tiles-autotag-freemarker/pom.xml> to org.apache.tiles/tiles-autotag-freemarker/1.3-SNAPSHOT/tiles-autotag-freemarker-1.3-SNAPSHOT.pom
channel stopped
Reply | Threaded
Open this post in threaded view
|

Jenkins build is back to normal : Tiles-AutoTag #17

Apache Jenkins Server-2