Build failed in Jenkins: Struts-site-javadocs #7

classic Classic list List threaded Threaded
6 messages Options
Reply | Threaded
Open this post in threaded view
|

Build failed in Jenkins: Struts-site-javadocs #7

Apache Jenkins Server-2
See <https://builds.apache.org/job/Struts-site-javadocs/7/display/redirect>

------------------------------------------
[...truncated 1.47 MB...]
[INFO] Checking for updates
[INFO] Skipping NVD check since last check was within 4 hours.
[INFO] Check for updates complete (19 ms)
[INFO] Analysis Started
[INFO] Finished Archive Analyzer (0 seconds)
[INFO] Finished File Name Analyzer (0 seconds)
[INFO] Finished Jar Analyzer (0 seconds)
[INFO] Finished Central Analyzer (0 seconds)
[INFO] Finished Dependency Merging Analyzer (0 seconds)
[INFO] Finished Version Filter Analyzer (0 seconds)
[INFO] Finished Hint Analyzer (0 seconds)
[INFO] Created CPE Index (0 seconds)
[INFO] Finished CPE Analyzer (0 seconds)
[INFO] Finished False Positive Analyzer (0 seconds)
[INFO] Finished Cpe Suppression Analyzer (0 seconds)
[INFO] Finished NVD CVE Analyzer (0 seconds)
[INFO] Finished Vulnerability Suppression Analyzer (0 seconds)
[INFO] Finished Dependency Bundling Analyzer (0 seconds)
[INFO] Analysis Complete (1 seconds)
[WARNING]

One or more dependencies were identified with known vulnerabilities in Struts 2 TestNG Plugin:

bsh-2.0b4.jar (org.beanshell:bsh:2.0b4, cpe:/a:beanshell_project:beanshell:2.0.b4) : CVE-2016-2510
spring-core-4.1.9.RELEASE.jar (cpe:/a:springsource:spring_framework:4.1.9, cpe:/a:vmware:springsource_spring_framework:4.1.9, cpe:/a:pivotal:spring_framework:4.1.9, cpe:/a:pivotal_software:spring_framework:4.1.9, org.springframework:spring-core:4.1.9.RELEASE) : CVE-2016-5007


See the dependency-check report for more details.


[INFO] Generating "Dependency Updates Report" report --- versions-maven-plugin:2.5:dependency-updates-report
[INFO] Generating "Plugin Updates Report" report --- versions-maven-plugin:2.5:plugin-updates-report
[INFO] Generating "Property Updates Report" report --- versions-maven-plugin:2.5:property-updates-report
[INFO]
[INFO] --- maven-site-plugin:3.5.1:stage (default-cli) @ struts2-testng-plugin ---
[INFO] Using this base directory for staging: <https://builds.apache.org/job/Struts-site-javadocs/ws/target/struts-project/plugins/content/maven>
file://<https://builds.apache.org/job/Struts-site-javadocs/ws/target/struts-project/plugins/content/maven/> - Session: Opened  
[INFO] Pushing <https://builds.apache.org/job/Struts-site-javadocs/ws/target/struts-project/plugins/testng/target/site>
[INFO]    >>> to file://<https://builds.apache.org/job/Struts-site-javadocs/ws/target/struts-project/plugins/content/maven/struts2-parent/struts2-plugins/struts2-testng-plugin>
file://<https://builds.apache.org/job/Struts-site-javadocs/ws/target/struts-project/plugins/content/maven/> - Session: Disconnecting  
file://<https://builds.apache.org/job/Struts-site-javadocs/ws/target/struts-project/plugins/content/maven/> - Session: Disconnected
[INFO]
[INFO] ------------------------------------------------------------------------
[INFO] Building Struts OSGi Bundles 2.5.14.1
[INFO] ------------------------------------------------------------------------
[INFO]
[INFO] --- maven-site-plugin:3.5.1:site (default-cli) @ struts2-osgi-bundles ---
[INFO] configuring report plugin org.apache.maven.plugins:maven-project-info-reports-plugin:2.7
[INFO] configuring report plugin org.apache.maven.plugins:maven-javadoc-plugin:2.10.3
[INFO] preparing 'javadoc' report requires 'generate-sources' forked phase execution
[INFO]
[INFO] >>> maven-javadoc-plugin:2.10.3:javadoc > generate-sources @ struts2-osgi-bundles >>>
[INFO]
[INFO] <<< maven-javadoc-plugin:2.10.3:javadoc < generate-sources @ struts2-osgi-bundles <<<
[INFO]
[INFO] configuring report plugin org.apache.rat:apache-rat-plugin:0.11
[INFO] configuring report plugin org.owasp:dependency-check-maven:3.0.2
[INFO] configuring report plugin org.codehaus.mojo:versions-maven-plugin:2.5
[INFO] configuring report plugin org.codehaus.mojo:rat-maven-plugin:1.0-alpha-2
[INFO] Rendering site with org.apache.maven.skins:maven-fluido-skin:jar:1.6 skin.
[INFO] Skipped "RAT Report" report (rat-maven-plugin:1.0-alpha-2:rat), file "rat-report.html" already exists for the English version.
[INFO] Generating "About" report                --- maven-project-info-reports-plugin:2.7:index
[INFO] Generating "Plugin Management" report    --- maven-project-info-reports-plugin:2.7:plugin-management
[INFO] Generating "Distribution Management" report --- maven-project-info-reports-plugin:2.7:distribution-management
[INFO] Generating "Dependency Information" report --- maven-project-info-reports-plugin:2.7:dependency-info
[INFO] Generating "Source Repository" report    --- maven-project-info-reports-plugin:2.7:scm
[INFO] Generating "Mailing Lists" report        --- maven-project-info-reports-plugin:2.7:mailing-list
[INFO] Generating "Issue Tracking" report       --- maven-project-info-reports-plugin:2.7:issue-tracking
[INFO] Generating "Continuous Integration" report --- maven-project-info-reports-plugin:2.7:cim
[INFO] Generating "Project Plugins" report      --- maven-project-info-reports-plugin:2.7:plugins
[INFO] Generating "Project License" report      --- maven-project-info-reports-plugin:2.7:license
[INFO] Generating "Project Modules" report      --- maven-project-info-reports-plugin:2.7:modules
[INFO] Generating "Dependency Management" report --- maven-project-info-reports-plugin:2.7:dependency-management
[INFO] Generating "Project Team" report         --- maven-project-info-reports-plugin:2.7:project-team
[INFO] Generating "Project Summary" report      --- maven-project-info-reports-plugin:2.7:summary
[INFO] Generating "Dependencies" report         --- maven-project-info-reports-plugin:2.7:dependencies
[WARNING] Unable to process class META-INF/versions/9/org/apache/logging/log4j/util/StackLocator.class in JarAnalyzer File /home/jenkins/.m2/repository/org/apache/logging/log4j/log4j-api/2.9.1/log4j-api-2.9.1.jar
org.apache.bcel.classfile.ClassFormatException: Invalid byte tag in constant pool: 18
    at org.apache.bcel.classfile.Constant.readConstant (Constant.java:146)
    at org.apache.bcel.classfile.ConstantPool.<init> (ConstantPool.java:67)
    at org.apache.bcel.classfile.ClassParser.readConstantPool (ClassParser.java:222)
    at org.apache.bcel.classfile.ClassParser.parse (ClassParser.java:136)
    at org.apache.maven.shared.jar.classes.JarClassesAnalysis.analyze (JarClassesAnalysis.java:92)
    at org.apache.maven.report.projectinfo.dependencies.Dependencies.getJarDependencyDetails (Dependencies.java:255)
    at org.apache.maven.report.projectinfo.dependencies.renderer.DependenciesRenderer.hasSealed (DependenciesRenderer.java:1454)
    at org.apache.maven.report.projectinfo.dependencies.renderer.DependenciesRenderer.renderSectionDependencyFileDetails (DependenciesRenderer.java:536)
    at org.apache.maven.report.projectinfo.dependencies.renderer.DependenciesRenderer.renderBody (DependenciesRenderer.java:263)
    at org.apache.maven.reporting.AbstractMavenReportRenderer.render (AbstractMavenReportRenderer.java:79)
    at org.apache.maven.report.projectinfo.DependenciesReport.executeReport (DependenciesReport.java:186)
    at org.apache.maven.reporting.AbstractMavenReport.generate (AbstractMavenReport.java:190)
    at org.apache.maven.plugins.site.render.ReportDocumentRenderer.renderDocument (ReportDocumentRenderer.java:227)
    at org.apache.maven.doxia.siterenderer.DefaultSiteRenderer.render (DefaultSiteRenderer.java:329)
    at org.apache.maven.plugins.site.render.SiteMojo.renderLocale (SiteMojo.java:181)
    at org.apache.maven.plugins.site.render.SiteMojo.execute (SiteMojo.java:135)
    at org.apache.maven.plugin.DefaultBuildPluginManager.executeMojo (DefaultBuildPluginManager.java:134)
    at org.apache.maven.lifecycle.internal.MojoExecutor.execute (MojoExecutor.java:208)
    at org.apache.maven.lifecycle.internal.MojoExecutor.execute (MojoExecutor.java:154)
    at org.apache.maven.lifecycle.internal.MojoExecutor.execute (MojoExecutor.java:146)
    at org.apache.maven.lifecycle.internal.LifecycleModuleBuilder.buildProject (LifecycleModuleBuilder.java:117)
    at org.apache.maven.lifecycle.internal.LifecycleModuleBuilder.buildProject (LifecycleModuleBuilder.java:81)
    at org.apache.maven.lifecycle.internal.builder.singlethreaded.SingleThreadedBuilder.build (SingleThreadedBuilder.java:51)
    at org.apache.maven.lifecycle.internal.LifecycleStarter.execute (LifecycleStarter.java:128)
    at org.apache.maven.DefaultMaven.doExecute (DefaultMaven.java:309)
    at org.apache.maven.DefaultMaven.doExecute (DefaultMaven.java:194)
    at org.apache.maven.DefaultMaven.execute (DefaultMaven.java:107)
    at org.apache.maven.cli.MavenCli.execute (MavenCli.java:955)
    at org.apache.maven.cli.MavenCli.doMain (MavenCli.java:290)
    at org.apache.maven.cli.MavenCli.main (MavenCli.java:194)
    at sun.reflect.NativeMethodAccessorImpl.invoke0 (Native Method)
    at sun.reflect.NativeMethodAccessorImpl.invoke (NativeMethodAccessorImpl.java:57)
    at sun.reflect.DelegatingMethodAccessorImpl.invoke (DelegatingMethodAccessorImpl.java:43)
    at java.lang.reflect.Method.invoke (Method.java:606)
    at org.codehaus.plexus.classworlds.launcher.Launcher.launchEnhanced (Launcher.java:289)
    at org.codehaus.plexus.classworlds.launcher.Launcher.launch (Launcher.java:229)
    at org.codehaus.plexus.classworlds.launcher.Launcher.mainWithExitCode (Launcher.java:415)
    at org.codehaus.plexus.classworlds.launcher.Launcher.main (Launcher.java:356)
[INFO] Generating "Rat Report" report           --- apache-rat-plugin:0.11:rat
[INFO] 53 implicit excludes (use -debug for more details).
[INFO] Exclude: src/main/resources/org/apache/struts2/static/domTT.js
[INFO] Exclude: src/site/resources/tags/**/*.html
[INFO] Exclude: src/main/resources/*LICENSE.txt
[INFO] Exclude: src/test/resources/**/*.txt
[INFO] Exclude: src/main/webapp/**/*.css
[INFO] Exclude: src/main/webapp/**/*.map
[INFO] Exclude: src/main/webapp/**/*.js
[INFO] Exclude: src/main/webapp/**/*.svg
[INFO] Exclude: src/main/webapp/**/*.txt
[INFO] Exclude: src/main/resources/**/sitegraph-usage.txt
[INFO] Exclude: src/main/resources/**/docs-urls.txt
[INFO] Exclude: src/etc/header.txt
[INFO] Exclude: src/main/resources/static/css/**/*.css
[INFO] Exclude: src/main/resources/static/js/**/*.js
[INFO] Exclude: src/main/resources/docs.cfg
[INFO] Exclude: src/main/webapp/fonts/**/*
[INFO] 1 resources included (use -debug for more details)
[INFO] Generating "Dependency Check" report     --- dependency-check-maven:3.0.2:aggregate
[INFO] Checking for updates
[INFO] Skipping NVD check since last check was within 4 hours.
[INFO] Check for updates complete (17 ms)
[INFO] Analysis Started
[INFO] Finished Archive Analyzer (0 seconds)
[INFO] Finished File Name Analyzer (0 seconds)
[INFO] Finished Jar Analyzer (0 seconds)
[INFO] Finished Central Analyzer (1 seconds)
[INFO] Finished Dependency Merging Analyzer (0 seconds)
[INFO] Finished Version Filter Analyzer (0 seconds)
[INFO] Finished Hint Analyzer (0 seconds)
[INFO] Created CPE Index (0 seconds)
[INFO] Finished CPE Analyzer (0 seconds)
[INFO] Finished False Positive Analyzer (0 seconds)
[INFO] Finished Cpe Suppression Analyzer (0 seconds)
[INFO] Finished NVD CVE Analyzer (0 seconds)
[INFO] Finished Vulnerability Suppression Analyzer (0 seconds)
[INFO] Finished Dependency Bundling Analyzer (0 seconds)
[INFO] Analysis Complete (2 seconds)
[WARNING]

One or more dependencies were identified with known vulnerabilities in Struts OSGi Bundles:

struts-core-1.3.8.jar (org.apache.struts:struts-core:1.3.8, cpe:/a:apache:struts:1.3.8) : CVE-2016-1181, CVE-2016-1182, CVE-2014-0114, CVE-2015-0899
struts-tiles-1.3.8.jar (cpe:/a:apache:tiles:1.3.8, org.apache.struts:struts-tiles:1.3.8, cpe:/a:apache:struts:1.3.8) : CVE-2016-1181, CVE-2016-1182, CVE-2014-0114, CVE-2015-0899


See the dependency-check report for more details.


[INFO] Generating "Dependency Updates Report" report --- versions-maven-plugin:2.5:dependency-updates-report
[INFO] Generating "Plugin Updates Report" report --- versions-maven-plugin:2.5:plugin-updates-report
[INFO] Generating "Property Updates Report" report --- versions-maven-plugin:2.5:property-updates-report
[INFO]
[INFO] --- maven-site-plugin:3.5.1:stage (default-cli) @ struts2-osgi-bundles ---
[INFO] Using this base directory for staging: <https://builds.apache.org/job/Struts-site-javadocs/ws/target/struts-project/content/maven>
file://<https://builds.apache.org/job/Struts-site-javadocs/ws/target/struts-project/content/maven/> - Session: Opened  
[INFO] Pushing <https://builds.apache.org/job/Struts-site-javadocs/ws/target/struts-project/bundles/target/site>
[INFO]    >>> to file://<https://builds.apache.org/job/Struts-site-javadocs/ws/target/struts-project/content/maven/struts2-parent/struts2-osgi-bundles>
file://<https://builds.apache.org/job/Struts-site-javadocs/ws/target/struts-project/content/maven/> - Session: Disconnecting  
file://<https://builds.apache.org/job/Struts-site-javadocs/ws/target/struts-project/content/maven/> - Session: Disconnected
[INFO]
[INFO] ------------------------------------------------------------------------
[INFO] Building Struts 2 OSGi Admin Bundle 2.5.14.1
[INFO] ------------------------------------------------------------------------
[INFO]
[INFO] --- maven-site-plugin:3.5.1:site (default-cli) @ struts2-osgi-admin-bundle ---
[INFO] configuring report plugin org.apache.maven.plugins:maven-project-info-reports-plugin:2.7
[INFO] configuring report plugin org.apache.maven.plugins:maven-javadoc-plugin:2.10.3
[INFO] preparing 'javadoc' report requires 'generate-sources' forked phase execution
[INFO]
[INFO] >>> maven-javadoc-plugin:2.10.3:javadoc > generate-sources @ struts2-osgi-admin-bundle >>>
[INFO]
[INFO] <<< maven-javadoc-plugin:2.10.3:javadoc < generate-sources @ struts2-osgi-admin-bundle <<<
[INFO]
[INFO] configuring report plugin org.apache.rat:apache-rat-plugin:0.11
[INFO] configuring report plugin org.owasp:dependency-check-maven:3.0.2
[INFO] configuring report plugin org.codehaus.mojo:versions-maven-plugin:2.5
[INFO] configuring report plugin org.codehaus.mojo:rat-maven-plugin:1.0-alpha-2
[INFO] ------------------------------------------------------------------------
[INFO] Reactor Summary:
[INFO]
[INFO] Struts 2 Bill of Materials ......................... SUCCESS [  0.480 s]
[INFO] Struts 2 ........................................... SUCCESS [ 25.329 s]
[INFO] Struts 2 Core ...................................... SUCCESS [ 27.034 s]
[INFO] Struts Plugins ..................................... SUCCESS [ 13.793 s]
[INFO] Struts 2 Configuration Browser Plugin .............. SUCCESS [  9.067 s]
[INFO] Struts 2 Sitemesh Plugin ........................... SUCCESS [  9.498 s]
[INFO] Struts 2 Tiles Plugin .............................. SUCCESS [  9.537 s]
[INFO] Struts 2 DWR Plugin ................................ SUCCESS [  8.056 s]
[INFO] Struts 2 Spring Plugin ............................. SUCCESS [  9.680 s]
[INFO] Struts 2 Convention Plugin ......................... SUCCESS [ 15.780 s]
[INFO] Struts 2 JUnit Plugin .............................. SUCCESS [  9.580 s]
[INFO] Struts 2 JSON Plugin ............................... SUCCESS [ 10.850 s]
[INFO] Struts 2 Bean Validation Plugin .................... SUCCESS [  8.537 s]
[INFO] Struts 2 Webapps ................................... SUCCESS [  0.012 s]
[INFO] Struts 2 Showcase Webapp ........................... SUCCESS [  0.029 s]
[INFO] Struts 2 REST Plugin ............................... SUCCESS [ 10.263 s]
[INFO] Struts 2 Rest Showcase Webapp ...................... SUCCESS [  0.015 s]
[INFO] Struts 2 CDI Plugin ................................ SUCCESS [  8.834 s]
[INFO] Struts 2 Embedded JSP Plugin ....................... SUCCESS [ 14.570 s]
[INFO] Struts 2 GXP Plugin ................................ SUCCESS [  8.388 s]
[INFO] Struts 2 Jasper Reports Plugin ..................... SUCCESS [ 10.370 s]
[INFO] Struts 2 Java Templates Plugin ..................... SUCCESS [  8.998 s]
[INFO] Struts 2 JFreeChart Plugin ......................... SUCCESS [  8.554 s]
[INFO] Struts 2 OSGi Plugin ............................... SUCCESS [ 10.354 s]
[INFO] Struts 2 OVal Plugin ............................... SUCCESS [  8.538 s]
[INFO] Struts 2 Pell Multipart Plugin ..................... SUCCESS [  7.198 s]
[INFO] Struts 2 Plexus Plugin ............................. SUCCESS [  7.997 s]
[INFO] Struts 2 Portlet Plugin ............................ SUCCESS [ 12.369 s]
[INFO] Struts 2 Portlet Tiles Plugin ...................... SUCCESS [  8.519 s]
[INFO] DEPRECATED: Struts 2 Sitegraph Plugin .............. SUCCESS [ 11.783 s]
[INFO] Struts 2 TestNG Plugin ............................. SUCCESS [  8.927 s]
[INFO] Struts OSGi Bundles ................................ SUCCESS [  8.560 s]
[INFO] Struts 2 OSGi Admin Bundle ......................... FAILURE [  1.954 s]
[INFO] Struts 2 OSGi Demo Bundle .......................... SKIPPED
[INFO] Struts 2 Assembly .................................. SKIPPED
[INFO] ------------------------------------------------------------------------
[INFO] BUILD FAILURE
[INFO] ------------------------------------------------------------------------
[INFO] Total time: 05:42 min
[INFO] Finished at: 2017-12-04T08:44:41Z
[INFO] Final Memory: 97M/24057M
[INFO] ------------------------------------------------------------------------
[ERROR] PermGen space -> [Help 1]
[ERROR]
[ERROR] To see the full stack trace of the errors, re-run Maven with the -e switch.
[ERROR] Re-run Maven using the -X switch to enable full debug logging.
[ERROR]
[ERROR] For more information about the errors and possible solutions, please read the following articles:
[ERROR] [Help 1] http://cwiki.apache.org/confluence/display/MAVEN/OutOfMemoryError
Build step 'Execute shell' marked build as failure
Setting MAVEN_3_LATEST__HOME=/home/jenkins/tools/maven/latest3/

---------------------------------------------------------------------
To unsubscribe, e-mail: [hidden email]
For additional commands, e-mail: [hidden email]

Reply | Threaded
Open this post in threaded view
|

Build failed in Jenkins: Struts-site-javadocs #8

Apache Jenkins Server-2
See <https://builds.apache.org/job/Struts-site-javadocs/8/display/redirect>

------------------------------------------
[...truncated 1.47 MB...]
[INFO] Finished False Positive Analyzer (0 seconds)
[INFO] Finished Cpe Suppression Analyzer (0 seconds)
[INFO] Finished NVD CVE Analyzer (0 seconds)
[INFO] Finished Vulnerability Suppression Analyzer (0 seconds)
[INFO] Finished Dependency Bundling Analyzer (0 seconds)
[INFO] Analysis Complete (2 seconds)
[INFO] Generating "Dependency Updates Report" report --- versions-maven-plugin:2.5:dependency-updates-report
[INFO] Generating "Plugin Updates Report" report --- versions-maven-plugin:2.5:plugin-updates-report
[INFO] Generating "Property Updates Report" report --- versions-maven-plugin:2.5:property-updates-report
[INFO]
[INFO] --- maven-site-plugin:3.5.1:stage (default-cli) @ struts2-osgi-admin-bundle ---
[INFO] Using this base directory for staging: <https://builds.apache.org/job/Struts-site-javadocs/ws/target/struts-project/bundles/content/maven>
file://<https://builds.apache.org/job/Struts-site-javadocs/ws/target/struts-project/bundles/content/maven/> - Session: Opened  
[INFO] Pushing <https://builds.apache.org/job/Struts-site-javadocs/ws/target/struts-project/bundles/admin/target/site>
[INFO]    >>> to file://<https://builds.apache.org/job/Struts-site-javadocs/ws/target/struts-project/bundles/content/maven/struts2-parent/struts2-osgi-bundles/struts2-osgi-admin-bundle>
file://<https://builds.apache.org/job/Struts-site-javadocs/ws/target/struts-project/bundles/content/maven/> - Session: Disconnecting  
file://<https://builds.apache.org/job/Struts-site-javadocs/ws/target/struts-project/bundles/content/maven/> - Session: Disconnected
[INFO]
[INFO] ------------------------------------------------------------------------
[INFO] Building Struts 2 OSGi Demo Bundle 2.5.14.1
[INFO] ------------------------------------------------------------------------
[INFO]
[INFO] --- maven-site-plugin:3.5.1:site (default-cli) @ struts2-osgi-demo-bundle ---
[INFO] configuring report plugin org.apache.maven.plugins:maven-project-info-reports-plugin:2.7
[INFO] configuring report plugin org.apache.maven.plugins:maven-javadoc-plugin:2.10.3
[INFO] preparing 'javadoc' report requires 'generate-sources' forked phase execution
[INFO]
[INFO] >>> maven-javadoc-plugin:2.10.3:javadoc > generate-sources @ struts2-osgi-demo-bundle >>>
[INFO]
[INFO] <<< maven-javadoc-plugin:2.10.3:javadoc < generate-sources @ struts2-osgi-demo-bundle <<<
[INFO]
[INFO] configuring report plugin org.apache.rat:apache-rat-plugin:0.11
[INFO] configuring report plugin org.owasp:dependency-check-maven:3.0.2
[INFO] configuring report plugin org.codehaus.mojo:versions-maven-plugin:2.5
[INFO] configuring report plugin org.codehaus.mojo:rat-maven-plugin:1.0-alpha-2
[INFO] Rendering site with org.apache.maven.skins:maven-fluido-skin:jar:1.6 skin.
[INFO] Skipped "RAT Report" report (rat-maven-plugin:1.0-alpha-2:rat), file "rat-report.html" already exists for the English version.
[INFO] Generating "About" report                --- maven-project-info-reports-plugin:2.7:index
[INFO] Generating "Plugin Management" report    --- maven-project-info-reports-plugin:2.7:plugin-management
[INFO] Generating "Distribution Management" report --- maven-project-info-reports-plugin:2.7:distribution-management
[INFO] Generating "Dependency Information" report --- maven-project-info-reports-plugin:2.7:dependency-info
[INFO] Generating "Source Repository" report    --- maven-project-info-reports-plugin:2.7:scm
[INFO] Generating "Mailing Lists" report        --- maven-project-info-reports-plugin:2.7:mailing-list
[INFO] Generating "Issue Tracking" report       --- maven-project-info-reports-plugin:2.7:issue-tracking
[INFO] Generating "Continuous Integration" report --- maven-project-info-reports-plugin:2.7:cim
[INFO] Generating "Project Plugins" report      --- maven-project-info-reports-plugin:2.7:plugins
[INFO] Generating "Project License" report      --- maven-project-info-reports-plugin:2.7:license
[INFO] Generating "Dependency Management" report --- maven-project-info-reports-plugin:2.7:dependency-management
[INFO] Generating "Project Team" report         --- maven-project-info-reports-plugin:2.7:project-team
[INFO] Generating "Project Summary" report      --- maven-project-info-reports-plugin:2.7:summary
[INFO] Generating "Dependencies" report         --- maven-project-info-reports-plugin:2.7:dependencies
[WARNING] Unable to process class META-INF/versions/9/org/apache/logging/log4j/util/StackLocator.class in JarAnalyzer File /home/jenkins/.m2/repository/org/apache/logging/log4j/log4j-api/2.9.1/log4j-api-2.9.1.jar
org.apache.bcel.classfile.ClassFormatException: Invalid byte tag in constant pool: 18
    at org.apache.bcel.classfile.Constant.readConstant (Constant.java:146)
    at org.apache.bcel.classfile.ConstantPool.<init> (ConstantPool.java:67)
    at org.apache.bcel.classfile.ClassParser.readConstantPool (ClassParser.java:222)
    at org.apache.bcel.classfile.ClassParser.parse (ClassParser.java:136)
    at org.apache.maven.shared.jar.classes.JarClassesAnalysis.analyze (JarClassesAnalysis.java:92)
    at org.apache.maven.report.projectinfo.dependencies.Dependencies.getJarDependencyDetails (Dependencies.java:255)
    at org.apache.maven.report.projectinfo.dependencies.renderer.DependenciesRenderer.hasSealed (DependenciesRenderer.java:1454)
    at org.apache.maven.report.projectinfo.dependencies.renderer.DependenciesRenderer.renderSectionDependencyFileDetails (DependenciesRenderer.java:536)
    at org.apache.maven.report.projectinfo.dependencies.renderer.DependenciesRenderer.renderBody (DependenciesRenderer.java:263)
    at org.apache.maven.reporting.AbstractMavenReportRenderer.render (AbstractMavenReportRenderer.java:79)
    at org.apache.maven.report.projectinfo.DependenciesReport.executeReport (DependenciesReport.java:186)
    at org.apache.maven.reporting.AbstractMavenReport.generate (AbstractMavenReport.java:190)
    at org.apache.maven.plugins.site.render.ReportDocumentRenderer.renderDocument (ReportDocumentRenderer.java:227)
    at org.apache.maven.doxia.siterenderer.DefaultSiteRenderer.render (DefaultSiteRenderer.java:329)
    at org.apache.maven.plugins.site.render.SiteMojo.renderLocale (SiteMojo.java:181)
    at org.apache.maven.plugins.site.render.SiteMojo.execute (SiteMojo.java:135)
    at org.apache.maven.plugin.DefaultBuildPluginManager.executeMojo (DefaultBuildPluginManager.java:134)
    at org.apache.maven.lifecycle.internal.MojoExecutor.execute (MojoExecutor.java:208)
    at org.apache.maven.lifecycle.internal.MojoExecutor.execute (MojoExecutor.java:154)
    at org.apache.maven.lifecycle.internal.MojoExecutor.execute (MojoExecutor.java:146)
    at org.apache.maven.lifecycle.internal.LifecycleModuleBuilder.buildProject (LifecycleModuleBuilder.java:117)
    at org.apache.maven.lifecycle.internal.LifecycleModuleBuilder.buildProject (LifecycleModuleBuilder.java:81)
    at org.apache.maven.lifecycle.internal.builder.singlethreaded.SingleThreadedBuilder.build (SingleThreadedBuilder.java:51)
    at org.apache.maven.lifecycle.internal.LifecycleStarter.execute (LifecycleStarter.java:128)
    at org.apache.maven.DefaultMaven.doExecute (DefaultMaven.java:309)
    at org.apache.maven.DefaultMaven.doExecute (DefaultMaven.java:194)
    at org.apache.maven.DefaultMaven.execute (DefaultMaven.java:107)
    at org.apache.maven.cli.MavenCli.execute (MavenCli.java:955)
    at org.apache.maven.cli.MavenCli.doMain (MavenCli.java:290)
    at org.apache.maven.cli.MavenCli.main (MavenCli.java:194)
    at sun.reflect.NativeMethodAccessorImpl.invoke0 (Native Method)
    at sun.reflect.NativeMethodAccessorImpl.invoke (NativeMethodAccessorImpl.java:57)
    at sun.reflect.DelegatingMethodAccessorImpl.invoke (DelegatingMethodAccessorImpl.java:43)
    at java.lang.reflect.Method.invoke (Method.java:606)
    at org.codehaus.plexus.classworlds.launcher.Launcher.launchEnhanced (Launcher.java:289)
    at org.codehaus.plexus.classworlds.launcher.Launcher.launch (Launcher.java:229)
    at org.codehaus.plexus.classworlds.launcher.Launcher.mainWithExitCode (Launcher.java:415)
    at org.codehaus.plexus.classworlds.launcher.Launcher.main (Launcher.java:356)
[INFO] Generating "JavaDocs" report             --- maven-javadoc-plugin:2.10.3:javadoc
[INFO]
Loading source files for package actions.osgi...
Constructing Javadoc information...
Standard Doclet version 1.7.0_80
Building tree for all the packages and classes...
Generating <https://builds.apache.org/job/Struts-site-javadocs/ws/target/struts-project/bundles/demo/target/site/apidocs/actions/osgi/BundlesAction.html...>
Generating <https://builds.apache.org/job/Struts-site-javadocs/ws/target/struts-project/bundles/demo/target/site/apidocs/actions/osgi/HelloWorldAction.html...>
Generating <https://builds.apache.org/job/Struts-site-javadocs/ws/target/struts-project/bundles/demo/target/site/apidocs/actions/osgi/Message.html...>
Generating <https://builds.apache.org/job/Struts-site-javadocs/ws/target/struts-project/bundles/demo/target/site/apidocs/actions/osgi/package-frame.html...>
Generating <https://builds.apache.org/job/Struts-site-javadocs/ws/target/struts-project/bundles/demo/target/site/apidocs/actions/osgi/package-summary.html...>
Generating <https://builds.apache.org/job/Struts-site-javadocs/ws/target/struts-project/bundles/demo/target/site/apidocs/actions/osgi/package-tree.html...>
Generating <https://builds.apache.org/job/Struts-site-javadocs/ws/target/struts-project/bundles/demo/target/site/apidocs/constant-values.html...>
Generating <https://builds.apache.org/job/Struts-site-javadocs/ws/target/struts-project/bundles/demo/target/site/apidocs/serialized-form.html...>
Generating <https://builds.apache.org/job/Struts-site-javadocs/ws/target/struts-project/bundles/demo/target/site/apidocs/actions/osgi/class-use/Message.html...>
Generating <https://builds.apache.org/job/Struts-site-javadocs/ws/target/struts-project/bundles/demo/target/site/apidocs/actions/osgi/class-use/HelloWorldAction.html...>
Generating <https://builds.apache.org/job/Struts-site-javadocs/ws/target/struts-project/bundles/demo/target/site/apidocs/actions/osgi/class-use/BundlesAction.html...>
Generating <https://builds.apache.org/job/Struts-site-javadocs/ws/target/struts-project/bundles/demo/target/site/apidocs/actions/osgi/package-use.html...>
Building index for all the packages and classes...
Generating <https://builds.apache.org/job/Struts-site-javadocs/ws/target/struts-project/bundles/demo/target/site/apidocs/overview-tree.html...>
Generating <https://builds.apache.org/job/Struts-site-javadocs/ws/target/struts-project/bundles/demo/target/site/apidocs/index-all.html...>
Generating <https://builds.apache.org/job/Struts-site-javadocs/ws/target/struts-project/bundles/demo/target/site/apidocs/deprecated-list.html...>
Building index for all classes...
Generating <https://builds.apache.org/job/Struts-site-javadocs/ws/target/struts-project/bundles/demo/target/site/apidocs/allclasses-frame.html...>
Generating <https://builds.apache.org/job/Struts-site-javadocs/ws/target/struts-project/bundles/demo/target/site/apidocs/allclasses-noframe.html...>
Generating <https://builds.apache.org/job/Struts-site-javadocs/ws/target/struts-project/bundles/demo/target/site/apidocs/index.html...>
Generating <https://builds.apache.org/job/Struts-site-javadocs/ws/target/struts-project/bundles/demo/target/site/apidocs/help-doc.html...>
[INFO] Generating "Rat Report" report           --- apache-rat-plugin:0.11:rat
[INFO] 51 implicit excludes (use -debug for more details).
[INFO] Exclude: src/main/resources/org/apache/struts2/static/domTT.js
[INFO] Exclude: src/site/resources/tags/**/*.html
[INFO] Exclude: src/main/resources/*LICENSE.txt
[INFO] Exclude: src/test/resources/**/*.txt
[INFO] Exclude: src/main/webapp/**/*.css
[INFO] Exclude: src/main/webapp/**/*.map
[INFO] Exclude: src/main/webapp/**/*.js
[INFO] Exclude: src/main/webapp/**/*.svg
[INFO] Exclude: src/main/webapp/**/*.txt
[INFO] Exclude: src/main/resources/**/sitegraph-usage.txt
[INFO] Exclude: src/main/resources/**/docs-urls.txt
[INFO] Exclude: src/etc/header.txt
[INFO] Exclude: src/main/resources/static/css/**/*.css
[INFO] Exclude: src/main/resources/static/js/**/*.js
[INFO] Exclude: src/main/resources/docs.cfg
[INFO] Exclude: src/main/webapp/fonts/**/*
[INFO] 11 resources included (use -debug for more details)
[INFO] Generating "Dependency Check" report     --- dependency-check-maven:3.0.2:aggregate
[INFO] Checking for updates
[INFO] Skipping NVD check since last check was within 4 hours.
[INFO] Check for updates complete (30 ms)
[INFO] Analysis Started
[INFO] Finished Archive Analyzer (0 seconds)
[INFO] Finished File Name Analyzer (0 seconds)
[INFO] Finished Jar Analyzer (0 seconds)
[INFO] Finished Central Analyzer (0 seconds)
[INFO] Finished Dependency Merging Analyzer (0 seconds)
[INFO] Finished Version Filter Analyzer (0 seconds)
[INFO] Finished Hint Analyzer (0 seconds)
[INFO] Created CPE Index (0 seconds)
[INFO] Finished CPE Analyzer (1 seconds)
[INFO] Finished False Positive Analyzer (0 seconds)
[INFO] Finished Cpe Suppression Analyzer (0 seconds)
[INFO] Finished NVD CVE Analyzer (0 seconds)
[INFO] Finished Vulnerability Suppression Analyzer (0 seconds)
[INFO] Finished Dependency Bundling Analyzer (0 seconds)
[INFO] Analysis Complete (2 seconds)
[WARNING]

One or more dependencies were identified with known vulnerabilities in Struts 2 OSGi Demo Bundle:

struts-core-1.3.8.jar (org.apache.struts:struts-core:1.3.8, cpe:/a:apache:struts:1.3.8) : CVE-2016-1181, CVE-2016-1182, CVE-2014-0114, CVE-2015-0899
struts-tiles-1.3.8.jar (cpe:/a:apache:tiles:1.3.8, org.apache.struts:struts-tiles:1.3.8, cpe:/a:apache:struts:1.3.8) : CVE-2016-1181, CVE-2016-1182, CVE-2014-0114, CVE-2015-0899


See the dependency-check report for more details.


[INFO] Generating "Dependency Updates Report" report --- versions-maven-plugin:2.5:dependency-updates-report
[INFO] Generating "Plugin Updates Report" report --- versions-maven-plugin:2.5:plugin-updates-report
[INFO] Generating "Property Updates Report" report --- versions-maven-plugin:2.5:property-updates-report
[INFO]
[INFO] --- maven-site-plugin:3.5.1:stage (default-cli) @ struts2-osgi-demo-bundle ---
[INFO] Using this base directory for staging: <https://builds.apache.org/job/Struts-site-javadocs/ws/target/struts-project/bundles/content/maven>
file://<https://builds.apache.org/job/Struts-site-javadocs/ws/target/struts-project/bundles/content/maven/> - Session: Opened  
[INFO] Pushing <https://builds.apache.org/job/Struts-site-javadocs/ws/target/struts-project/bundles/demo/target/site>
[INFO]    >>> to file://<https://builds.apache.org/job/Struts-site-javadocs/ws/target/struts-project/bundles/content/maven/struts2-parent/struts2-osgi-bundles/struts2-osgi-demo-bundle>
file://<https://builds.apache.org/job/Struts-site-javadocs/ws/target/struts-project/bundles/content/maven/> - Session: Disconnecting  
file://<https://builds.apache.org/job/Struts-site-javadocs/ws/target/struts-project/bundles/content/maven/> - Session: Disconnected
[INFO]
[INFO] ------------------------------------------------------------------------
[INFO] Building Struts 2 Assembly 2.5.14.1
[INFO] ------------------------------------------------------------------------
[INFO]
[INFO] --- maven-site-plugin:3.5.1:site (default-cli) @ struts2-assembly ---
[INFO] maven.site.skip = true: Skipping site generation
[INFO]
[INFO] --- maven-site-plugin:3.5.1:stage (default-cli) @ struts2-assembly ---
[INFO] maven.site.skip = true: Skipping site staging
[INFO] ------------------------------------------------------------------------
[INFO] Reactor Summary:
[INFO]
[INFO] Struts 2 Bill of Materials ......................... SUCCESS [  0.502 s]
[INFO] Struts 2 ........................................... SUCCESS [ 25.567 s]
[INFO] Struts 2 Core ...................................... SUCCESS [ 27.800 s]
[INFO] Struts Plugins ..................................... SUCCESS [ 12.685 s]
[INFO] Struts 2 Configuration Browser Plugin .............. SUCCESS [  8.674 s]
[INFO] Struts 2 Sitemesh Plugin ........................... SUCCESS [  9.683 s]
[INFO] Struts 2 Tiles Plugin .............................. SUCCESS [  9.963 s]
[INFO] Struts 2 DWR Plugin ................................ SUCCESS [  7.850 s]
[INFO] Struts 2 Spring Plugin ............................. SUCCESS [  9.338 s]
[INFO] Struts 2 Convention Plugin ......................... SUCCESS [ 15.793 s]
[INFO] Struts 2 JUnit Plugin .............................. SUCCESS [  9.574 s]
[INFO] Struts 2 JSON Plugin ............................... SUCCESS [ 11.220 s]
[INFO] Struts 2 Bean Validation Plugin .................... SUCCESS [  8.186 s]
[INFO] Struts 2 Webapps ................................... SUCCESS [  0.011 s]
[INFO] Struts 2 Showcase Webapp ........................... SUCCESS [  0.023 s]
[INFO] Struts 2 REST Plugin ............................... SUCCESS [  9.917 s]
[INFO] Struts 2 Rest Showcase Webapp ...................... SUCCESS [  0.021 s]
[INFO] Struts 2 CDI Plugin ................................ SUCCESS [  9.468 s]
[INFO] Struts 2 Embedded JSP Plugin ....................... SUCCESS [ 14.976 s]
[INFO] Struts 2 GXP Plugin ................................ SUCCESS [  8.844 s]
[INFO] Struts 2 Jasper Reports Plugin ..................... SUCCESS [ 10.636 s]
[INFO] Struts 2 Java Templates Plugin ..................... SUCCESS [  8.802 s]
[INFO] Struts 2 JFreeChart Plugin ......................... SUCCESS [  8.800 s]
[INFO] Struts 2 OSGi Plugin ............................... SUCCESS [ 10.458 s]
[INFO] Struts 2 OVal Plugin ............................... SUCCESS [  8.801 s]
[INFO] Struts 2 Pell Multipart Plugin ..................... SUCCESS [  7.235 s]
[INFO] Struts 2 Plexus Plugin ............................. SUCCESS [  8.131 s]
[INFO] Struts 2 Portlet Plugin ............................ SUCCESS [ 13.218 s]
[INFO] Struts 2 Portlet Tiles Plugin ...................... SUCCESS [  8.310 s]
[INFO] DEPRECATED: Struts 2 Sitegraph Plugin .............. SUCCESS [ 10.138 s]
[INFO] Struts 2 TestNG Plugin ............................. SUCCESS [  7.729 s]
[INFO] Struts OSGi Bundles ................................ SUCCESS [  6.756 s]
[INFO] Struts 2 OSGi Admin Bundle ......................... SUCCESS [  9.478 s]
[INFO] Struts 2 OSGi Demo Bundle .......................... SUCCESS [ 10.391 s]
[INFO] Struts 2 Assembly .................................. SUCCESS [  0.025 s]
[INFO] ------------------------------------------------------------------------
[INFO] BUILD SUCCESS
[INFO] ------------------------------------------------------------------------
[INFO] Total time: 05:56 min
[INFO] Finished at: 2017-12-04T09:25:02Z
[INFO] Final Memory: 107M/1223M
[INFO] ------------------------------------------------------------------------
+ cd ../..
Setting MAVEN_3_LATEST__HOME=/home/jenkins/tools/maven/latest3/
[Struts-site-javadocs] $ /bin/bash -xe /tmp/jenkins5318028604219585059.sh
+ git checkout asf-site
Previous HEAD position was a5c9eb9... Merge pull request #46 from paulvi/patch-1
Switched to a new branch 'asf-site'
Branch asf-site set up to track remote branch asf-site from origin.
+ git pull origin asf-site
From https://gitbox.apache.org/repos/asf/struts-site
 * branch            asf-site   -> FETCH_HEAD
Already up-to-date.
+ cp -r target/content/maven/struts2-parent content/maven/css content/maven/dependencies.html content/maven/dependency-check-report.html content/maven/dependency-convergence.html content/maven/dependency-info.html content/maven/dependency-management.html content/maven/distribution-management.html content/maven/fonts content/maven/images content/maven/img content/maven/index.html content/maven/integration.html content/maven/issue-tracking.html content/maven/js content/maven/license.html content/maven/mail-lists.html content/maven/modules.html content/maven/plugin-management.html content/maven/plugins.html content/maven/project-info.html content/maven/project-reports.html content/maven/project-summary.html content/maven/rat-report.html content/maven/source-repository.html content/maven/struts2-core content/maven/struts2-osgi-bundles content/maven/struts2-parent content/maven/struts2-plugins content/maven/team-list.html
cp: target 'content/maven/team-list.html' is not a directory
Build step 'Execute shell' marked build as failure
Setting MAVEN_3_LATEST__HOME=/home/jenkins/tools/maven/latest3/

---------------------------------------------------------------------
To unsubscribe, e-mail: [hidden email]
For additional commands, e-mail: [hidden email]

Reply | Threaded
Open this post in threaded view
|

Build failed in Jenkins: Struts-site-javadocs #9

Apache Jenkins Server-2
See <https://builds.apache.org/job/Struts-site-javadocs/9/display/redirect?page=changes>

Changes:

[yasserzamani] WW-4034 Adds example for how customizing JSONWriter

[yasserzamani] WW-4034 Fixes an apostrophe typo

------------------------------------------
[...truncated 905.85 KB...]
[INFO] Finished False Positive Analyzer (0 seconds)
[INFO] Finished Cpe Suppression Analyzer (0 seconds)
[INFO] Finished NVD CVE Analyzer (0 seconds)
[INFO] Finished Vulnerability Suppression Analyzer (0 seconds)
[INFO] Finished Dependency Bundling Analyzer (0 seconds)
[INFO] Analysis Complete (1 seconds)
[INFO] Generating "Dependency Updates Report" report --- versions-maven-plugin:2.5:dependency-updates-report
[INFO] Generating "Plugin Updates Report" report --- versions-maven-plugin:2.5:plugin-updates-report
[INFO] Generating "Property Updates Report" report --- versions-maven-plugin:2.5:property-updates-report
[INFO]
[INFO] --- maven-site-plugin:3.5.1:stage (default-cli) @ struts2-osgi-admin-bundle ---
[INFO] Using this base directory for staging: <https://builds.apache.org/job/Struts-site-javadocs/ws/target/struts-project/target/staging>
file://<https://builds.apache.org/job/Struts-site-javadocs/ws/target/struts-project/target/staging/> - Session: Opened  
[INFO] Pushing <https://builds.apache.org/job/Struts-site-javadocs/ws/target/struts-project/bundles/admin/target/site>
[INFO]    >>> to file://<https://builds.apache.org/job/Struts-site-javadocs/ws/target/struts-project/target/staging/struts2-parent/struts2-osgi-bundles/struts2-osgi-admin-bundle>
file://<https://builds.apache.org/job/Struts-site-javadocs/ws/target/struts-project/target/staging/> - Session: Disconnecting  
file://<https://builds.apache.org/job/Struts-site-javadocs/ws/target/struts-project/target/staging/> - Session: Disconnected
[INFO]
[INFO] ------------------------------------------------------------------------
[INFO] Building Struts 2 OSGi Demo Bundle 2.5.14.1
[INFO] ------------------------------------------------------------------------
[INFO]
[INFO] --- maven-site-plugin:3.5.1:site (default-cli) @ struts2-osgi-demo-bundle ---
[INFO] configuring report plugin org.apache.maven.plugins:maven-project-info-reports-plugin:2.7
[INFO] configuring report plugin org.apache.maven.plugins:maven-javadoc-plugin:2.10.3
[INFO] preparing 'javadoc' report requires 'generate-sources' forked phase execution
[INFO]
[INFO] >>> maven-javadoc-plugin:2.10.3:javadoc > generate-sources @ struts2-osgi-demo-bundle >>>
[INFO]
[INFO] <<< maven-javadoc-plugin:2.10.3:javadoc < generate-sources @ struts2-osgi-demo-bundle <<<
[INFO]
[INFO] configuring report plugin org.apache.rat:apache-rat-plugin:0.11
[INFO] configuring report plugin org.owasp:dependency-check-maven:3.0.2
[INFO] configuring report plugin org.codehaus.mojo:versions-maven-plugin:2.5
[INFO] configuring report plugin org.codehaus.mojo:rat-maven-plugin:1.0-alpha-2
[INFO] Rendering site with org.apache.maven.skins:maven-fluido-skin:jar:1.6 skin.
[INFO] Skipped "RAT Report" report (rat-maven-plugin:1.0-alpha-2:rat), file "rat-report.html" already exists for the English version.
[INFO] Generating "About" report                --- maven-project-info-reports-plugin:2.7:index
[INFO] Generating "Plugin Management" report    --- maven-project-info-reports-plugin:2.7:plugin-management
[INFO] Generating "Distribution Management" report --- maven-project-info-reports-plugin:2.7:distribution-management
[INFO] Generating "Dependency Information" report --- maven-project-info-reports-plugin:2.7:dependency-info
[INFO] Generating "Source Repository" report    --- maven-project-info-reports-plugin:2.7:scm
[INFO] Generating "Mailing Lists" report        --- maven-project-info-reports-plugin:2.7:mailing-list
[INFO] Generating "Issue Tracking" report       --- maven-project-info-reports-plugin:2.7:issue-tracking
[INFO] Generating "Continuous Integration" report --- maven-project-info-reports-plugin:2.7:cim
[INFO] Generating "Project Plugins" report      --- maven-project-info-reports-plugin:2.7:plugins
[INFO] Generating "Project License" report      --- maven-project-info-reports-plugin:2.7:license
[INFO] Generating "Dependency Management" report --- maven-project-info-reports-plugin:2.7:dependency-management
[INFO] Generating "Project Team" report         --- maven-project-info-reports-plugin:2.7:project-team
[INFO] Generating "Project Summary" report      --- maven-project-info-reports-plugin:2.7:summary
[INFO] Generating "Dependencies" report         --- maven-project-info-reports-plugin:2.7:dependencies
[WARNING] Unable to process class META-INF/versions/9/org/apache/logging/log4j/util/StackLocator.class in JarAnalyzer File /home/jenkins/.m2/repository/org/apache/logging/log4j/log4j-api/2.9.1/log4j-api-2.9.1.jar
org.apache.bcel.classfile.ClassFormatException: Invalid byte tag in constant pool: 18
    at org.apache.bcel.classfile.Constant.readConstant (Constant.java:146)
    at org.apache.bcel.classfile.ConstantPool.<init> (ConstantPool.java:67)
    at org.apache.bcel.classfile.ClassParser.readConstantPool (ClassParser.java:222)
    at org.apache.bcel.classfile.ClassParser.parse (ClassParser.java:136)
    at org.apache.maven.shared.jar.classes.JarClassesAnalysis.analyze (JarClassesAnalysis.java:92)
    at org.apache.maven.report.projectinfo.dependencies.Dependencies.getJarDependencyDetails (Dependencies.java:255)
    at org.apache.maven.report.projectinfo.dependencies.renderer.DependenciesRenderer.hasSealed (DependenciesRenderer.java:1454)
    at org.apache.maven.report.projectinfo.dependencies.renderer.DependenciesRenderer.renderSectionDependencyFileDetails (DependenciesRenderer.java:536)
    at org.apache.maven.report.projectinfo.dependencies.renderer.DependenciesRenderer.renderBody (DependenciesRenderer.java:263)
    at org.apache.maven.reporting.AbstractMavenReportRenderer.render (AbstractMavenReportRenderer.java:79)
    at org.apache.maven.report.projectinfo.DependenciesReport.executeReport (DependenciesReport.java:186)
    at org.apache.maven.reporting.AbstractMavenReport.generate (AbstractMavenReport.java:190)
    at org.apache.maven.plugins.site.render.ReportDocumentRenderer.renderDocument (ReportDocumentRenderer.java:227)
    at org.apache.maven.doxia.siterenderer.DefaultSiteRenderer.render (DefaultSiteRenderer.java:329)
    at org.apache.maven.plugins.site.render.SiteMojo.renderLocale (SiteMojo.java:181)
    at org.apache.maven.plugins.site.render.SiteMojo.execute (SiteMojo.java:135)
    at org.apache.maven.plugin.DefaultBuildPluginManager.executeMojo (DefaultBuildPluginManager.java:134)
    at org.apache.maven.lifecycle.internal.MojoExecutor.execute (MojoExecutor.java:208)
    at org.apache.maven.lifecycle.internal.MojoExecutor.execute (MojoExecutor.java:154)
    at org.apache.maven.lifecycle.internal.MojoExecutor.execute (MojoExecutor.java:146)
    at org.apache.maven.lifecycle.internal.LifecycleModuleBuilder.buildProject (LifecycleModuleBuilder.java:117)
    at org.apache.maven.lifecycle.internal.LifecycleModuleBuilder.buildProject (LifecycleModuleBuilder.java:81)
    at org.apache.maven.lifecycle.internal.builder.singlethreaded.SingleThreadedBuilder.build (SingleThreadedBuilder.java:51)
    at org.apache.maven.lifecycle.internal.LifecycleStarter.execute (LifecycleStarter.java:128)
    at org.apache.maven.DefaultMaven.doExecute (DefaultMaven.java:309)
    at org.apache.maven.DefaultMaven.doExecute (DefaultMaven.java:194)
    at org.apache.maven.DefaultMaven.execute (DefaultMaven.java:107)
    at org.apache.maven.cli.MavenCli.execute (MavenCli.java:955)
    at org.apache.maven.cli.MavenCli.doMain (MavenCli.java:290)
    at org.apache.maven.cli.MavenCli.main (MavenCli.java:194)
    at sun.reflect.NativeMethodAccessorImpl.invoke0 (Native Method)
    at sun.reflect.NativeMethodAccessorImpl.invoke (NativeMethodAccessorImpl.java:57)
    at sun.reflect.DelegatingMethodAccessorImpl.invoke (DelegatingMethodAccessorImpl.java:43)
    at java.lang.reflect.Method.invoke (Method.java:606)
    at org.codehaus.plexus.classworlds.launcher.Launcher.launchEnhanced (Launcher.java:289)
    at org.codehaus.plexus.classworlds.launcher.Launcher.launch (Launcher.java:229)
    at org.codehaus.plexus.classworlds.launcher.Launcher.mainWithExitCode (Launcher.java:415)
    at org.codehaus.plexus.classworlds.launcher.Launcher.main (Launcher.java:356)
[INFO] Generating "JavaDocs" report             --- maven-javadoc-plugin:2.10.3:javadoc
[INFO]
Loading source files for package actions.osgi...
Constructing Javadoc information...
Standard Doclet version 1.7.0_80
Building tree for all the packages and classes...
Generating <https://builds.apache.org/job/Struts-site-javadocs/ws/target/struts-project/bundles/demo/target/site/apidocs/actions/osgi/BundlesAction.html...>
Generating <https://builds.apache.org/job/Struts-site-javadocs/ws/target/struts-project/bundles/demo/target/site/apidocs/actions/osgi/HelloWorldAction.html...>
Generating <https://builds.apache.org/job/Struts-site-javadocs/ws/target/struts-project/bundles/demo/target/site/apidocs/actions/osgi/Message.html...>
Generating <https://builds.apache.org/job/Struts-site-javadocs/ws/target/struts-project/bundles/demo/target/site/apidocs/actions/osgi/package-frame.html...>
Generating <https://builds.apache.org/job/Struts-site-javadocs/ws/target/struts-project/bundles/demo/target/site/apidocs/actions/osgi/package-summary.html...>
Generating <https://builds.apache.org/job/Struts-site-javadocs/ws/target/struts-project/bundles/demo/target/site/apidocs/actions/osgi/package-tree.html...>
Generating <https://builds.apache.org/job/Struts-site-javadocs/ws/target/struts-project/bundles/demo/target/site/apidocs/constant-values.html...>
Generating <https://builds.apache.org/job/Struts-site-javadocs/ws/target/struts-project/bundles/demo/target/site/apidocs/serialized-form.html...>
Generating <https://builds.apache.org/job/Struts-site-javadocs/ws/target/struts-project/bundles/demo/target/site/apidocs/actions/osgi/class-use/Message.html...>
Generating <https://builds.apache.org/job/Struts-site-javadocs/ws/target/struts-project/bundles/demo/target/site/apidocs/actions/osgi/class-use/HelloWorldAction.html...>
Generating <https://builds.apache.org/job/Struts-site-javadocs/ws/target/struts-project/bundles/demo/target/site/apidocs/actions/osgi/class-use/BundlesAction.html...>
Generating <https://builds.apache.org/job/Struts-site-javadocs/ws/target/struts-project/bundles/demo/target/site/apidocs/actions/osgi/package-use.html...>
Building index for all the packages and classes...
Generating <https://builds.apache.org/job/Struts-site-javadocs/ws/target/struts-project/bundles/demo/target/site/apidocs/overview-tree.html...>
Generating <https://builds.apache.org/job/Struts-site-javadocs/ws/target/struts-project/bundles/demo/target/site/apidocs/index-all.html...>
Generating <https://builds.apache.org/job/Struts-site-javadocs/ws/target/struts-project/bundles/demo/target/site/apidocs/deprecated-list.html...>
Building index for all classes...
Generating <https://builds.apache.org/job/Struts-site-javadocs/ws/target/struts-project/bundles/demo/target/site/apidocs/allclasses-frame.html...>
Generating <https://builds.apache.org/job/Struts-site-javadocs/ws/target/struts-project/bundles/demo/target/site/apidocs/allclasses-noframe.html...>
Generating <https://builds.apache.org/job/Struts-site-javadocs/ws/target/struts-project/bundles/demo/target/site/apidocs/index.html...>
Generating <https://builds.apache.org/job/Struts-site-javadocs/ws/target/struts-project/bundles/demo/target/site/apidocs/help-doc.html...>
[INFO] Generating "Rat Report" report           --- apache-rat-plugin:0.11:rat
[INFO] 51 implicit excludes (use -debug for more details).
[INFO] Exclude: src/main/resources/org/apache/struts2/static/domTT.js
[INFO] Exclude: src/site/resources/tags/**/*.html
[INFO] Exclude: src/main/resources/*LICENSE.txt
[INFO] Exclude: src/test/resources/**/*.txt
[INFO] Exclude: src/main/webapp/**/*.css
[INFO] Exclude: src/main/webapp/**/*.map
[INFO] Exclude: src/main/webapp/**/*.js
[INFO] Exclude: src/main/webapp/**/*.svg
[INFO] Exclude: src/main/webapp/**/*.txt
[INFO] Exclude: src/main/resources/**/sitegraph-usage.txt
[INFO] Exclude: src/main/resources/**/docs-urls.txt
[INFO] Exclude: src/etc/header.txt
[INFO] Exclude: src/main/resources/static/css/**/*.css
[INFO] Exclude: src/main/resources/static/js/**/*.js
[INFO] Exclude: src/main/resources/docs.cfg
[INFO] Exclude: src/main/webapp/fonts/**/*
[INFO] 11 resources included (use -debug for more details)
[INFO] Generating "Dependency Check" report     --- dependency-check-maven:3.0.2:aggregate
[INFO] Checking for updates
[INFO] Skipping NVD check since last check was within 4 hours.
[INFO] Check for updates complete (26 ms)
[INFO] Analysis Started
[INFO] Finished Archive Analyzer (0 seconds)
[INFO] Finished File Name Analyzer (0 seconds)
[INFO] Finished Jar Analyzer (0 seconds)
[INFO] Finished Central Analyzer (0 seconds)
[INFO] Finished Dependency Merging Analyzer (0 seconds)
[INFO] Finished Version Filter Analyzer (0 seconds)
[INFO] Finished Hint Analyzer (0 seconds)
[INFO] Created CPE Index (0 seconds)
[INFO] Finished CPE Analyzer (1 seconds)
[INFO] Finished False Positive Analyzer (0 seconds)
[INFO] Finished Cpe Suppression Analyzer (0 seconds)
[INFO] Finished NVD CVE Analyzer (0 seconds)
[INFO] Finished Vulnerability Suppression Analyzer (0 seconds)
[INFO] Finished Dependency Bundling Analyzer (0 seconds)
[INFO] Analysis Complete (2 seconds)
[WARNING]

One or more dependencies were identified with known vulnerabilities in Struts 2 OSGi Demo Bundle:

struts-core-1.3.8.jar (org.apache.struts:struts-core:1.3.8, cpe:/a:apache:struts:1.3.8) : CVE-2016-1181, CVE-2016-1182, CVE-2014-0114, CVE-2015-0899
struts-tiles-1.3.8.jar (cpe:/a:apache:tiles:1.3.8, org.apache.struts:struts-tiles:1.3.8, cpe:/a:apache:struts:1.3.8) : CVE-2016-1181, CVE-2016-1182, CVE-2014-0114, CVE-2015-0899


See the dependency-check report for more details.


[INFO] Generating "Dependency Updates Report" report --- versions-maven-plugin:2.5:dependency-updates-report
[INFO] Generating "Plugin Updates Report" report --- versions-maven-plugin:2.5:plugin-updates-report
[INFO] Generating "Property Updates Report" report --- versions-maven-plugin:2.5:property-updates-report
[INFO]
[INFO] --- maven-site-plugin:3.5.1:stage (default-cli) @ struts2-osgi-demo-bundle ---
[INFO] Using this base directory for staging: <https://builds.apache.org/job/Struts-site-javadocs/ws/target/struts-project/target/staging>
file://<https://builds.apache.org/job/Struts-site-javadocs/ws/target/struts-project/target/staging/> - Session: Opened  
[INFO] Pushing <https://builds.apache.org/job/Struts-site-javadocs/ws/target/struts-project/bundles/demo/target/site>
[INFO]    >>> to file://<https://builds.apache.org/job/Struts-site-javadocs/ws/target/struts-project/target/staging/struts2-parent/struts2-osgi-bundles/struts2-osgi-demo-bundle>
file://<https://builds.apache.org/job/Struts-site-javadocs/ws/target/struts-project/target/staging/> - Session: Disconnecting  
file://<https://builds.apache.org/job/Struts-site-javadocs/ws/target/struts-project/target/staging/> - Session: Disconnected
[INFO]
[INFO] ------------------------------------------------------------------------
[INFO] Building Struts 2 Assembly 2.5.14.1
[INFO] ------------------------------------------------------------------------
[INFO]
[INFO] --- maven-site-plugin:3.5.1:site (default-cli) @ struts2-assembly ---
[INFO] maven.site.skip = true: Skipping site generation
[INFO]
[INFO] --- maven-site-plugin:3.5.1:stage (default-cli) @ struts2-assembly ---
[INFO] maven.site.skip = true: Skipping site staging
[INFO] ------------------------------------------------------------------------
[INFO] Reactor Summary:
[INFO]
[INFO] Struts 2 Bill of Materials ......................... SUCCESS [  0.761 s]
[INFO] Struts 2 ........................................... SUCCESS [ 35.292 s]
[INFO] Struts 2 Core ...................................... SUCCESS [ 28.772 s]
[INFO] Struts Plugins ..................................... SUCCESS [ 12.444 s]
[INFO] Struts 2 Configuration Browser Plugin .............. SUCCESS [  8.871 s]
[INFO] Struts 2 Sitemesh Plugin ........................... SUCCESS [ 10.645 s]
[INFO] Struts 2 Tiles Plugin .............................. SUCCESS [  9.436 s]
[INFO] Struts 2 DWR Plugin ................................ SUCCESS [  8.029 s]
[INFO] Struts 2 Spring Plugin ............................. SUCCESS [  9.826 s]
[INFO] Struts 2 Convention Plugin ......................... SUCCESS [ 16.476 s]
[INFO] Struts 2 JUnit Plugin .............................. SUCCESS [  9.320 s]
[INFO] Struts 2 JSON Plugin ............................... SUCCESS [ 11.009 s]
[INFO] Struts 2 Bean Validation Plugin .................... SUCCESS [  8.355 s]
[INFO] Struts 2 Webapps ................................... SUCCESS [  0.010 s]
[INFO] Struts 2 Showcase Webapp ........................... SUCCESS [  0.025 s]
[INFO] Struts 2 REST Plugin ............................... SUCCESS [ 10.306 s]
[INFO] Struts 2 Rest Showcase Webapp ...................... SUCCESS [  0.015 s]
[INFO] Struts 2 CDI Plugin ................................ SUCCESS [  9.349 s]
[INFO] Struts 2 Embedded JSP Plugin ....................... SUCCESS [ 15.117 s]
[INFO] Struts 2 GXP Plugin ................................ SUCCESS [  8.840 s]
[INFO] Struts 2 Jasper Reports Plugin ..................... SUCCESS [ 10.487 s]
[INFO] Struts 2 Java Templates Plugin ..................... SUCCESS [  8.924 s]
[INFO] Struts 2 JFreeChart Plugin ......................... SUCCESS [  9.149 s]
[INFO] Struts 2 OSGi Plugin ............................... SUCCESS [  9.796 s]
[INFO] Struts 2 OVal Plugin ............................... SUCCESS [  9.040 s]
[INFO] Struts 2 Pell Multipart Plugin ..................... SUCCESS [  7.270 s]
[INFO] Struts 2 Plexus Plugin ............................. SUCCESS [  7.914 s]
[INFO] Struts 2 Portlet Plugin ............................ SUCCESS [ 12.397 s]
[INFO] Struts 2 Portlet Tiles Plugin ...................... SUCCESS [  8.437 s]
[INFO] DEPRECATED: Struts 2 Sitegraph Plugin .............. SUCCESS [ 10.192 s]
[INFO] Struts 2 TestNG Plugin ............................. SUCCESS [  7.844 s]
[INFO] Struts OSGi Bundles ................................ SUCCESS [  6.597 s]
[INFO] Struts 2 OSGi Admin Bundle ......................... SUCCESS [  9.891 s]
[INFO] Struts 2 OSGi Demo Bundle .......................... SUCCESS [ 10.765 s]
[INFO] Struts 2 Assembly .................................. SUCCESS [  0.020 s]
[INFO] ------------------------------------------------------------------------
[INFO] BUILD SUCCESS
[INFO] ------------------------------------------------------------------------
[INFO] Total time: 05:43 min
[INFO] Finished at: 2017-12-04T13:10:27Z
[INFO] Final Memory: 80M/1162M
[INFO] ------------------------------------------------------------------------
+ cd ../..
Setting MAVEN_3_LATEST__HOME=/home/jenkins/tools/maven/latest3/
[Struts-site-javadocs] $ /bin/bash -xe /tmp/jenkins921222830393849426.sh
+ git checkout asf-site
Previous HEAD position was 606fa48... Merge pull request #47 from yasserzamani/WW-4034
Switched to a new branch 'asf-site'
Branch asf-site set up to track remote branch asf-site from origin.
+ git pull origin asf-site
From https://gitbox.apache.org/repos/asf/struts-site
 * branch            asf-site   -> FETCH_HEAD
Already up-to-date.
+ cp -r 'target/struts-project/staging/*' content/maven/css content/maven/dependencies.html content/maven/dependency-check-report.html content/maven/dependency-convergence.html content/maven/dependency-info.html content/maven/dependency-management.html content/maven/distribution-management.html content/maven/fonts content/maven/images content/maven/img content/maven/index.html content/maven/integration.html content/maven/issue-tracking.html content/maven/js content/maven/license.html content/maven/mail-lists.html content/maven/modules.html content/maven/plugin-management.html content/maven/plugins.html content/maven/project-info.html content/maven/project-reports.html content/maven/project-summary.html content/maven/rat-report.html content/maven/source-repository.html content/maven/struts2-core content/maven/struts2-osgi-bundles content/maven/struts2-parent content/maven/struts2-plugins content/maven/team-list.html
cp: target 'content/maven/team-list.html' is not a directory
Build step 'Execute shell' marked build as failure
Setting MAVEN_3_LATEST__HOME=/home/jenkins/tools/maven/latest3/

---------------------------------------------------------------------
To unsubscribe, e-mail: [hidden email]
For additional commands, e-mail: [hidden email]

Reply | Threaded
Open this post in threaded view
|

Build failed in Jenkins: Struts-site-javadocs #10

Apache Jenkins Server-2
See <https://builds.apache.org/job/Struts-site-javadocs/10/display/redirect?page=changes>

Changes:

[github] Mention Maven and maven-archetypes on donwload page

[github] gs - using properties for maven version is best practice

[github] llink to maven-artifacts.html

[github] gs - show full web.xml and its location

[github] Link from Releases to Download page

[github] rename Home menu item to Releases

[github] Use http://code.jquery.com instead of googleapis.com

[github] fix missing link to web.xml page

------------------------------------------
[...truncated 919.28 KB...]
[INFO] Finished Dependency Bundling Analyzer (0 seconds)
[INFO] Analysis Complete (2 seconds)
[INFO] Generating "Dependency Updates Report" report --- versions-maven-plugin:2.5:dependency-updates-report
[INFO] Generating "Plugin Updates Report" report --- versions-maven-plugin:2.5:plugin-updates-report
[INFO] Generating "Property Updates Report" report --- versions-maven-plugin:2.5:property-updates-report
[INFO]
[INFO] --- maven-site-plugin:3.5.1:stage (default-cli) @ struts2-osgi-admin-bundle ---
[INFO] Using this base directory for staging: <https://builds.apache.org/job/Struts-site-javadocs/ws/target/struts-project/target/staging>
file://<https://builds.apache.org/job/Struts-site-javadocs/ws/target/struts-project/target/staging/> - Session: Opened  
[INFO] Pushing <https://builds.apache.org/job/Struts-site-javadocs/ws/target/struts-project/bundles/admin/target/site>
[INFO]    >>> to file://<https://builds.apache.org/job/Struts-site-javadocs/ws/target/struts-project/target/staging/struts2-parent/struts2-osgi-bundles/struts2-osgi-admin-bundle>
file://<https://builds.apache.org/job/Struts-site-javadocs/ws/target/struts-project/target/staging/> - Session: Disconnecting  
file://<https://builds.apache.org/job/Struts-site-javadocs/ws/target/struts-project/target/staging/> - Session: Disconnected
[INFO]
[INFO] ------------------------------------------------------------------------
[INFO] Building Struts 2 OSGi Demo Bundle 2.5.14.1
[INFO] ------------------------------------------------------------------------
[INFO]
[INFO] --- maven-clean-plugin:3.0.0:clean (default-clean) @ struts2-osgi-demo-bundle ---
[INFO]
[INFO] --- maven-site-plugin:3.5.1:site (default-cli) @ struts2-osgi-demo-bundle ---
[INFO] configuring report plugin org.apache.maven.plugins:maven-project-info-reports-plugin:2.7
[INFO] configuring report plugin org.apache.maven.plugins:maven-javadoc-plugin:2.10.3
[INFO] preparing 'javadoc' report requires 'generate-sources' forked phase execution
[INFO]
[INFO] >>> maven-javadoc-plugin:2.10.3:javadoc > generate-sources @ struts2-osgi-demo-bundle >>>
[INFO]
[INFO] <<< maven-javadoc-plugin:2.10.3:javadoc < generate-sources @ struts2-osgi-demo-bundle <<<
[INFO]
[INFO] configuring report plugin org.apache.rat:apache-rat-plugin:0.11
[INFO] configuring report plugin org.owasp:dependency-check-maven:3.0.2
[INFO] configuring report plugin org.codehaus.mojo:versions-maven-plugin:2.5
[INFO] configuring report plugin org.codehaus.mojo:rat-maven-plugin:1.0-alpha-2
[INFO] Rendering site with org.apache.maven.skins:maven-fluido-skin:jar:1.6 skin.
[INFO] Skipped "RAT Report" report (rat-maven-plugin:1.0-alpha-2:rat), file "rat-report.html" already exists for the English version.
[INFO] Generating "About" report                --- maven-project-info-reports-plugin:2.7:index
[INFO] Generating "Plugin Management" report    --- maven-project-info-reports-plugin:2.7:plugin-management
[INFO] Generating "Distribution Management" report --- maven-project-info-reports-plugin:2.7:distribution-management
[INFO] Generating "Dependency Information" report --- maven-project-info-reports-plugin:2.7:dependency-info
[INFO] Generating "Source Repository" report    --- maven-project-info-reports-plugin:2.7:scm
[INFO] Generating "Mailing Lists" report        --- maven-project-info-reports-plugin:2.7:mailing-list
[INFO] Generating "Issue Tracking" report       --- maven-project-info-reports-plugin:2.7:issue-tracking
[INFO] Generating "Continuous Integration" report --- maven-project-info-reports-plugin:2.7:cim
[INFO] Generating "Project Plugins" report      --- maven-project-info-reports-plugin:2.7:plugins
[INFO] Generating "Project License" report      --- maven-project-info-reports-plugin:2.7:license
[INFO] Generating "Dependency Management" report --- maven-project-info-reports-plugin:2.7:dependency-management
[INFO] Generating "Project Team" report         --- maven-project-info-reports-plugin:2.7:project-team
[INFO] Generating "Project Summary" report      --- maven-project-info-reports-plugin:2.7:summary
[INFO] Generating "Dependencies" report         --- maven-project-info-reports-plugin:2.7:dependencies
[WARNING] Unable to process class META-INF/versions/9/org/apache/logging/log4j/util/StackLocator.class in JarAnalyzer File /home/jenkins/.m2/repository/org/apache/logging/log4j/log4j-api/2.9.1/log4j-api-2.9.1.jar
org.apache.bcel.classfile.ClassFormatException: Invalid byte tag in constant pool: 18
    at org.apache.bcel.classfile.Constant.readConstant (Constant.java:146)
    at org.apache.bcel.classfile.ConstantPool.<init> (ConstantPool.java:67)
    at org.apache.bcel.classfile.ClassParser.readConstantPool (ClassParser.java:222)
    at org.apache.bcel.classfile.ClassParser.parse (ClassParser.java:136)
    at org.apache.maven.shared.jar.classes.JarClassesAnalysis.analyze (JarClassesAnalysis.java:92)
    at org.apache.maven.report.projectinfo.dependencies.Dependencies.getJarDependencyDetails (Dependencies.java:255)
    at org.apache.maven.report.projectinfo.dependencies.renderer.DependenciesRenderer.hasSealed (DependenciesRenderer.java:1454)
    at org.apache.maven.report.projectinfo.dependencies.renderer.DependenciesRenderer.renderSectionDependencyFileDetails (DependenciesRenderer.java:536)
    at org.apache.maven.report.projectinfo.dependencies.renderer.DependenciesRenderer.renderBody (DependenciesRenderer.java:263)
    at org.apache.maven.reporting.AbstractMavenReportRenderer.render (AbstractMavenReportRenderer.java:79)
    at org.apache.maven.report.projectinfo.DependenciesReport.executeReport (DependenciesReport.java:186)
    at org.apache.maven.reporting.AbstractMavenReport.generate (AbstractMavenReport.java:190)
    at org.apache.maven.plugins.site.render.ReportDocumentRenderer.renderDocument (ReportDocumentRenderer.java:227)
    at org.apache.maven.doxia.siterenderer.DefaultSiteRenderer.render (DefaultSiteRenderer.java:329)
    at org.apache.maven.plugins.site.render.SiteMojo.renderLocale (SiteMojo.java:181)
    at org.apache.maven.plugins.site.render.SiteMojo.execute (SiteMojo.java:135)
    at org.apache.maven.plugin.DefaultBuildPluginManager.executeMojo (DefaultBuildPluginManager.java:134)
    at org.apache.maven.lifecycle.internal.MojoExecutor.execute (MojoExecutor.java:208)
    at org.apache.maven.lifecycle.internal.MojoExecutor.execute (MojoExecutor.java:154)
    at org.apache.maven.lifecycle.internal.MojoExecutor.execute (MojoExecutor.java:146)
    at org.apache.maven.lifecycle.internal.LifecycleModuleBuilder.buildProject (LifecycleModuleBuilder.java:117)
    at org.apache.maven.lifecycle.internal.LifecycleModuleBuilder.buildProject (LifecycleModuleBuilder.java:81)
    at org.apache.maven.lifecycle.internal.builder.singlethreaded.SingleThreadedBuilder.build (SingleThreadedBuilder.java:51)
    at org.apache.maven.lifecycle.internal.LifecycleStarter.execute (LifecycleStarter.java:128)
    at org.apache.maven.DefaultMaven.doExecute (DefaultMaven.java:309)
    at org.apache.maven.DefaultMaven.doExecute (DefaultMaven.java:194)
    at org.apache.maven.DefaultMaven.execute (DefaultMaven.java:107)
    at org.apache.maven.cli.MavenCli.execute (MavenCli.java:955)
    at org.apache.maven.cli.MavenCli.doMain (MavenCli.java:290)
    at org.apache.maven.cli.MavenCli.main (MavenCli.java:194)
    at sun.reflect.NativeMethodAccessorImpl.invoke0 (Native Method)
    at sun.reflect.NativeMethodAccessorImpl.invoke (NativeMethodAccessorImpl.java:57)
    at sun.reflect.DelegatingMethodAccessorImpl.invoke (DelegatingMethodAccessorImpl.java:43)
    at java.lang.reflect.Method.invoke (Method.java:606)
    at org.codehaus.plexus.classworlds.launcher.Launcher.launchEnhanced (Launcher.java:289)
    at org.codehaus.plexus.classworlds.launcher.Launcher.launch (Launcher.java:229)
    at org.codehaus.plexus.classworlds.launcher.Launcher.mainWithExitCode (Launcher.java:415)
    at org.codehaus.plexus.classworlds.launcher.Launcher.main (Launcher.java:356)
[INFO] Generating "JavaDocs" report             --- maven-javadoc-plugin:2.10.3:javadoc
[INFO]
Loading source files for package actions.osgi...
Constructing Javadoc information...
Standard Doclet version 1.7.0_80
Building tree for all the packages and classes...
Generating <https://builds.apache.org/job/Struts-site-javadocs/ws/target/struts-project/bundles/demo/target/site/apidocs/actions/osgi/BundlesAction.html...>
Generating <https://builds.apache.org/job/Struts-site-javadocs/ws/target/struts-project/bundles/demo/target/site/apidocs/actions/osgi/HelloWorldAction.html...>
Generating <https://builds.apache.org/job/Struts-site-javadocs/ws/target/struts-project/bundles/demo/target/site/apidocs/actions/osgi/Message.html...>
Generating <https://builds.apache.org/job/Struts-site-javadocs/ws/target/struts-project/bundles/demo/target/site/apidocs/actions/osgi/package-frame.html...>
Generating <https://builds.apache.org/job/Struts-site-javadocs/ws/target/struts-project/bundles/demo/target/site/apidocs/actions/osgi/package-summary.html...>
Generating <https://builds.apache.org/job/Struts-site-javadocs/ws/target/struts-project/bundles/demo/target/site/apidocs/actions/osgi/package-tree.html...>
Generating <https://builds.apache.org/job/Struts-site-javadocs/ws/target/struts-project/bundles/demo/target/site/apidocs/constant-values.html...>
Generating <https://builds.apache.org/job/Struts-site-javadocs/ws/target/struts-project/bundles/demo/target/site/apidocs/serialized-form.html...>
Generating <https://builds.apache.org/job/Struts-site-javadocs/ws/target/struts-project/bundles/demo/target/site/apidocs/actions/osgi/class-use/Message.html...>
Generating <https://builds.apache.org/job/Struts-site-javadocs/ws/target/struts-project/bundles/demo/target/site/apidocs/actions/osgi/class-use/HelloWorldAction.html...>
Generating <https://builds.apache.org/job/Struts-site-javadocs/ws/target/struts-project/bundles/demo/target/site/apidocs/actions/osgi/class-use/BundlesAction.html...>
Generating <https://builds.apache.org/job/Struts-site-javadocs/ws/target/struts-project/bundles/demo/target/site/apidocs/actions/osgi/package-use.html...>
Building index for all the packages and classes...
Generating <https://builds.apache.org/job/Struts-site-javadocs/ws/target/struts-project/bundles/demo/target/site/apidocs/overview-tree.html...>
Generating <https://builds.apache.org/job/Struts-site-javadocs/ws/target/struts-project/bundles/demo/target/site/apidocs/index-all.html...>
Generating <https://builds.apache.org/job/Struts-site-javadocs/ws/target/struts-project/bundles/demo/target/site/apidocs/deprecated-list.html...>
Building index for all classes...
Generating <https://builds.apache.org/job/Struts-site-javadocs/ws/target/struts-project/bundles/demo/target/site/apidocs/allclasses-frame.html...>
Generating <https://builds.apache.org/job/Struts-site-javadocs/ws/target/struts-project/bundles/demo/target/site/apidocs/allclasses-noframe.html...>
Generating <https://builds.apache.org/job/Struts-site-javadocs/ws/target/struts-project/bundles/demo/target/site/apidocs/index.html...>
Generating <https://builds.apache.org/job/Struts-site-javadocs/ws/target/struts-project/bundles/demo/target/site/apidocs/help-doc.html...>
[INFO] Generating "Rat Report" report           --- apache-rat-plugin:0.11:rat
[INFO] 51 implicit excludes (use -debug for more details).
[INFO] Exclude: src/main/resources/org/apache/struts2/static/domTT.js
[INFO] Exclude: src/site/resources/tags/**/*.html
[INFO] Exclude: src/main/resources/*LICENSE.txt
[INFO] Exclude: src/test/resources/**/*.txt
[INFO] Exclude: src/main/webapp/**/*.css
[INFO] Exclude: src/main/webapp/**/*.map
[INFO] Exclude: src/main/webapp/**/*.js
[INFO] Exclude: src/main/webapp/**/*.svg
[INFO] Exclude: src/main/webapp/**/*.txt
[INFO] Exclude: src/main/resources/**/sitegraph-usage.txt
[INFO] Exclude: src/main/resources/**/docs-urls.txt
[INFO] Exclude: src/etc/header.txt
[INFO] Exclude: src/main/resources/static/css/**/*.css
[INFO] Exclude: src/main/resources/static/js/**/*.js
[INFO] Exclude: src/main/resources/docs.cfg
[INFO] Exclude: src/main/webapp/fonts/**/*
[INFO] 11 resources included (use -debug for more details)
[INFO] Generating "Dependency Check" report     --- dependency-check-maven:3.0.2:aggregate
[INFO] Checking for updates
[INFO] Skipping NVD check since last check was within 4 hours.
[INFO] Check for updates complete (24 ms)
[INFO] Analysis Started
[INFO] Finished Archive Analyzer (0 seconds)
[INFO] Finished File Name Analyzer (0 seconds)
[INFO] Finished Jar Analyzer (0 seconds)
[INFO] Finished Central Analyzer (0 seconds)
[INFO] Finished Dependency Merging Analyzer (0 seconds)
[INFO] Finished Version Filter Analyzer (0 seconds)
[INFO] Finished Hint Analyzer (0 seconds)
[INFO] Created CPE Index (0 seconds)
[INFO] Finished CPE Analyzer (1 seconds)
[INFO] Finished False Positive Analyzer (0 seconds)
[INFO] Finished Cpe Suppression Analyzer (0 seconds)
[INFO] Finished NVD CVE Analyzer (0 seconds)
[INFO] Finished Vulnerability Suppression Analyzer (0 seconds)
[INFO] Finished Dependency Bundling Analyzer (0 seconds)
[INFO] Analysis Complete (2 seconds)
[WARNING]

One or more dependencies were identified with known vulnerabilities in Struts 2 OSGi Demo Bundle:

struts-core-1.3.8.jar (org.apache.struts:struts-core:1.3.8, cpe:/a:apache:struts:1.3.8) : CVE-2016-1181, CVE-2016-1182, CVE-2014-0114, CVE-2015-0899
struts-tiles-1.3.8.jar (cpe:/a:apache:tiles:1.3.8, org.apache.struts:struts-tiles:1.3.8, cpe:/a:apache:struts:1.3.8) : CVE-2016-1181, CVE-2016-1182, CVE-2014-0114, CVE-2015-0899


See the dependency-check report for more details.


[INFO] Generating "Dependency Updates Report" report --- versions-maven-plugin:2.5:dependency-updates-report
[INFO] Generating "Plugin Updates Report" report --- versions-maven-plugin:2.5:plugin-updates-report
[INFO] Generating "Property Updates Report" report --- versions-maven-plugin:2.5:property-updates-report
[INFO]
[INFO] --- maven-site-plugin:3.5.1:stage (default-cli) @ struts2-osgi-demo-bundle ---
[INFO] Using this base directory for staging: <https://builds.apache.org/job/Struts-site-javadocs/ws/target/struts-project/target/staging>
file://<https://builds.apache.org/job/Struts-site-javadocs/ws/target/struts-project/target/staging/> - Session: Opened  
[INFO] Pushing <https://builds.apache.org/job/Struts-site-javadocs/ws/target/struts-project/bundles/demo/target/site>
[INFO]    >>> to file://<https://builds.apache.org/job/Struts-site-javadocs/ws/target/struts-project/target/staging/struts2-parent/struts2-osgi-bundles/struts2-osgi-demo-bundle>
file://<https://builds.apache.org/job/Struts-site-javadocs/ws/target/struts-project/target/staging/> - Session: Disconnecting  
file://<https://builds.apache.org/job/Struts-site-javadocs/ws/target/struts-project/target/staging/> - Session: Disconnected
[INFO]
[INFO] ------------------------------------------------------------------------
[INFO] Building Struts 2 Assembly 2.5.14.1
[INFO] ------------------------------------------------------------------------
[INFO]
[INFO] --- maven-clean-plugin:3.0.0:clean (default-clean) @ struts2-assembly ---
[INFO]
[INFO] --- maven-site-plugin:3.5.1:site (default-cli) @ struts2-assembly ---
[INFO] maven.site.skip = true: Skipping site generation
[INFO]
[INFO] --- maven-site-plugin:3.5.1:stage (default-cli) @ struts2-assembly ---
[INFO] maven.site.skip = true: Skipping site staging
[INFO] ------------------------------------------------------------------------
[INFO] Reactor Summary:
[INFO]
[INFO] Struts 2 Bill of Materials ......................... SUCCESS [  0.806 s]
[INFO] Struts 2 ........................................... SUCCESS [ 35.279 s]
[INFO] Struts 2 Core ...................................... SUCCESS [ 28.045 s]
[INFO] Struts Plugins ..................................... SUCCESS [ 12.520 s]
[INFO] Struts 2 Configuration Browser Plugin .............. SUCCESS [  9.034 s]
[INFO] Struts 2 Sitemesh Plugin ........................... SUCCESS [  9.837 s]
[INFO] Struts 2 Tiles Plugin .............................. SUCCESS [  9.757 s]
[INFO] Struts 2 DWR Plugin ................................ SUCCESS [  7.910 s]
[INFO] Struts 2 Spring Plugin ............................. SUCCESS [  9.590 s]
[INFO] Struts 2 Convention Plugin ......................... SUCCESS [ 16.298 s]
[INFO] Struts 2 JUnit Plugin .............................. SUCCESS [  9.704 s]
[INFO] Struts 2 JSON Plugin ............................... SUCCESS [ 10.771 s]
[INFO] Struts 2 Bean Validation Plugin .................... SUCCESS [  8.674 s]
[INFO] Struts 2 Webapps ................................... SUCCESS [  0.009 s]
[INFO] Struts 2 Showcase Webapp ........................... SUCCESS [  0.025 s]
[INFO] Struts 2 REST Plugin ............................... SUCCESS [  9.937 s]
[INFO] Struts 2 Rest Showcase Webapp ...................... SUCCESS [  0.016 s]
[INFO] Struts 2 CDI Plugin ................................ SUCCESS [  9.035 s]
[INFO] Struts 2 Embedded JSP Plugin ....................... SUCCESS [ 14.859 s]
[INFO] Struts 2 GXP Plugin ................................ SUCCESS [  8.416 s]
[INFO] Struts 2 Jasper Reports Plugin ..................... SUCCESS [ 10.425 s]
[INFO] Struts 2 Java Templates Plugin ..................... SUCCESS [  8.785 s]
[INFO] Struts 2 JFreeChart Plugin ......................... SUCCESS [  9.087 s]
[INFO] Struts 2 OSGi Plugin ............................... SUCCESS [ 10.285 s]
[INFO] Struts 2 OVal Plugin ............................... SUCCESS [  8.778 s]
[INFO] Struts 2 Pell Multipart Plugin ..................... SUCCESS [  7.498 s]
[INFO] Struts 2 Plexus Plugin ............................. SUCCESS [  7.958 s]
[INFO] Struts 2 Portlet Plugin ............................ SUCCESS [ 13.326 s]
[INFO] Struts 2 Portlet Tiles Plugin ...................... SUCCESS [  8.627 s]
[INFO] DEPRECATED: Struts 2 Sitegraph Plugin .............. SUCCESS [ 10.556 s]
[INFO] Struts 2 TestNG Plugin ............................. SUCCESS [  8.185 s]
[INFO] Struts OSGi Bundles ................................ SUCCESS [  6.842 s]
[INFO] Struts 2 OSGi Admin Bundle ......................... SUCCESS [  9.534 s]
[INFO] Struts 2 OSGi Demo Bundle .......................... SUCCESS [ 10.471 s]
[INFO] Struts 2 Assembly .................................. SUCCESS [  0.038 s]
[INFO] ------------------------------------------------------------------------
[INFO] BUILD SUCCESS
[INFO] ------------------------------------------------------------------------
[INFO] Total time: 05:42 min
[INFO] Finished at: 2017-12-05T10:44:57Z
[INFO] Final Memory: 82M/1169M
[INFO] ------------------------------------------------------------------------
+ cd ../..
Setting MAVEN_3_LATEST__HOME=/home/jenkins/tools/maven/latest3/
[Struts-site-javadocs] $ /bin/bash -xe /tmp/jenkins6252031076842854417.sh
+ git checkout asf-site
Previous HEAD position was 5afa5db... Merge pull request #54 from paulvi/patch-2
Switched to a new branch 'asf-site'
Branch asf-site set up to track remote branch asf-site from origin.
+ git pull origin asf-site
From https://gitbox.apache.org/repos/asf/struts-site
 * branch            asf-site   -> FETCH_HEAD
Already up-to-date.
+ cp -r 'target/struts-project/staging/struts2-parent/*' content/maven/css content/maven/dependencies.html content/maven/dependency-check-report.html content/maven/dependency-convergence.html content/maven/dependency-info.html content/maven/dependency-management.html content/maven/distribution-management.html content/maven/fonts content/maven/images content/maven/img content/maven/index.html content/maven/integration.html content/maven/issue-tracking.html content/maven/js content/maven/license.html content/maven/mail-lists.html content/maven/modules.html content/maven/plugin-management.html content/maven/plugins.html content/maven/project-info.html content/maven/project-reports.html content/maven/project-summary.html content/maven/rat-report.html content/maven/source-repository.html content/maven/struts2-core content/maven/struts2-osgi-bundles content/maven/struts2-plugins content/maven/team-list.html
cp: target 'content/maven/team-list.html' is not a directory
Build step 'Execute shell' marked build as failure
Setting MAVEN_3_LATEST__HOME=/home/jenkins/tools/maven/latest3/

---------------------------------------------------------------------
To unsubscribe, e-mail: [hidden email]
For additional commands, e-mail: [hidden email]

Reply | Threaded
Open this post in threaded view
|

Build failed in Jenkins: Struts-site-javadocs #11

Apache Jenkins Server-2
See <https://builds.apache.org/job/Struts-site-javadocs/11/display/redirect>

------------------------------------------
[...truncated 908.81 KB...]
[INFO] Finished Dependency Bundling Analyzer (0 seconds)
[INFO] Analysis Complete (1 seconds)
[INFO] Generating "Dependency Updates Report" report --- versions-maven-plugin:2.5:dependency-updates-report
[INFO] Generating "Plugin Updates Report" report --- versions-maven-plugin:2.5:plugin-updates-report
[INFO] Generating "Property Updates Report" report --- versions-maven-plugin:2.5:property-updates-report
[INFO]
[INFO] --- maven-site-plugin:3.5.1:stage (default-cli) @ struts2-osgi-admin-bundle ---
[INFO] Using this base directory for staging: <https://builds.apache.org/job/Struts-site-javadocs/ws/target/struts-project/target/staging>
file://<https://builds.apache.org/job/Struts-site-javadocs/ws/target/struts-project/target/staging/> - Session: Opened  
[INFO] Pushing <https://builds.apache.org/job/Struts-site-javadocs/ws/target/struts-project/bundles/admin/target/site>
[INFO]    >>> to file://<https://builds.apache.org/job/Struts-site-javadocs/ws/target/struts-project/target/staging/struts2-parent/struts2-osgi-bundles/struts2-osgi-admin-bundle>
file://<https://builds.apache.org/job/Struts-site-javadocs/ws/target/struts-project/target/staging/> - Session: Disconnecting  
file://<https://builds.apache.org/job/Struts-site-javadocs/ws/target/struts-project/target/staging/> - Session: Disconnected
[INFO]
[INFO] ------------------------------------------------------------------------
[INFO] Building Struts 2 OSGi Demo Bundle 2.5.14.1
[INFO] ------------------------------------------------------------------------
[INFO]
[INFO] --- maven-clean-plugin:3.0.0:clean (default-clean) @ struts2-osgi-demo-bundle ---
[INFO]
[INFO] --- maven-site-plugin:3.5.1:site (default-cli) @ struts2-osgi-demo-bundle ---
[INFO] configuring report plugin org.apache.maven.plugins:maven-project-info-reports-plugin:2.7
[INFO] configuring report plugin org.apache.maven.plugins:maven-javadoc-plugin:2.10.3
[INFO] preparing 'javadoc' report requires 'generate-sources' forked phase execution
[INFO]
[INFO] >>> maven-javadoc-plugin:2.10.3:javadoc > generate-sources @ struts2-osgi-demo-bundle >>>
[INFO]
[INFO] <<< maven-javadoc-plugin:2.10.3:javadoc < generate-sources @ struts2-osgi-demo-bundle <<<
[INFO]
[INFO] configuring report plugin org.apache.rat:apache-rat-plugin:0.11
[INFO] configuring report plugin org.owasp:dependency-check-maven:3.0.2
[INFO] configuring report plugin org.codehaus.mojo:versions-maven-plugin:2.5
[INFO] configuring report plugin org.codehaus.mojo:rat-maven-plugin:1.0-alpha-2
[INFO] Rendering site with org.apache.maven.skins:maven-fluido-skin:jar:1.6 skin.
[INFO] Skipped "RAT Report" report (rat-maven-plugin:1.0-alpha-2:rat), file "rat-report.html" already exists for the English version.
[INFO] Generating "About" report                --- maven-project-info-reports-plugin:2.7:index
[INFO] Generating "Plugin Management" report    --- maven-project-info-reports-plugin:2.7:plugin-management
[INFO] Generating "Distribution Management" report --- maven-project-info-reports-plugin:2.7:distribution-management
[INFO] Generating "Dependency Information" report --- maven-project-info-reports-plugin:2.7:dependency-info
[INFO] Generating "Source Repository" report    --- maven-project-info-reports-plugin:2.7:scm
[INFO] Generating "Mailing Lists" report        --- maven-project-info-reports-plugin:2.7:mailing-list
[INFO] Generating "Issue Tracking" report       --- maven-project-info-reports-plugin:2.7:issue-tracking
[INFO] Generating "Continuous Integration" report --- maven-project-info-reports-plugin:2.7:cim
[INFO] Generating "Project Plugins" report      --- maven-project-info-reports-plugin:2.7:plugins
[INFO] Generating "Project License" report      --- maven-project-info-reports-plugin:2.7:license
[INFO] Generating "Dependency Management" report --- maven-project-info-reports-plugin:2.7:dependency-management
[INFO] Generating "Project Team" report         --- maven-project-info-reports-plugin:2.7:project-team
[INFO] Generating "Project Summary" report      --- maven-project-info-reports-plugin:2.7:summary
[INFO] Generating "Dependencies" report         --- maven-project-info-reports-plugin:2.7:dependencies
[WARNING] Unable to process class META-INF/versions/9/org/apache/logging/log4j/util/StackLocator.class in JarAnalyzer File /home/jenkins/.m2/repository/org/apache/logging/log4j/log4j-api/2.9.1/log4j-api-2.9.1.jar
org.apache.bcel.classfile.ClassFormatException: Invalid byte tag in constant pool: 18
    at org.apache.bcel.classfile.Constant.readConstant (Constant.java:146)
    at org.apache.bcel.classfile.ConstantPool.<init> (ConstantPool.java:67)
    at org.apache.bcel.classfile.ClassParser.readConstantPool (ClassParser.java:222)
    at org.apache.bcel.classfile.ClassParser.parse (ClassParser.java:136)
    at org.apache.maven.shared.jar.classes.JarClassesAnalysis.analyze (JarClassesAnalysis.java:92)
    at org.apache.maven.report.projectinfo.dependencies.Dependencies.getJarDependencyDetails (Dependencies.java:255)
    at org.apache.maven.report.projectinfo.dependencies.renderer.DependenciesRenderer.hasSealed (DependenciesRenderer.java:1454)
    at org.apache.maven.report.projectinfo.dependencies.renderer.DependenciesRenderer.renderSectionDependencyFileDetails (DependenciesRenderer.java:536)
    at org.apache.maven.report.projectinfo.dependencies.renderer.DependenciesRenderer.renderBody (DependenciesRenderer.java:263)
    at org.apache.maven.reporting.AbstractMavenReportRenderer.render (AbstractMavenReportRenderer.java:79)
    at org.apache.maven.report.projectinfo.DependenciesReport.executeReport (DependenciesReport.java:186)
    at org.apache.maven.reporting.AbstractMavenReport.generate (AbstractMavenReport.java:190)
    at org.apache.maven.plugins.site.render.ReportDocumentRenderer.renderDocument (ReportDocumentRenderer.java:227)
    at org.apache.maven.doxia.siterenderer.DefaultSiteRenderer.render (DefaultSiteRenderer.java:329)
    at org.apache.maven.plugins.site.render.SiteMojo.renderLocale (SiteMojo.java:181)
    at org.apache.maven.plugins.site.render.SiteMojo.execute (SiteMojo.java:135)
    at org.apache.maven.plugin.DefaultBuildPluginManager.executeMojo (DefaultBuildPluginManager.java:134)
    at org.apache.maven.lifecycle.internal.MojoExecutor.execute (MojoExecutor.java:208)
    at org.apache.maven.lifecycle.internal.MojoExecutor.execute (MojoExecutor.java:154)
    at org.apache.maven.lifecycle.internal.MojoExecutor.execute (MojoExecutor.java:146)
    at org.apache.maven.lifecycle.internal.LifecycleModuleBuilder.buildProject (LifecycleModuleBuilder.java:117)
    at org.apache.maven.lifecycle.internal.LifecycleModuleBuilder.buildProject (LifecycleModuleBuilder.java:81)
    at org.apache.maven.lifecycle.internal.builder.singlethreaded.SingleThreadedBuilder.build (SingleThreadedBuilder.java:51)
    at org.apache.maven.lifecycle.internal.LifecycleStarter.execute (LifecycleStarter.java:128)
    at org.apache.maven.DefaultMaven.doExecute (DefaultMaven.java:309)
    at org.apache.maven.DefaultMaven.doExecute (DefaultMaven.java:194)
    at org.apache.maven.DefaultMaven.execute (DefaultMaven.java:107)
    at org.apache.maven.cli.MavenCli.execute (MavenCli.java:955)
    at org.apache.maven.cli.MavenCli.doMain (MavenCli.java:290)
    at org.apache.maven.cli.MavenCli.main (MavenCli.java:194)
    at sun.reflect.NativeMethodAccessorImpl.invoke0 (Native Method)
    at sun.reflect.NativeMethodAccessorImpl.invoke (NativeMethodAccessorImpl.java:57)
    at sun.reflect.DelegatingMethodAccessorImpl.invoke (DelegatingMethodAccessorImpl.java:43)
    at java.lang.reflect.Method.invoke (Method.java:606)
    at org.codehaus.plexus.classworlds.launcher.Launcher.launchEnhanced (Launcher.java:289)
    at org.codehaus.plexus.classworlds.launcher.Launcher.launch (Launcher.java:229)
    at org.codehaus.plexus.classworlds.launcher.Launcher.mainWithExitCode (Launcher.java:415)
    at org.codehaus.plexus.classworlds.launcher.Launcher.main (Launcher.java:356)
[INFO] Generating "JavaDocs" report             --- maven-javadoc-plugin:2.10.3:javadoc
[INFO]
Loading source files for package actions.osgi...
Constructing Javadoc information...
Standard Doclet version 1.7.0_80
Building tree for all the packages and classes...
Generating <https://builds.apache.org/job/Struts-site-javadocs/ws/target/struts-project/bundles/demo/target/site/apidocs/actions/osgi/BundlesAction.html...>
Generating <https://builds.apache.org/job/Struts-site-javadocs/ws/target/struts-project/bundles/demo/target/site/apidocs/actions/osgi/HelloWorldAction.html...>
Generating <https://builds.apache.org/job/Struts-site-javadocs/ws/target/struts-project/bundles/demo/target/site/apidocs/actions/osgi/Message.html...>
Generating <https://builds.apache.org/job/Struts-site-javadocs/ws/target/struts-project/bundles/demo/target/site/apidocs/actions/osgi/package-frame.html...>
Generating <https://builds.apache.org/job/Struts-site-javadocs/ws/target/struts-project/bundles/demo/target/site/apidocs/actions/osgi/package-summary.html...>
Generating <https://builds.apache.org/job/Struts-site-javadocs/ws/target/struts-project/bundles/demo/target/site/apidocs/actions/osgi/package-tree.html...>
Generating <https://builds.apache.org/job/Struts-site-javadocs/ws/target/struts-project/bundles/demo/target/site/apidocs/constant-values.html...>
Generating <https://builds.apache.org/job/Struts-site-javadocs/ws/target/struts-project/bundles/demo/target/site/apidocs/serialized-form.html...>
Generating <https://builds.apache.org/job/Struts-site-javadocs/ws/target/struts-project/bundles/demo/target/site/apidocs/actions/osgi/class-use/Message.html...>
Generating <https://builds.apache.org/job/Struts-site-javadocs/ws/target/struts-project/bundles/demo/target/site/apidocs/actions/osgi/class-use/HelloWorldAction.html...>
Generating <https://builds.apache.org/job/Struts-site-javadocs/ws/target/struts-project/bundles/demo/target/site/apidocs/actions/osgi/class-use/BundlesAction.html...>
Generating <https://builds.apache.org/job/Struts-site-javadocs/ws/target/struts-project/bundles/demo/target/site/apidocs/actions/osgi/package-use.html...>
Building index for all the packages and classes...
Generating <https://builds.apache.org/job/Struts-site-javadocs/ws/target/struts-project/bundles/demo/target/site/apidocs/overview-tree.html...>
Generating <https://builds.apache.org/job/Struts-site-javadocs/ws/target/struts-project/bundles/demo/target/site/apidocs/index-all.html...>
Generating <https://builds.apache.org/job/Struts-site-javadocs/ws/target/struts-project/bundles/demo/target/site/apidocs/deprecated-list.html...>
Building index for all classes...
Generating <https://builds.apache.org/job/Struts-site-javadocs/ws/target/struts-project/bundles/demo/target/site/apidocs/allclasses-frame.html...>
Generating <https://builds.apache.org/job/Struts-site-javadocs/ws/target/struts-project/bundles/demo/target/site/apidocs/allclasses-noframe.html...>
Generating <https://builds.apache.org/job/Struts-site-javadocs/ws/target/struts-project/bundles/demo/target/site/apidocs/index.html...>
Generating <https://builds.apache.org/job/Struts-site-javadocs/ws/target/struts-project/bundles/demo/target/site/apidocs/help-doc.html...>
[INFO] Generating "Rat Report" report           --- apache-rat-plugin:0.11:rat
[INFO] 51 implicit excludes (use -debug for more details).
[INFO] Exclude: src/main/resources/org/apache/struts2/static/domTT.js
[INFO] Exclude: src/site/resources/tags/**/*.html
[INFO] Exclude: src/main/resources/*LICENSE.txt
[INFO] Exclude: src/test/resources/**/*.txt
[INFO] Exclude: src/main/webapp/**/*.css
[INFO] Exclude: src/main/webapp/**/*.map
[INFO] Exclude: src/main/webapp/**/*.js
[INFO] Exclude: src/main/webapp/**/*.svg
[INFO] Exclude: src/main/webapp/**/*.txt
[INFO] Exclude: src/main/resources/**/sitegraph-usage.txt
[INFO] Exclude: src/main/resources/**/docs-urls.txt
[INFO] Exclude: src/etc/header.txt
[INFO] Exclude: src/main/resources/static/css/**/*.css
[INFO] Exclude: src/main/resources/static/js/**/*.js
[INFO] Exclude: src/main/resources/docs.cfg
[INFO] Exclude: src/main/webapp/fonts/**/*
[INFO] 11 resources included (use -debug for more details)
[INFO] Generating "Dependency Check" report     --- dependency-check-maven:3.0.2:aggregate
[INFO] Checking for updates
[INFO] Skipping NVD check since last check was within 4 hours.
[INFO] Check for updates complete (30 ms)
[INFO] Analysis Started
[INFO] Finished Archive Analyzer (0 seconds)
[INFO] Finished File Name Analyzer (0 seconds)
[INFO] Finished Jar Analyzer (0 seconds)
[INFO] Finished Central Analyzer (0 seconds)
[INFO] Finished Dependency Merging Analyzer (0 seconds)
[INFO] Finished Version Filter Analyzer (0 seconds)
[INFO] Finished Hint Analyzer (0 seconds)
[INFO] Created CPE Index (0 seconds)
[INFO] Finished CPE Analyzer (1 seconds)
[INFO] Finished False Positive Analyzer (0 seconds)
[INFO] Finished Cpe Suppression Analyzer (0 seconds)
[INFO] Finished NVD CVE Analyzer (0 seconds)
[INFO] Finished Vulnerability Suppression Analyzer (0 seconds)
[INFO] Finished Dependency Bundling Analyzer (0 seconds)
[INFO] Analysis Complete (2 seconds)
[WARNING]

One or more dependencies were identified with known vulnerabilities in Struts 2 OSGi Demo Bundle:

struts-core-1.3.8.jar (org.apache.struts:struts-core:1.3.8, cpe:/a:apache:struts:1.3.8) : CVE-2016-1181, CVE-2016-1182, CVE-2014-0114, CVE-2015-0899
struts-tiles-1.3.8.jar (cpe:/a:apache:tiles:1.3.8, org.apache.struts:struts-tiles:1.3.8, cpe:/a:apache:struts:1.3.8) : CVE-2016-1181, CVE-2016-1182, CVE-2014-0114, CVE-2015-0899


See the dependency-check report for more details.


[INFO] Generating "Dependency Updates Report" report --- versions-maven-plugin:2.5:dependency-updates-report
[INFO] Generating "Plugin Updates Report" report --- versions-maven-plugin:2.5:plugin-updates-report
[INFO] Generating "Property Updates Report" report --- versions-maven-plugin:2.5:property-updates-report
[INFO]
[INFO] --- maven-site-plugin:3.5.1:stage (default-cli) @ struts2-osgi-demo-bundle ---
[INFO] Using this base directory for staging: <https://builds.apache.org/job/Struts-site-javadocs/ws/target/struts-project/target/staging>
file://<https://builds.apache.org/job/Struts-site-javadocs/ws/target/struts-project/target/staging/> - Session: Opened  
[INFO] Pushing <https://builds.apache.org/job/Struts-site-javadocs/ws/target/struts-project/bundles/demo/target/site>
[INFO]    >>> to file://<https://builds.apache.org/job/Struts-site-javadocs/ws/target/struts-project/target/staging/struts2-parent/struts2-osgi-bundles/struts2-osgi-demo-bundle>
file://<https://builds.apache.org/job/Struts-site-javadocs/ws/target/struts-project/target/staging/> - Session: Disconnecting  
file://<https://builds.apache.org/job/Struts-site-javadocs/ws/target/struts-project/target/staging/> - Session: Disconnected
[INFO]
[INFO] ------------------------------------------------------------------------
[INFO] Building Struts 2 Assembly 2.5.14.1
[INFO] ------------------------------------------------------------------------
[INFO]
[INFO] --- maven-clean-plugin:3.0.0:clean (default-clean) @ struts2-assembly ---
[INFO]
[INFO] --- maven-site-plugin:3.5.1:site (default-cli) @ struts2-assembly ---
[INFO] maven.site.skip = true: Skipping site generation
[INFO]
[INFO] --- maven-site-plugin:3.5.1:stage (default-cli) @ struts2-assembly ---
[INFO] maven.site.skip = true: Skipping site staging
[INFO] ------------------------------------------------------------------------
[INFO] Reactor Summary:
[INFO]
[INFO] Struts 2 Bill of Materials ......................... SUCCESS [  0.823 s]
[INFO] Struts 2 ........................................... SUCCESS [ 27.128 s]
[INFO] Struts 2 Core ...................................... SUCCESS [ 28.337 s]
[INFO] Struts Plugins ..................................... SUCCESS [ 13.089 s]
[INFO] Struts 2 Configuration Browser Plugin .............. SUCCESS [  8.588 s]
[INFO] Struts 2 Sitemesh Plugin ........................... SUCCESS [  9.789 s]
[INFO] Struts 2 Tiles Plugin .............................. SUCCESS [  9.644 s]
[INFO] Struts 2 DWR Plugin ................................ SUCCESS [  8.082 s]
[INFO] Struts 2 Spring Plugin ............................. SUCCESS [  9.511 s]
[INFO] Struts 2 Convention Plugin ......................... SUCCESS [ 16.597 s]
[INFO] Struts 2 JUnit Plugin .............................. SUCCESS [  9.770 s]
[INFO] Struts 2 JSON Plugin ............................... SUCCESS [ 11.048 s]
[INFO] Struts 2 Bean Validation Plugin .................... SUCCESS [  8.370 s]
[INFO] Struts 2 Webapps ................................... SUCCESS [  0.018 s]
[INFO] Struts 2 Showcase Webapp ........................... SUCCESS [  0.040 s]
[INFO] Struts 2 REST Plugin ............................... SUCCESS [ 10.173 s]
[INFO] Struts 2 Rest Showcase Webapp ...................... SUCCESS [  0.017 s]
[INFO] Struts 2 CDI Plugin ................................ SUCCESS [  9.165 s]
[INFO] Struts 2 Embedded JSP Plugin ....................... SUCCESS [ 15.018 s]
[INFO] Struts 2 GXP Plugin ................................ SUCCESS [  8.652 s]
[INFO] Struts 2 Jasper Reports Plugin ..................... SUCCESS [ 10.590 s]
[INFO] Struts 2 Java Templates Plugin ..................... SUCCESS [  8.568 s]
[INFO] Struts 2 JFreeChart Plugin ......................... SUCCESS [  9.196 s]
[INFO] Struts 2 OSGi Plugin ............................... SUCCESS [ 10.119 s]
[INFO] Struts 2 OVal Plugin ............................... SUCCESS [  8.579 s]
[INFO] Struts 2 Pell Multipart Plugin ..................... SUCCESS [  7.714 s]
[INFO] Struts 2 Plexus Plugin ............................. SUCCESS [  8.095 s]
[INFO] Struts 2 Portlet Plugin ............................ SUCCESS [ 12.993 s]
[INFO] Struts 2 Portlet Tiles Plugin ...................... SUCCESS [  8.664 s]
[INFO] DEPRECATED: Struts 2 Sitegraph Plugin .............. SUCCESS [ 10.445 s]
[INFO] Struts 2 TestNG Plugin ............................. SUCCESS [  8.135 s]
[INFO] Struts OSGi Bundles ................................ SUCCESS [  6.782 s]
[INFO] Struts 2 OSGi Admin Bundle ......................... SUCCESS [  9.500 s]
[INFO] Struts 2 OSGi Demo Bundle .......................... SUCCESS [ 10.653 s]
[INFO] Struts 2 Assembly .................................. SUCCESS [  0.027 s]
[INFO] ------------------------------------------------------------------------
[INFO] BUILD SUCCESS
[INFO] ------------------------------------------------------------------------
[INFO] Total time: 05:35 min
[INFO] Finished at: 2017-12-05T11:11:36Z
[INFO] Final Memory: 99M/1210M
[INFO] ------------------------------------------------------------------------
+ cd ../..
Setting MAVEN_3_LATEST__HOME=/home/jenkins/tools/maven/latest3/
[Struts-site-javadocs] $ /bin/bash -xe /tmp/jenkins8468642918995502102.sh
+ git checkout asf-site
Previous HEAD position was 5afa5db... Merge pull request #54 from paulvi/patch-2
Switched to a new branch 'asf-site'
Branch asf-site set up to track remote branch asf-site from origin.
+ git pull origin asf-site
From https://gitbox.apache.org/repos/asf/struts-site
 * branch            asf-site   -> FETCH_HEAD
Already up-to-date.
+ cp -r target/struts-project/staging/struts2-parent content/maven
cp: cannot stat 'target/struts-project/staging/struts2-parent': No such file or directory
Build step 'Execute shell' marked build as failure
Setting MAVEN_3_LATEST__HOME=/home/jenkins/tools/maven/latest3/

---------------------------------------------------------------------
To unsubscribe, e-mail: [hidden email]
For additional commands, e-mail: [hidden email]

Reply | Threaded
Open this post in threaded view
|

Build failed in Jenkins: Struts-site-javadocs #12

Apache Jenkins Server-2
See <https://builds.apache.org/job/Struts-site-javadocs/12/display/redirect>

------------------------------------------
[...truncated 1.06 MB...]
[INFO] Finished Dependency Bundling Analyzer (0 seconds)
[INFO] Analysis Complete (2 seconds)
[INFO] Generating "Dependency Updates Report" report --- versions-maven-plugin:2.5:dependency-updates-report
[INFO] Generating "Plugin Updates Report" report --- versions-maven-plugin:2.5:plugin-updates-report
[INFO] Generating "Property Updates Report" report --- versions-maven-plugin:2.5:property-updates-report
[INFO]
[INFO] --- maven-site-plugin:3.5.1:stage (default-cli) @ struts2-osgi-admin-bundle ---
[INFO] Using this base directory for staging: <https://builds.apache.org/job/Struts-site-javadocs/ws/target/struts-project/target/staging>
file://<https://builds.apache.org/job/Struts-site-javadocs/ws/target/struts-project/target/staging/> - Session: Opened  
[INFO] Pushing <https://builds.apache.org/job/Struts-site-javadocs/ws/target/struts-project/bundles/admin/target/site>
[INFO]    >>> to file://<https://builds.apache.org/job/Struts-site-javadocs/ws/target/struts-project/target/staging/struts2-parent/struts2-osgi-bundles/struts2-osgi-admin-bundle>
file://<https://builds.apache.org/job/Struts-site-javadocs/ws/target/struts-project/target/staging/> - Session: Disconnecting  
file://<https://builds.apache.org/job/Struts-site-javadocs/ws/target/struts-project/target/staging/> - Session: Disconnected
[INFO]
[INFO] ------------------------------------------------------------------------
[INFO] Building Struts 2 OSGi Demo Bundle 2.5.14.1
[INFO] ------------------------------------------------------------------------
[INFO]
[INFO] --- maven-clean-plugin:3.0.0:clean (default-clean) @ struts2-osgi-demo-bundle ---
[INFO]
[INFO] --- maven-site-plugin:3.5.1:site (default-cli) @ struts2-osgi-demo-bundle ---
[INFO] configuring report plugin org.apache.maven.plugins:maven-project-info-reports-plugin:2.7
[INFO] configuring report plugin org.apache.maven.plugins:maven-javadoc-plugin:2.10.3
[INFO] preparing 'javadoc' report requires 'generate-sources' forked phase execution
[INFO]
[INFO] >>> maven-javadoc-plugin:2.10.3:javadoc > generate-sources @ struts2-osgi-demo-bundle >>>
[INFO]
[INFO] <<< maven-javadoc-plugin:2.10.3:javadoc < generate-sources @ struts2-osgi-demo-bundle <<<
[INFO]
[INFO] configuring report plugin org.apache.rat:apache-rat-plugin:0.11
[INFO] configuring report plugin org.owasp:dependency-check-maven:3.0.2
[INFO] configuring report plugin org.codehaus.mojo:versions-maven-plugin:2.5
[INFO] configuring report plugin org.codehaus.mojo:rat-maven-plugin:1.0-alpha-2
[INFO] Rendering site with org.apache.maven.skins:maven-fluido-skin:jar:1.6 skin.
[INFO] Skipped "RAT Report" report (rat-maven-plugin:1.0-alpha-2:rat), file "rat-report.html" already exists for the English version.
[INFO] Generating "About" report                --- maven-project-info-reports-plugin:2.7:index
[INFO] Generating "Plugin Management" report    --- maven-project-info-reports-plugin:2.7:plugin-management
[INFO] Generating "Distribution Management" report --- maven-project-info-reports-plugin:2.7:distribution-management
[INFO] Generating "Dependency Information" report --- maven-project-info-reports-plugin:2.7:dependency-info
[INFO] Generating "Source Repository" report    --- maven-project-info-reports-plugin:2.7:scm
[INFO] Generating "Mailing Lists" report        --- maven-project-info-reports-plugin:2.7:mailing-list
[INFO] Generating "Issue Tracking" report       --- maven-project-info-reports-plugin:2.7:issue-tracking
[INFO] Generating "Continuous Integration" report --- maven-project-info-reports-plugin:2.7:cim
[INFO] Generating "Project Plugins" report      --- maven-project-info-reports-plugin:2.7:plugins
[INFO] Generating "Project License" report      --- maven-project-info-reports-plugin:2.7:license
[INFO] Generating "Dependency Management" report --- maven-project-info-reports-plugin:2.7:dependency-management
[INFO] Generating "Project Team" report         --- maven-project-info-reports-plugin:2.7:project-team
[INFO] Generating "Project Summary" report      --- maven-project-info-reports-plugin:2.7:summary
[INFO] Generating "Dependencies" report         --- maven-project-info-reports-plugin:2.7:dependencies
[WARNING] Unable to process class META-INF/versions/9/org/apache/logging/log4j/util/StackLocator.class in JarAnalyzer File /home/jenkins/.m2/repository/org/apache/logging/log4j/log4j-api/2.9.1/log4j-api-2.9.1.jar
org.apache.bcel.classfile.ClassFormatException: Invalid byte tag in constant pool: 18
    at org.apache.bcel.classfile.Constant.readConstant (Constant.java:146)
    at org.apache.bcel.classfile.ConstantPool.<init> (ConstantPool.java:67)
    at org.apache.bcel.classfile.ClassParser.readConstantPool (ClassParser.java:222)
    at org.apache.bcel.classfile.ClassParser.parse (ClassParser.java:136)
    at org.apache.maven.shared.jar.classes.JarClassesAnalysis.analyze (JarClassesAnalysis.java:92)
    at org.apache.maven.report.projectinfo.dependencies.Dependencies.getJarDependencyDetails (Dependencies.java:255)
    at org.apache.maven.report.projectinfo.dependencies.renderer.DependenciesRenderer.hasSealed (DependenciesRenderer.java:1454)
    at org.apache.maven.report.projectinfo.dependencies.renderer.DependenciesRenderer.renderSectionDependencyFileDetails (DependenciesRenderer.java:536)
    at org.apache.maven.report.projectinfo.dependencies.renderer.DependenciesRenderer.renderBody (DependenciesRenderer.java:263)
    at org.apache.maven.reporting.AbstractMavenReportRenderer.render (AbstractMavenReportRenderer.java:79)
    at org.apache.maven.report.projectinfo.DependenciesReport.executeReport (DependenciesReport.java:186)
    at org.apache.maven.reporting.AbstractMavenReport.generate (AbstractMavenReport.java:190)
    at org.apache.maven.plugins.site.render.ReportDocumentRenderer.renderDocument (ReportDocumentRenderer.java:227)
    at org.apache.maven.doxia.siterenderer.DefaultSiteRenderer.render (DefaultSiteRenderer.java:329)
    at org.apache.maven.plugins.site.render.SiteMojo.renderLocale (SiteMojo.java:181)
    at org.apache.maven.plugins.site.render.SiteMojo.execute (SiteMojo.java:135)
    at org.apache.maven.plugin.DefaultBuildPluginManager.executeMojo (DefaultBuildPluginManager.java:134)
    at org.apache.maven.lifecycle.internal.MojoExecutor.execute (MojoExecutor.java:208)
    at org.apache.maven.lifecycle.internal.MojoExecutor.execute (MojoExecutor.java:154)
    at org.apache.maven.lifecycle.internal.MojoExecutor.execute (MojoExecutor.java:146)
    at org.apache.maven.lifecycle.internal.LifecycleModuleBuilder.buildProject (LifecycleModuleBuilder.java:117)
    at org.apache.maven.lifecycle.internal.LifecycleModuleBuilder.buildProject (LifecycleModuleBuilder.java:81)
    at org.apache.maven.lifecycle.internal.builder.singlethreaded.SingleThreadedBuilder.build (SingleThreadedBuilder.java:51)
    at org.apache.maven.lifecycle.internal.LifecycleStarter.execute (LifecycleStarter.java:128)
    at org.apache.maven.DefaultMaven.doExecute (DefaultMaven.java:309)
    at org.apache.maven.DefaultMaven.doExecute (DefaultMaven.java:194)
    at org.apache.maven.DefaultMaven.execute (DefaultMaven.java:107)
    at org.apache.maven.cli.MavenCli.execute (MavenCli.java:955)
    at org.apache.maven.cli.MavenCli.doMain (MavenCli.java:290)
    at org.apache.maven.cli.MavenCli.main (MavenCli.java:194)
    at sun.reflect.NativeMethodAccessorImpl.invoke0 (Native Method)
    at sun.reflect.NativeMethodAccessorImpl.invoke (NativeMethodAccessorImpl.java:57)
    at sun.reflect.DelegatingMethodAccessorImpl.invoke (DelegatingMethodAccessorImpl.java:43)
    at java.lang.reflect.Method.invoke (Method.java:606)
    at org.codehaus.plexus.classworlds.launcher.Launcher.launchEnhanced (Launcher.java:289)
    at org.codehaus.plexus.classworlds.launcher.Launcher.launch (Launcher.java:229)
    at org.codehaus.plexus.classworlds.launcher.Launcher.mainWithExitCode (Launcher.java:415)
    at org.codehaus.plexus.classworlds.launcher.Launcher.main (Launcher.java:356)
[INFO] Generating "JavaDocs" report             --- maven-javadoc-plugin:2.10.3:javadoc
[INFO]
Loading source files for package actions.osgi...
Constructing Javadoc information...
Standard Doclet version 1.7.0_80
Building tree for all the packages and classes...
Generating <https://builds.apache.org/job/Struts-site-javadocs/ws/target/struts-project/bundles/demo/target/site/apidocs/actions/osgi/BundlesAction.html...>
Generating <https://builds.apache.org/job/Struts-site-javadocs/ws/target/struts-project/bundles/demo/target/site/apidocs/actions/osgi/HelloWorldAction.html...>
Generating <https://builds.apache.org/job/Struts-site-javadocs/ws/target/struts-project/bundles/demo/target/site/apidocs/actions/osgi/Message.html...>
Generating <https://builds.apache.org/job/Struts-site-javadocs/ws/target/struts-project/bundles/demo/target/site/apidocs/actions/osgi/package-frame.html...>
Generating <https://builds.apache.org/job/Struts-site-javadocs/ws/target/struts-project/bundles/demo/target/site/apidocs/actions/osgi/package-summary.html...>
Generating <https://builds.apache.org/job/Struts-site-javadocs/ws/target/struts-project/bundles/demo/target/site/apidocs/actions/osgi/package-tree.html...>
Generating <https://builds.apache.org/job/Struts-site-javadocs/ws/target/struts-project/bundles/demo/target/site/apidocs/constant-values.html...>
Generating <https://builds.apache.org/job/Struts-site-javadocs/ws/target/struts-project/bundles/demo/target/site/apidocs/serialized-form.html...>
Generating <https://builds.apache.org/job/Struts-site-javadocs/ws/target/struts-project/bundles/demo/target/site/apidocs/actions/osgi/class-use/HelloWorldAction.html...>
Generating <https://builds.apache.org/job/Struts-site-javadocs/ws/target/struts-project/bundles/demo/target/site/apidocs/actions/osgi/class-use/BundlesAction.html...>
Generating <https://builds.apache.org/job/Struts-site-javadocs/ws/target/struts-project/bundles/demo/target/site/apidocs/actions/osgi/class-use/Message.html...>
Generating <https://builds.apache.org/job/Struts-site-javadocs/ws/target/struts-project/bundles/demo/target/site/apidocs/actions/osgi/package-use.html...>
Building index for all the packages and classes...
Generating <https://builds.apache.org/job/Struts-site-javadocs/ws/target/struts-project/bundles/demo/target/site/apidocs/overview-tree.html...>
Generating <https://builds.apache.org/job/Struts-site-javadocs/ws/target/struts-project/bundles/demo/target/site/apidocs/index-all.html...>
Generating <https://builds.apache.org/job/Struts-site-javadocs/ws/target/struts-project/bundles/demo/target/site/apidocs/deprecated-list.html...>
Building index for all classes...
Generating <https://builds.apache.org/job/Struts-site-javadocs/ws/target/struts-project/bundles/demo/target/site/apidocs/allclasses-frame.html...>
Generating <https://builds.apache.org/job/Struts-site-javadocs/ws/target/struts-project/bundles/demo/target/site/apidocs/allclasses-noframe.html...>
Generating <https://builds.apache.org/job/Struts-site-javadocs/ws/target/struts-project/bundles/demo/target/site/apidocs/index.html...>
Generating <https://builds.apache.org/job/Struts-site-javadocs/ws/target/struts-project/bundles/demo/target/site/apidocs/help-doc.html...>
[INFO] Generating "Rat Report" report           --- apache-rat-plugin:0.11:rat
[INFO] 51 implicit excludes (use -debug for more details).
[INFO] Exclude: src/main/resources/org/apache/struts2/static/domTT.js
[INFO] Exclude: src/site/resources/tags/**/*.html
[INFO] Exclude: src/main/resources/*LICENSE.txt
[INFO] Exclude: src/test/resources/**/*.txt
[INFO] Exclude: src/main/webapp/**/*.css
[INFO] Exclude: src/main/webapp/**/*.map
[INFO] Exclude: src/main/webapp/**/*.js
[INFO] Exclude: src/main/webapp/**/*.svg
[INFO] Exclude: src/main/webapp/**/*.txt
[INFO] Exclude: src/main/resources/**/sitegraph-usage.txt
[INFO] Exclude: src/main/resources/**/docs-urls.txt
[INFO] Exclude: src/etc/header.txt
[INFO] Exclude: src/main/resources/static/css/**/*.css
[INFO] Exclude: src/main/resources/static/js/**/*.js
[INFO] Exclude: src/main/resources/docs.cfg
[INFO] Exclude: src/main/webapp/fonts/**/*
[INFO] 11 resources included (use -debug for more details)
[INFO] Generating "Dependency Check" report     --- dependency-check-maven:3.0.2:aggregate
[INFO] Checking for updates
[INFO] Skipping NVD check since last check was within 4 hours.
[INFO] Check for updates complete (17 ms)
[INFO] Analysis Started
[INFO] Finished Archive Analyzer (0 seconds)
[INFO] Finished File Name Analyzer (0 seconds)
[INFO] Finished Jar Analyzer (0 seconds)
[INFO] Finished Central Analyzer (0 seconds)
[INFO] Finished Dependency Merging Analyzer (0 seconds)
[INFO] Finished Version Filter Analyzer (0 seconds)
[INFO] Finished Hint Analyzer (0 seconds)
[INFO] Created CPE Index (0 seconds)
[INFO] Finished CPE Analyzer (1 seconds)
[INFO] Finished False Positive Analyzer (0 seconds)
[INFO] Finished Cpe Suppression Analyzer (0 seconds)
[INFO] Finished NVD CVE Analyzer (0 seconds)
[INFO] Finished Vulnerability Suppression Analyzer (0 seconds)
[INFO] Finished Dependency Bundling Analyzer (0 seconds)
[INFO] Analysis Complete (2 seconds)
[WARNING]

One or more dependencies were identified with known vulnerabilities in Struts 2 OSGi Demo Bundle:

struts-core-1.3.8.jar (org.apache.struts:struts-core:1.3.8, cpe:/a:apache:struts:1.3.8) : CVE-2016-1181, CVE-2016-1182, CVE-2014-0114, CVE-2015-0899
struts-tiles-1.3.8.jar (cpe:/a:apache:tiles:1.3.8, org.apache.struts:struts-tiles:1.3.8, cpe:/a:apache:struts:1.3.8) : CVE-2016-1181, CVE-2016-1182, CVE-2014-0114, CVE-2015-0899


See the dependency-check report for more details.


[INFO] Generating "Dependency Updates Report" report --- versions-maven-plugin:2.5:dependency-updates-report
[INFO] Generating "Plugin Updates Report" report --- versions-maven-plugin:2.5:plugin-updates-report
[INFO] Generating "Property Updates Report" report --- versions-maven-plugin:2.5:property-updates-report
[INFO]
[INFO] --- maven-site-plugin:3.5.1:stage (default-cli) @ struts2-osgi-demo-bundle ---
[INFO] Using this base directory for staging: <https://builds.apache.org/job/Struts-site-javadocs/ws/target/struts-project/target/staging>
file://<https://builds.apache.org/job/Struts-site-javadocs/ws/target/struts-project/target/staging/> - Session: Opened  
[INFO] Pushing <https://builds.apache.org/job/Struts-site-javadocs/ws/target/struts-project/bundles/demo/target/site>
[INFO]    >>> to file://<https://builds.apache.org/job/Struts-site-javadocs/ws/target/struts-project/target/staging/struts2-parent/struts2-osgi-bundles/struts2-osgi-demo-bundle>
file://<https://builds.apache.org/job/Struts-site-javadocs/ws/target/struts-project/target/staging/> - Session: Disconnecting  
file://<https://builds.apache.org/job/Struts-site-javadocs/ws/target/struts-project/target/staging/> - Session: Disconnected
[INFO]
[INFO] ------------------------------------------------------------------------
[INFO] Building Struts 2 Assembly 2.5.14.1
[INFO] ------------------------------------------------------------------------
[INFO]
[INFO] --- maven-clean-plugin:3.0.0:clean (default-clean) @ struts2-assembly ---
[INFO]
[INFO] --- maven-site-plugin:3.5.1:site (default-cli) @ struts2-assembly ---
[INFO] maven.site.skip = true: Skipping site generation
[INFO]
[INFO] --- maven-site-plugin:3.5.1:stage (default-cli) @ struts2-assembly ---
[INFO] maven.site.skip = true: Skipping site staging
[INFO] ------------------------------------------------------------------------
[INFO] Reactor Summary:
[INFO]
[INFO] Struts 2 Bill of Materials ......................... SUCCESS [  1.766 s]
[INFO] Struts 2 ........................................... SUCCESS [23:50 min]
[INFO] Struts 2 Core ...................................... SUCCESS [ 27.962 s]
[INFO] Struts Plugins ..................................... SUCCESS [ 13.932 s]
[INFO] Struts 2 Configuration Browser Plugin .............. SUCCESS [  9.120 s]
[INFO] Struts 2 Sitemesh Plugin ........................... SUCCESS [  9.857 s]
[INFO] Struts 2 Tiles Plugin .............................. SUCCESS [  9.898 s]
[INFO] Struts 2 DWR Plugin ................................ SUCCESS [  8.144 s]
[INFO] Struts 2 Spring Plugin ............................. SUCCESS [  9.789 s]
[INFO] Struts 2 Convention Plugin ......................... SUCCESS [ 16.239 s]
[INFO] Struts 2 JUnit Plugin .............................. SUCCESS [  9.355 s]
[INFO] Struts 2 JSON Plugin ............................... SUCCESS [ 10.765 s]
[INFO] Struts 2 Bean Validation Plugin .................... SUCCESS [  9.064 s]
[INFO] Struts 2 Webapps ................................... SUCCESS [  0.012 s]
[INFO] Struts 2 Showcase Webapp ........................... SUCCESS [  0.030 s]
[INFO] Struts 2 REST Plugin ............................... SUCCESS [ 10.408 s]
[INFO] Struts 2 Rest Showcase Webapp ...................... SUCCESS [  0.026 s]
[INFO] Struts 2 CDI Plugin ................................ SUCCESS [  9.837 s]
[INFO] Struts 2 Embedded JSP Plugin ....................... SUCCESS [ 14.623 s]
[INFO] Struts 2 GXP Plugin ................................ SUCCESS [  8.932 s]
[INFO] Struts 2 Jasper Reports Plugin ..................... SUCCESS [ 10.550 s]
[INFO] Struts 2 Java Templates Plugin ..................... SUCCESS [  9.197 s]
[INFO] Struts 2 JFreeChart Plugin ......................... SUCCESS [  9.043 s]
[INFO] Struts 2 OSGi Plugin ............................... SUCCESS [ 10.419 s]
[INFO] Struts 2 OVal Plugin ............................... SUCCESS [  9.508 s]
[INFO] Struts 2 Pell Multipart Plugin ..................... SUCCESS [  7.672 s]
[INFO] Struts 2 Plexus Plugin ............................. SUCCESS [  8.211 s]
[INFO] Struts 2 Portlet Plugin ............................ SUCCESS [ 12.616 s]
[INFO] Struts 2 Portlet Tiles Plugin ...................... SUCCESS [  8.774 s]
[INFO] DEPRECATED: Struts 2 Sitegraph Plugin .............. SUCCESS [ 11.364 s]
[INFO] Struts 2 TestNG Plugin ............................. SUCCESS [  8.259 s]
[INFO] Struts OSGi Bundles ................................ SUCCESS [  6.807 s]
[INFO] Struts 2 OSGi Admin Bundle ......................... SUCCESS [  9.738 s]
[INFO] Struts 2 OSGi Demo Bundle .......................... SUCCESS [ 10.384 s]
[INFO] Struts 2 Assembly .................................. SUCCESS [  0.023 s]
[INFO] ------------------------------------------------------------------------
[INFO] BUILD SUCCESS
[INFO] ------------------------------------------------------------------------
[INFO] Total time: 29:04 min
[INFO] Finished at: 2017-12-05T12:19:31Z
[INFO] Final Memory: 85M/1146M
[INFO] ------------------------------------------------------------------------
+ cd ../..
Setting MAVEN_3_LATEST__HOME=/home/jenkins/tools/maven/latest3/
[Struts-site-javadocs] $ /bin/bash -xe /tmp/jenkins6873825977113808579.sh
+ git checkout asf-site
Previous HEAD position was 5afa5db... Merge pull request #54 from paulvi/patch-2
Switched to a new branch 'asf-site'
Branch asf-site set up to track remote branch asf-site from origin.
+ git pull origin asf-site
From https://gitbox.apache.org/repos/asf/struts-site
 * branch            asf-site   -> FETCH_HEAD
Already up-to-date.
+ cp -r target/struts-project/staging content/maven
cp: cannot stat 'target/struts-project/staging': No such file or directory
Build step 'Execute shell' marked build as failure
Setting MAVEN_3_LATEST__HOME=/home/jenkins/tools/maven/latest3/

---------------------------------------------------------------------
To unsubscribe, e-mail: [hidden email]
For additional commands, e-mail: [hidden email]