Build failed in Jenkins: Struts-site-javadocs #1

classic Classic list List threaded Threaded
6 messages Options
Reply | Threaded
Open this post in threaded view
|

Build failed in Jenkins: Struts-site-javadocs #1

Apache Jenkins Server-2
See <https://builds.apache.org/job/Struts-site-javadocs/1/display/redirect>

------------------------------------------
Started by user Lukasz Lenart
[EnvInject] - Loading node environment variables.
Building remotely on H20 (git-websites) in workspace <https://builds.apache.org/job/Struts-site-javadocs/ws/>
Cloning the remote Git repository
Cloning repository https://gitbox.apache.org/repos/asf/struts-site.git
 > git init <https://builds.apache.org/job/Struts-site-javadocs/ws/> # timeout=10
Fetching upstream changes from https://gitbox.apache.org/repos/asf/struts-site.git
 > git --version # timeout=10
 > git fetch --tags --progress https://gitbox.apache.org/repos/asf/struts-site.git +refs/heads/*:refs/remotes/origin/*
 > git config remote.origin.url https://gitbox.apache.org/repos/asf/struts-site.git # timeout=10
 > git config --add remote.origin.fetch +refs/heads/*:refs/remotes/origin/* # timeout=10
 > git config remote.origin.url https://gitbox.apache.org/repos/asf/struts-site.git # timeout=10
Cleaning workspace
 > git rev-parse --verify HEAD # timeout=10
No valid HEAD. Skipping the resetting
 > git clean -fdx # timeout=10
Fetching upstream changes from https://gitbox.apache.org/repos/asf/struts-site.git
 > git fetch --tags --progress https://gitbox.apache.org/repos/asf/struts-site.git +refs/heads/*:refs/remotes/origin/*
 > git rev-parse refs/remotes/origin/master^{commit} # timeout=10
 > git rev-parse refs/remotes/origin/origin/master^{commit} # timeout=10
Checking out Revision 30ca5bb0a3bfff39cf5462dc64e8449b4a757ad1 (refs/remotes/origin/master)
 > git config core.sparsecheckout # timeout=10
 > git checkout -f 30ca5bb0a3bfff39cf5462dc64e8449b4a757ad1
Commit message: "Merge pull request #41 from fanofxiaofeng/patch-8"
First time build. Skipping changelog.
Setting MAVEN_3_LATEST__HOME=/home/jenkins/tools/maven/latest3/
[Struts-site-javadocs] $ /bin/bash -xe /tmp/jenkins2084611171761134847.sh
+ mkdir -p target/content
+ export RUBY_PATH=/home/jenkins/shared/.rvm
+ RUBY_PATH=/home/jenkins/shared/.rvm
+ export GEM_HOME=/home/jenkins/shared/.rvm/gems
+ GEM_HOME=/home/jenkins/shared/.rvm/gems
+ curl -sSL https://get.rvm.io
+ bash -s -- --path /home/jenkins/shared/.rvm
Downloading https://github.com/rvm/rvm/archive/master.tar.gz
Upgrading the RVM installation in /home/jenkins/shared/.rvm/
    RVM PATH line found in /home/jenkins/.mkshrc /home/jenkins/.profile /home/jenkins/.bashrc /home/jenkins/.zshrc.
    RVM sourcing line found in /home/jenkins/.profile /home/jenkins/.bash_profile /home/jenkins/.zlogin.
cat: /home/jenkins/shared/.rvm/config/alias: No such file or directory
Upgrade of RVM in /home/jenkins/shared/.rvm/ is complete.

Upgrade Notes:

  * It looks like some old stuff is laying around RVM, you can cleanup with: rvm cleanup all

  * No new notes to display.

+ mkdir -p /home/jenkins/shared/.rvm/gems/gems
+ gem install --install-dir /home/jenkins/shared/.rvm/gems bundler
Successfully installed bundler-1.16.0
1 gem installed
+ export PATH=/home/jenkins/shared/.rvm/gems/bin:/home/jenkins/tools/java/latest1.7/bin:/usr/local/sbin:/usr/local/bin:/usr/sbin:/usr/bin:/sbin:/bin:/usr/games:/usr/local/games
+ PATH=/home/jenkins/shared/.rvm/gems/bin:/home/jenkins/tools/java/latest1.7/bin:/usr/local/sbin:/usr/local/bin:/usr/sbin:/usr/bin:/sbin:/bin:/usr/games:/usr/local/games
+ bundle install --path /home/jenkins/shared/.rvm/gems
Using bundler 1.16.0
Using colorator 0.1
Using ffi 1.9.10
Using sass 3.4.21
Using jekyll-sass-converter 1.4.0
Using rb-fsevent 0.9.7
Using rb-inotify 0.9.7
Using listen 3.0.6
Using jekyll-watch 1.3.1
Using kramdown 1.10.0
Using liquid 3.0.6
Using mercenary 0.3.5
Using rouge 1.10.1
Using safe_yaml 1.0.4
Using jekyll 3.1.2
Using json 2.1.0
Bundle complete! 2 Gemfile dependencies, 16 gems now installed.
Bundled gems are installed into `/home/jenkins/shared/.rvm/gems`
+ bundle
Using bundler 1.16.0
Using colorator 0.1
Using ffi 1.9.10
Using sass 3.4.21
Using jekyll-sass-converter 1.4.0
Using rb-fsevent 0.9.7
Using rb-inotify 0.9.7
Using listen 3.0.6
Using jekyll-watch 1.3.1
Using kramdown 1.10.0
Using liquid 3.0.6
Using mercenary 0.3.5
Using rouge 1.10.1
Using safe_yaml 1.0.4
Using jekyll 3.1.2
Using json 2.1.0
Bundle complete! 2 Gemfile dependencies, 16 gems now installed.
Bundled gems are installed into `/home/jenkins/shared/.rvm/gems`
+ bundle exec jekyll build
Configuration file: <https://builds.apache.org/job/Struts-site-javadocs/ws/_config.yml>
            Source: source
       Destination: target/content
 Incremental build: disabled. Enable with --incremental
      Generating...
START SNIPPET: javadoc not found in https://gitbox.apache.org/repos/asf?p=struts.git;a=blob_plain;f=core/src/main/java/org/apache/struts2/components/DateTextField.java;hb=HEAD
START SNIPPET: example not found in https://gitbox.apache.org/repos/asf?p=struts.git;a=blob_plain;f=core/src/main/java/org/apache/struts2/components/DateTextField.java;hb=HEAD
Fetching content of url: https://raw.githubusercontent.com/apache/struts/support-2-3/plugins/dojo/src/main/resources/template/ajax/head.ftl 
Fetching content of url: https://raw.githubusercontent.com/apache/struts/support-2-3/apps/showcase/src/main/webapp/WEB-INF/ajax/commonInclude.jsp 
Fetching content of url: https://raw.githubusercontent.com/apache/struts/master/core/src/main/resources/template/simple/text.ftl 
Fetching content of url: https://raw.githubusercontent.com/apache/struts/master/core/src/main/resources/template/css_xhtml/controlheader.ftl 
Fetching content of url: https://raw.githubusercontent.com/apache/struts/master/core/src/main/resources/template/css_xhtml/controlfooter.ftl 
Fetching content of url: https://raw.githubusercontent.com/apache/struts/master/core/src/main/resources/template/css_xhtml/head.ftl 
Fetching content of url: https://raw.githubusercontent.com/apache/struts/master/core/src/main/resources/template/css_xhtml/styles.css 
START SNIPPET: javadoc not found in https://gitbox.apache.org/repos/asf?p=struts.git;a=blob_plain;f=core/src/main/java/org/apache/struts2/components/DateTextField.java;hb=HEAD
START SNIPPET: example not found in https://gitbox.apache.org/repos/asf?p=struts.git;a=blob_plain;f=core/src/main/java/org/apache/struts2/components/DateTextField.java;hb=HEAD
Fetching content of url: https://raw.githubusercontent.com/apache/struts/master/core/src/main/resources/org/apache/struts2/default.properties 
Fetching content of url: https://raw.githubusercontent.com/apache/struts/master/core/src/main/resources/struts-default.xml 
Fetching content of url: https://raw.githubusercontent.com/apache/struts/master/core/src/main/resources/template/simple/head.ftl 
Fetching content of url: https://raw.githubusercontent.com/apache/struts/master/core/src/main/resources/struts-default.xml 
Fetching content of url: https://raw.githubusercontent.com/apache/struts/master/core/src/main/resources/com/opensymphony/xwork2/validator/validators/default.xml 
Fetching content of url: https://raw.githubusercontent.com/apache/struts/master/core/src/main/resources/template/xhtml/text.ftl 
Fetching content of url: https://raw.githubusercontent.com/apache/struts/master/core/src/main/resources/template/xhtml/controlheader.ftl 
Fetching content of url: https://raw.githubusercontent.com/apache/struts/master/core/src/main/resources/template/xhtml/controlheader-core.ftl 
Fetching content of url: https://raw.githubusercontent.com/apache/struts/master/core/src/main/resources/template/xhtml/controlfooter.ftl 
Fetching content of url: https://raw.githubusercontent.com/apache/struts/master/core/src/main/resources/template/xhtml/head.ftl 
Fetching content of url: https://raw.githubusercontent.com/apache/struts/master/core/src/main/resources/template/xhtml/styles.css 
Fetching content of url: https://raw.githubusercontent.com/apache/struts/master/core/src/main/resources/template/xhtml/form.ftl 
Fetching content of url: https://raw.githubusercontent.com/apache/struts/master/core/src/main/resources/template/xhtml/form-close.ftl 
Fetching content of url: https://raw.githubusercontent.com/apache/struts/master/core/src/main/resources/template/xhtml/form.ftl 
Fetching content of url: https://raw.githubusercontent.com/apache/struts/master/core/src/main/resources/template/xhtml/form-close.ftl 
                    done in 10.931 seconds.
 Auto-regeneration: disabled. Use --watch to enable.
Setting MAVEN_3_LATEST__HOME=/home/jenkins/tools/maven/latest3/
[Struts-site-javadocs] $ /bin/bash -xe /tmp/jenkins7455621711677638529.sh
+ cd target
+ git clone https://gitbox.apache.org/repos/asf/struts.git struts-project
Cloning into 'struts-project'...
+ cd struts-project
+ git checkout tag/2.5.14
error: pathspec 'tag/2.5.14' did not match any file(s) known to git.
Build step 'Execute shell' marked build as failure
Setting MAVEN_3_LATEST__HOME=/home/jenkins/tools/maven/latest3/

---------------------------------------------------------------------
To unsubscribe, e-mail: [hidden email]
For additional commands, e-mail: [hidden email]

Reply | Threaded
Open this post in threaded view
|

Build failed in Jenkins: Struts-site-javadocs #2

Apache Jenkins Server-2
See <https://builds.apache.org/job/Struts-site-javadocs/2/display/redirect>

------------------------------------------
Started by user Lukasz Lenart
[EnvInject] - Loading node environment variables.
Building remotely on H20 (git-websites) in workspace <https://builds.apache.org/job/Struts-site-javadocs/ws/>
 > git rev-parse --is-inside-work-tree # timeout=10
Fetching changes from the remote Git repository
 > git config remote.origin.url https://gitbox.apache.org/repos/asf/struts-site.git # timeout=10
Cleaning workspace
 > git rev-parse --verify HEAD # timeout=10
Resetting working tree
 > git reset --hard # timeout=10
 > git clean -fdx # timeout=10
Fetching upstream changes from https://gitbox.apache.org/repos/asf/struts-site.git
 > git --version # timeout=10
 > git fetch --tags --progress https://gitbox.apache.org/repos/asf/struts-site.git +refs/heads/*:refs/remotes/origin/*
 > git rev-parse refs/remotes/origin/master^{commit} # timeout=10
 > git rev-parse refs/remotes/origin/origin/master^{commit} # timeout=10
Checking out Revision 30ca5bb0a3bfff39cf5462dc64e8449b4a757ad1 (refs/remotes/origin/master)
 > git config core.sparsecheckout # timeout=10
 > git checkout -f 30ca5bb0a3bfff39cf5462dc64e8449b4a757ad1
Commit message: "Merge pull request #41 from fanofxiaofeng/patch-8"
 > git rev-list 30ca5bb0a3bfff39cf5462dc64e8449b4a757ad1 # timeout=10
Setting MAVEN_3_LATEST__HOME=/home/jenkins/tools/maven/latest3/
[Struts-site-javadocs] $ /bin/bash -xe /tmp/jenkins8031254998531998817.sh
+ mkdir -p target/content
+ cd target
+ git clone https://gitbox.apache.org/repos/asf/struts.git struts-project
fatal: destination path 'struts-project' already exists and is not an empty directory.
Build step 'Execute shell' marked build as failure
Setting MAVEN_3_LATEST__HOME=/home/jenkins/tools/maven/latest3/

---------------------------------------------------------------------
To unsubscribe, e-mail: [hidden email]
For additional commands, e-mail: [hidden email]

Reply | Threaded
Open this post in threaded view
|

Build failed in Jenkins: Struts-site-javadocs #3

Apache Jenkins Server-2
See <https://builds.apache.org/job/Struts-site-javadocs/3/display/redirect>

------------------------------------------
Started by user Lukasz Lenart
[EnvInject] - Loading node environment variables.
Building remotely on H20 (git-websites) in workspace <https://builds.apache.org/job/Struts-site-javadocs/ws/>
[WS-CLEANUP] Deleting project workspace...
[WS-CLEANUP] Done
Cloning the remote Git repository
Cloning repository https://gitbox.apache.org/repos/asf/struts-site.git
 > git init <https://builds.apache.org/job/Struts-site-javadocs/ws/> # timeout=10
Fetching upstream changes from https://gitbox.apache.org/repos/asf/struts-site.git
 > git --version # timeout=10
 > git fetch --tags --progress https://gitbox.apache.org/repos/asf/struts-site.git +refs/heads/*:refs/remotes/origin/*
 > git config remote.origin.url https://gitbox.apache.org/repos/asf/struts-site.git # timeout=10
 > git config --add remote.origin.fetch +refs/heads/*:refs/remotes/origin/* # timeout=10
 > git config remote.origin.url https://gitbox.apache.org/repos/asf/struts-site.git # timeout=10
Cleaning workspace
 > git rev-parse --verify HEAD # timeout=10
No valid HEAD. Skipping the resetting
 > git clean -fdx # timeout=10
Fetching upstream changes from https://gitbox.apache.org/repos/asf/struts-site.git
 > git fetch --tags --progress https://gitbox.apache.org/repos/asf/struts-site.git +refs/heads/*:refs/remotes/origin/*
 > git rev-parse refs/remotes/origin/master^{commit} # timeout=10
 > git rev-parse refs/remotes/origin/origin/master^{commit} # timeout=10
Checking out Revision 30ca5bb0a3bfff39cf5462dc64e8449b4a757ad1 (refs/remotes/origin/master)
 > git config core.sparsecheckout # timeout=10
 > git checkout -f 30ca5bb0a3bfff39cf5462dc64e8449b4a757ad1
Commit message: "Merge pull request #41 from fanofxiaofeng/patch-8"
 > git rev-list 30ca5bb0a3bfff39cf5462dc64e8449b4a757ad1 # timeout=10
Setting MAVEN_3_LATEST__HOME=/home/jenkins/tools/maven/latest3/
[Struts-site-javadocs] $ /bin/bash -xe /tmp/jenkins3194323219292185679.sh
+ mkdir -p target/content
+ cd target
+ git clone https://gitbox.apache.org/repos/asf/struts.git struts-project
Cloning into 'struts-project'...
+ cd struts-project
+ git checkout tag/STRUTS_2_5_14
error: pathspec 'tag/STRUTS_2_5_14' did not match any file(s) known to git.
Build step 'Execute shell' marked build as failure
Setting MAVEN_3_LATEST__HOME=/home/jenkins/tools/maven/latest3/

---------------------------------------------------------------------
To unsubscribe, e-mail: [hidden email]
For additional commands, e-mail: [hidden email]

Reply | Threaded
Open this post in threaded view
|

Build failed in Jenkins: Struts-site-javadocs #4

Apache Jenkins Server-2
See <https://builds.apache.org/job/Struts-site-javadocs/4/display/redirect>

------------------------------------------
[...truncated 1.50 MB...]
        at java.lang.Thread.runat org.owasp.dependencycheck.analyzer.AbstractAnalyzer.analyze java.lang.Thread.run (Thread.java:745) (Thread.java:745)

Caused by: java.io.IOException (AnalysisTask.java:88):
    [WARNING] An error occurred while analyzing '/home/jenkins/.m2/repository/org/testng/testng/6.9.10/testng-6.9.10.jar' (Central Analyzer).
Could not connect to MavenCentral (400): Bad Request
 (AbstractAnalyzer.java:137)
        atat org.owasp.dependencycheck.AnalysisTask.call org.owasp.dependencycheck.AnalysisTask.callat org.owasp.dependencycheck.data.central.CentralSearch.searchSha1 (AnalysisTask.java:88) (AnalysisTask.java:37)
 (CentralSearch.java:181)
   
at     java.util.concurrent.FutureTask.run    atat org.owasp.dependencycheck.analyzer.CentralAnalyzer.fetchMavenArtifacts org.owasp.dependencycheck.AnalysisTask.call (FutureTask.java:262) (CentralAnalyzer.java:266)
     (AnalysisTask.java:37)at
   
    atat java.util.concurrent.FutureTask.run org.owasp.dependencycheck.analyzer.CentralAnalyzer.analyzeDependency java.util.concurrent.ThreadPoolExecutor.runWorker (FutureTask.java:262)
     (CentralAnalyzer.java:198) (ThreadPoolExecutor.java:1145)
   
at     org.owasp.dependencycheck.analyzer.AbstractAnalyzer.analyzeatat java.util.concurrent.ThreadPoolExecutor.runWorker java.util.concurrent.ThreadPoolExecutor$Worker.run (AbstractAnalyzer.java:137) (ThreadPoolExecutor.java:1145)
   
at     org.owasp.dependencycheck.AnalysisTask.call (ThreadPoolExecutor.java:615)at
 (AnalysisTask.java:88)    
at java.lang.Thread.run     java.util.concurrent.ThreadPoolExecutor$Worker.runat (Thread.java:745) org.owasp.dependencycheck.AnalysisTask.call (ThreadPoolExecutor.java:615)

     (AnalysisTask.java:37)at
    [WARNING] An error occurred while analyzing '/home/jenkins/.m2/repository/xpp3/xpp3_min/1.1.4c/xpp3_min-1.1.4c.jar' (Central Analyzer).
 java.lang.Thread.runat java.util.concurrent.FutureTask.run (Thread.java:745)
 (FutureTask.java:262)
    at java.util.concurrent.ThreadPoolExecutor.runWorker[WARNING] An error occurred while analyzing '/home/jenkins/.m2/repository/sslext/sslext/1.2-0/sslext-1.2-0.jar' (Central Analyzer).
 (ThreadPoolExecutor.java:1145)
    at java.util.concurrent.ThreadPoolExecutor$Worker.run (ThreadPoolExecutor.java:615)
    at java.lang.Thread.run (Thread.java:745)
[WARNING] An error occurred while analyzing '/home/jenkins/.m2/repository/tomcat/jasper-runtime/5.5.12/jasper-runtime-5.5.12.jar' (Central Analyzer).
[INFO] Finished Central Analyzer (98 seconds)
[INFO] Finished Dependency Merging Analyzer (0 seconds)
[INFO] Finished Version Filter Analyzer (0 seconds)
[INFO] Finished Hint Analyzer (0 seconds)
[INFO] Created CPE Index (2 seconds)
[INFO] Finished CPE Analyzer (3 seconds)
[INFO] Finished False Positive Analyzer (0 seconds)
[INFO] Finished Cpe Suppression Analyzer (0 seconds)
[INFO] Finished NVD CVE Analyzer (0 seconds)
[INFO] Finished Vulnerability Suppression Analyzer (0 seconds)
[INFO] Finished Dependency Bundling Analyzer (0 seconds)
[INFO] Analysis Complete (105 seconds)
[WARNING]

One or more dependencies were identified with known vulnerabilities in Struts 2:

org.mortbay.jetty-5.1.4.jar (cpe:/a:jetty:jetty:5.1.4, cpe:/a:jetty:jetty_http_server:5.1.4, jetty:org.mortbay.jetty:5.1.4, cpe:/a:mortbay_jetty:jetty:5.1.4) : CVE-2007-5615
struts-annotations-1.0.6.jar (org.apache.struts:struts-annotations:1.0.6, cpe:/a:apache:struts:1.0.6) : CVE-2006-1548, CVE-2006-1547, CVE-2006-1546
struts-core-1.3.8.jar (org.apache.struts:struts-core:1.3.8, cpe:/a:apache:struts:1.3.8) : CVE-2016-1182, CVE-2016-1181, CVE-2015-0899, CVE-2014-0114
struts-tiles-1.3.8.jar (cpe:/a:apache:tiles:1.3.8, cpe:/a:apache:struts:1.3.8, org.apache.struts:struts-tiles:1.3.8) : CVE-2016-1182, CVE-2016-1181, CVE-2015-0899, CVE-2014-0114
juli-6.0.18.jar (cpe:/a:apache_tomcat:apache_tomcat:6.0.18, cpe:/a:apache:tomcat:6.0.18, cpe:/a:apache_software_foundation:tomcat:6.0.18, org.apache.tomcat:juli:6.0.18) : CVE-2017-6056, CVE-2017-5647, CVE-2016-8735, CVE-2016-6816, CVE-2016-6797, CVE-2016-6796, CVE-2016-6794, CVE-2016-6325, CVE-2016-5425, CVE-2016-5388, CVE-2016-5018, CVE-2016-0762, CVE-2016-0714, CVE-2016-0706, CVE-2015-5345, CVE-2015-5174, CVE-2014-7810, CVE-2014-0230, CVE-2014-0227, CVE-2014-0119, CVE-2014-0099, CVE-2014-0096, CVE-2014-0075, CVE-2013-4590, CVE-2013-4444, CVE-2013-4322, CVE-2013-4286, CVE-2013-2185, CVE-2012-5887, CVE-2012-5886, CVE-2012-5885, CVE-2012-5568, CVE-2012-4534, CVE-2012-4431, CVE-2012-3546, CVE-2012-3544, CVE-2012-2733, CVE-2012-0022, CVE-2011-5064, CVE-2011-5063, CVE-2011-5062, CVE-2011-4858, CVE-2011-3190, CVE-2011-2526, CVE-2011-2204, CVE-2011-1184, CVE-2011-0534, CVE-2011-0013, CVE-2010-4312, CVE-2010-4172, CVE-2010-3718, CVE-2010-2227, CVE-2010-1157, CVE-2009-3548, CVE-2009-2902, CVE-2009-2901, CVE-2009-2693, CVE-2009-0783, CVE-2008-5515
bsh-2.0b4.jar (cpe:/a:beanshell_project:beanshell:2.0.b4, org.beanshell:bsh:2.0b4) : CVE-2016-2510
spring-core-4.1.9.RELEASE.jar (cpe:/a:springsource:spring_framework:4.1.9, cpe:/a:pivotal:spring_framework:4.1.9, cpe:/a:vmware:springsource_spring_framework:4.1.9, cpe:/a:pivotal_software:spring_framework:4.1.9, org.springframework:spring-core:4.1.9.RELEASE) : CVE-2016-5007
dwr-1.1.1.jar (uk.ltd.getahead:dwr:1.1.1, cpe:/a:getahead:direct_web_remoting:1.1.1) : CVE-2007-0185, CVE-2007-0184, CVE-2006-6916


See the dependency-check report for more details.


[INFO] ------------------------------------------------------------------------
[INFO] Reactor Summary:
[INFO]
[INFO] Struts 2 Bill of Materials ......................... SUCCESS [  1.234 s]
[INFO] Struts 2 ........................................... FAILURE [08:17 min]
[INFO] Struts 2 Core ...................................... SKIPPED
[INFO] Struts Plugins ..................................... SKIPPED
[INFO] Struts 2 Configuration Browser Plugin .............. SKIPPED
[INFO] Struts 2 Sitemesh Plugin ........................... SKIPPED
[INFO] Struts 2 Tiles Plugin .............................. SKIPPED
[INFO] Struts 2 DWR Plugin ................................ SKIPPED
[INFO] Struts 2 Spring Plugin ............................. SKIPPED
[INFO] Struts 2 Convention Plugin ......................... SKIPPED
[INFO] Struts 2 JUnit Plugin .............................. SKIPPED
[INFO] Struts 2 JSON Plugin ............................... SKIPPED
[INFO] Struts 2 Bean Validation Plugin .................... SKIPPED
[INFO] Struts 2 Webapps ................................... SKIPPED
[INFO] Struts 2 Showcase Webapp ........................... SKIPPED
[INFO] Struts 2 REST Plugin ............................... SKIPPED
[INFO] Struts 2 Rest Showcase Webapp ...................... SKIPPED
[INFO] Struts 2 CDI Plugin ................................ SKIPPED
[INFO] Struts 2 Embedded JSP Plugin ....................... SKIPPED
[INFO] Struts 2 GXP Plugin ................................ SKIPPED
[INFO] Struts 2 Jasper Reports Plugin ..................... SKIPPED
[INFO] Struts 2 Java Templates Plugin ..................... SKIPPED
[INFO] Struts 2 JFreeChart Plugin ......................... SKIPPED
[INFO] Struts 2 OSGi Plugin ............................... SKIPPED
[INFO] Struts 2 OVal Plugin ............................... SKIPPED
[INFO] Struts 2 Pell Multipart Plugin ..................... SKIPPED
[INFO] Struts 2 Plexus Plugin ............................. SKIPPED
[INFO] Struts 2 Portlet Plugin ............................ SKIPPED
[INFO] Struts 2 Portlet Tiles Plugin ...................... SKIPPED
[INFO] DEPRECATED: Struts 2 Sitegraph Plugin .............. SKIPPED
[INFO] Struts 2 TestNG Plugin ............................. SKIPPED
[INFO] Struts OSGi Bundles ................................ SKIPPED
[INFO] Struts 2 OSGi Admin Bundle ......................... SKIPPED
[INFO] Struts 2 OSGi Demo Bundle .......................... SKIPPED
[INFO] Struts 2 Assembly .................................. SKIPPED
[INFO] ------------------------------------------------------------------------
[INFO] BUILD FAILURE
[INFO] ------------------------------------------------------------------------
[INFO] Total time: 08:22 min
[INFO] Finished at: 2017-11-28T07:59:38Z
[INFO] Final Memory: 75M/5789M
[INFO] ------------------------------------------------------------------------
[ERROR] Failed to execute goal org.apache.maven.plugins:maven-site-plugin:3.5.1:site (default-cli) on project struts2-parent: Error generating dependency-check-maven:3.0.1:aggregate: One or more exceptions occurred during dependency-check analysis: One or more exceptions occurred during dependency-check analysis
[ERROR] Could not connect to Central search. Analysis failed.
[ERROR] Could not connect to Central search. Analysis failed.
[ERROR] Could not connect to Central search. Analysis failed.
[ERROR] Could not connect to Central search. Analysis failed.
[ERROR] Could not connect to Central search. Analysis failed.
[ERROR] Could not connect to Central search. Analysis failed.
[ERROR] Could not connect to Central search. Analysis failed.
[ERROR] Could not connect to Central search. Analysis failed.
[ERROR] Could not connect to Central search. Analysis failed.
[ERROR] Could not connect to Central search. Analysis failed.
[ERROR] Could not connect to Central search. Analysis failed.
[ERROR] Could not connect to Central search. Analysis failed.
[ERROR] Could not connect to Central search. Analysis failed.
[ERROR] Could not connect to Central search. Analysis failed.
[ERROR] Could not connect to Central search. Analysis failed.
[ERROR] Could not connect to Central search. Analysis failed.
[ERROR] Could not connect to Central search. Analysis failed.
[ERROR] Could not connect to Central search. Analysis failed.
[ERROR] Could not connect to Central search. Analysis failed.
[ERROR] Could not connect to Central search. Analysis failed.
[ERROR] Could not connect to Central search. Analysis failed.
[ERROR] Could not connect to Central search. Analysis failed.
[ERROR] Could not connect to Central search. Analysis failed.
[ERROR] Could not connect to Central search. Analysis failed.
[ERROR] Could not connect to Central search. Analysis failed.
[ERROR] Could not connect to Central search. Analysis failed.
[ERROR] Could not connect to Central search. Analysis failed.
[ERROR] Could not connect to Central search. Analysis failed.
[ERROR] Could not connect to Central search. Analysis failed.
[ERROR] Could not connect to Central search. Analysis failed.
[ERROR] Could not connect to Central search. Analysis failed.
[ERROR] Could not connect to Central search. Analysis failed.
[ERROR] Could not connect to Central search. Analysis failed.
[ERROR] Could not connect to Central search. Analysis failed.
[ERROR] Could not connect to Central search. Analysis failed.
[ERROR] Could not connect to Central search. Analysis failed.
[ERROR] Could not connect to Central search. Analysis failed.
[ERROR] Could not connect to Central search. Analysis failed.
[ERROR] Could not connect to Central search. Analysis failed.
[ERROR] Could not connect to Central search. Analysis failed.
[ERROR] Could not connect to Central search. Analysis failed.
[ERROR] Could not connect to Central search. Analysis failed.
[ERROR] Could not connect to Central search. Analysis failed.
[ERROR] Could not connect to Central search. Analysis failed.
[ERROR] Could not connect to Central search. Analysis failed.
[ERROR] Could not connect to Central search. Analysis failed.
[ERROR] Could not connect to Central search. Analysis failed.
[ERROR] Could not connect to Central search. Analysis failed.
[ERROR] Could not connect to Central search. Analysis failed.
[ERROR] Could not connect to Central search. Analysis failed.
[ERROR] Could not connect to Central search. Analysis failed.
[ERROR] Could not connect to Central search. Analysis failed.
[ERROR] Could not connect to Central search. Analysis failed.
[ERROR] Could not connect to Central search. Analysis failed.
[ERROR] Could not connect to Central search. Analysis failed.
[ERROR] Could not connect to Central search. Analysis failed.
[ERROR] Could not connect to Central search. Analysis failed.
[ERROR] Could not connect to Central search. Analysis failed.
[ERROR] Could not connect to Central search. Analysis failed.
[ERROR] Could not connect to Central search. Analysis failed.
[ERROR] Could not connect to Central search. Analysis failed.
[ERROR] Could not connect to Central search. Analysis failed.
[ERROR] Could not connect to Central search. Analysis failed.
[ERROR] Could not connect to Central search. Analysis failed.
[ERROR] Could not connect to Central search. Analysis failed.
[ERROR] Could not connect to Central search. Analysis failed.
[ERROR] Could not connect to Central search. Analysis failed.
[ERROR] Could not connect to Central search. Analysis failed.
[ERROR] Could not connect to Central search. Analysis failed.
[ERROR] Could not connect to Central search. Analysis failed.
[ERROR] Could not connect to Central search. Analysis failed.
[ERROR] Could not connect to Central search. Analysis failed.
[ERROR] Could not connect to Central search. Analysis failed.
[ERROR] Could not connect to Central search. Analysis failed.
[ERROR] Could not connect to Central search. Analysis failed.
[ERROR] Could not connect to Central search. Analysis failed.
[ERROR] Could not connect to Central search. Analysis failed.
[ERROR] Could not connect to Central search. Analysis failed.
[ERROR] Could not connect to Central search. Analysis failed.
[ERROR] Could not connect to Central search. Analysis failed.
[ERROR] Could not connect to Central search. Analysis failed.
[ERROR] Could not connect to Central search. Analysis failed.
[ERROR] Could not connect to Central search. Analysis failed.
[ERROR] Could not connect to Central search. Analysis failed.
[ERROR] Could not connect to Central search. Analysis failed.
[ERROR] Could not connect to Central search. Analysis failed.
[ERROR] Could not connect to Central search. Analysis failed.
[ERROR] Could not connect to Central search. Analysis failed.
[ERROR] Could not connect to Central search. Analysis failed.
[ERROR] Could not connect to Central search. Analysis failed.
[ERROR] Could not connect to Central search. Analysis failed.
[ERROR] Could not connect to Central search. Analysis failed.
[ERROR] Could not connect to Central search. Analysis failed.
[ERROR] Could not connect to Central search. Analysis failed.
[ERROR] Could not connect to Central search. Analysis failed.
[ERROR] Could not connect to Central search. Analysis failed.
[ERROR] Could not connect to Central search. Analysis failed.
[ERROR] Could not connect to Central search. Analysis failed.
[ERROR] Could not connect to Central search. Analysis failed.
[ERROR] Could not connect to Central search. Analysis failed.
[ERROR] Could not connect to Central search. Analysis failed.
[ERROR] Could not connect to Central search. Analysis failed.
[ERROR] Could not connect to Central search. Analysis failed.
[ERROR] Could not connect to Central search. Analysis failed.
[ERROR] Could not connect to Central search. Analysis failed.
[ERROR] Could not connect to Central search. Analysis failed.
[ERROR] Could not connect to Central search. Analysis failed.
[ERROR] Could not connect to Central search. Analysis failed.
[ERROR] Could not connect to Central search. Analysis failed.
[ERROR] Could not connect to Central search. Analysis failed.
[ERROR] Could not connect to Central search. Analysis failed.
[ERROR] Could not connect to Central search. Analysis failed.
[ERROR] Could not connect to Central search. Analysis failed.
[ERROR] Could not connect to Central search. Analysis failed.
[ERROR] Could not connect to Central search. Analysis failed.
[ERROR] Could not connect to Central search. Analysis failed.
[ERROR] Could not connect to Central search. Analysis failed.
[ERROR] Could not connect to Central search. Analysis failed.
[ERROR] Could not connect to Central search. Analysis failed.
[ERROR] Could not connect to Central search. Analysis failed.
[ERROR] Could not connect to Central search. Analysis failed.
[ERROR] Could not connect to Central search. Analysis failed.
[ERROR] Could not connect to Central search. Analysis failed.
[ERROR] Could not connect to Central search. Analysis failed.
[ERROR] Could not connect to Central search. Analysis failed.
[ERROR] Could not connect to Central search. Analysis failed.
[ERROR] Could not connect to Central search. Analysis failed.
[ERROR] Could not connect to Central search. Analysis failed.
[ERROR] Could not connect to Central search. Analysis failed.
[ERROR] Could not connect to Central search. Analysis failed.
[ERROR] Could not connect to Central search. Analysis failed.
[ERROR] Could not connect to Central search. Analysis failed.
[ERROR] -> [Help 1]
[ERROR]
[ERROR] To see the full stack trace of the errors, re-run Maven with the -e switch.
[ERROR] Re-run Maven using the -X switch to enable full debug logging.
[ERROR]
[ERROR] For more information about the errors and possible solutions, please read the following articles:
[ERROR] [Help 1] http://cwiki.apache.org/confluence/display/MAVEN/MojoExecutionException
[ERROR]
[ERROR] After correcting the problems, you can resume the build with the command
[ERROR]   mvn <goals> -rf :struts2-parent
Build step 'Execute shell' marked build as failure
Setting MAVEN_3_LATEST__HOME=/home/jenkins/tools/maven/latest3/

---------------------------------------------------------------------
To unsubscribe, e-mail: [hidden email]
For additional commands, e-mail: [hidden email]

Reply | Threaded
Open this post in threaded view
|

Build failed in Jenkins: Struts-site-javadocs #5

Apache Jenkins Server-2
See <https://builds.apache.org/job/Struts-site-javadocs/5/display/redirect?page=changes>

Changes:

[github] Adds toc to kick deployment again

[Lukasz Lenart] Uses https to download MD5 and SHA1

[Lukasz Lenart] Uses https to access ASF sites

[Lukasz Lenart] Adds leading slash

[Lukasz Lenart] Adds info about prior versions

[Lukasz Lenart] Uses proper links

[Lukasz Lenart] Uses https instead of http

[github] Several trivial changes

[Lukasz Lenart] Updates info about using Jackson handler

[github] Replace "then" with "than"

[github] "lets"->"let's"

[Lukasz Lenart] Adds info about the latest 2.5.14.1 release

[Lukasz Lenart] Fixes wrong link to Version Notes

[github] typo

------------------------------------------
[...truncated 2.23 MB...]
[INFO] Finished Cpe Suppression Analyzer (0 seconds)
[INFO] Finished NVD CVE Analyzer (0 seconds)
[INFO] Finished Vulnerability Suppression Analyzer (0 seconds)
[INFO] Finished Dependency Bundling Analyzer (0 seconds)
[INFO] Analysis Complete (2 seconds)
[INFO] Generating "Dependency Updates Report" report --- versions-maven-plugin:2.5:dependency-updates-report
[INFO] Generating "Plugin Updates Report" report --- versions-maven-plugin:2.5:plugin-updates-report
[INFO] Generating "Property Updates Report" report --- versions-maven-plugin:2.5:property-updates-report
[INFO]
[INFO] --- maven-site-plugin:3.5.1:stage (default-cli) @ struts2-osgi-admin-bundle ---
[INFO] Using this base directory for staging: <https://builds.apache.org/job/Struts-site-javadocs/ws/target/struts-project/bundles/content/maven>
file://<https://builds.apache.org/job/Struts-site-javadocs/ws/target/struts-project/bundles/content/maven/> - Session: Opened  
[INFO] Pushing <https://builds.apache.org/job/Struts-site-javadocs/ws/target/struts-project/bundles/admin/target/site>
[INFO]    >>> to file://<https://builds.apache.org/job/Struts-site-javadocs/ws/target/struts-project/bundles/content/maven/struts2-parent/struts2-osgi-bundles/struts2-osgi-admin-bundle>
file://<https://builds.apache.org/job/Struts-site-javadocs/ws/target/struts-project/bundles/content/maven/> - Session: Disconnecting  
file://<https://builds.apache.org/job/Struts-site-javadocs/ws/target/struts-project/bundles/content/maven/> - Session: Disconnected
[INFO]
[INFO] ------------------------------------------------------------------------
[INFO] Building Struts 2 OSGi Demo Bundle 2.5.14.1
[INFO] ------------------------------------------------------------------------
[INFO]
[INFO] --- maven-site-plugin:3.5.1:site (default-cli) @ struts2-osgi-demo-bundle ---
[INFO] configuring report plugin org.apache.maven.plugins:maven-project-info-reports-plugin:2.7
[INFO] configuring report plugin org.apache.maven.plugins:maven-javadoc-plugin:2.10.3
[INFO] preparing 'javadoc' report requires 'generate-sources' forked phase execution
[INFO]
[INFO] >>> maven-javadoc-plugin:2.10.3:javadoc > generate-sources @ struts2-osgi-demo-bundle >>>
[INFO]
[INFO] <<< maven-javadoc-plugin:2.10.3:javadoc < generate-sources @ struts2-osgi-demo-bundle <<<
[INFO]
[INFO] configuring report plugin org.apache.rat:apache-rat-plugin:0.11
[INFO] configuring report plugin org.owasp:dependency-check-maven:3.0.2
[INFO] configuring report plugin org.codehaus.mojo:versions-maven-plugin:2.5
[INFO] configuring report plugin org.codehaus.mojo:rat-maven-plugin:1.0-alpha-2
[INFO] Rendering site with org.apache.maven.skins:maven-fluido-skin:jar:1.6 skin.
[INFO] Skipped "RAT Report" report (rat-maven-plugin:1.0-alpha-2:rat), file "rat-report.html" already exists for the English version.
[INFO] Generating "About" report                --- maven-project-info-reports-plugin:2.7:index
[INFO] Generating "Plugin Management" report    --- maven-project-info-reports-plugin:2.7:plugin-management
[INFO] Generating "Distribution Management" report --- maven-project-info-reports-plugin:2.7:distribution-management
[INFO] Generating "Dependency Information" report --- maven-project-info-reports-plugin:2.7:dependency-info
[INFO] Generating "Source Repository" report    --- maven-project-info-reports-plugin:2.7:scm
[INFO] Generating "Mailing Lists" report        --- maven-project-info-reports-plugin:2.7:mailing-list
[INFO] Generating "Issue Tracking" report       --- maven-project-info-reports-plugin:2.7:issue-tracking
[INFO] Generating "Continuous Integration" report --- maven-project-info-reports-plugin:2.7:cim
[INFO] Generating "Project Plugins" report      --- maven-project-info-reports-plugin:2.7:plugins
[INFO] Generating "Project License" report      --- maven-project-info-reports-plugin:2.7:license
[INFO] Generating "Dependency Management" report --- maven-project-info-reports-plugin:2.7:dependency-management
[INFO] Generating "Project Team" report         --- maven-project-info-reports-plugin:2.7:project-team
[INFO] Generating "Project Summary" report      --- maven-project-info-reports-plugin:2.7:summary
[INFO] Generating "Dependencies" report         --- maven-project-info-reports-plugin:2.7:dependencies
[WARNING] Unable to process class META-INF/versions/9/org/apache/logging/log4j/util/StackLocator.class in JarAnalyzer File /home/jenkins/.m2/repository/org/apache/logging/log4j/log4j-api/2.9.1/log4j-api-2.9.1.jar
org.apache.bcel.classfile.ClassFormatException: Invalid byte tag in constant pool: 18
    at org.apache.bcel.classfile.Constant.readConstant (Constant.java:146)
    at org.apache.bcel.classfile.ConstantPool.<init> (ConstantPool.java:67)
    at org.apache.bcel.classfile.ClassParser.readConstantPool (ClassParser.java:222)
    at org.apache.bcel.classfile.ClassParser.parse (ClassParser.java:136)
    at org.apache.maven.shared.jar.classes.JarClassesAnalysis.analyze (JarClassesAnalysis.java:92)
    at org.apache.maven.report.projectinfo.dependencies.Dependencies.getJarDependencyDetails (Dependencies.java:255)
    at org.apache.maven.report.projectinfo.dependencies.renderer.DependenciesRenderer.hasSealed (DependenciesRenderer.java:1454)
    at org.apache.maven.report.projectinfo.dependencies.renderer.DependenciesRenderer.renderSectionDependencyFileDetails (DependenciesRenderer.java:536)
    at org.apache.maven.report.projectinfo.dependencies.renderer.DependenciesRenderer.renderBody (DependenciesRenderer.java:263)
    at org.apache.maven.reporting.AbstractMavenReportRenderer.render (AbstractMavenReportRenderer.java:79)
    at org.apache.maven.report.projectinfo.DependenciesReport.executeReport (DependenciesReport.java:186)
    at org.apache.maven.reporting.AbstractMavenReport.generate (AbstractMavenReport.java:190)
    at org.apache.maven.plugins.site.render.ReportDocumentRenderer.renderDocument (ReportDocumentRenderer.java:227)
    at org.apache.maven.doxia.siterenderer.DefaultSiteRenderer.render (DefaultSiteRenderer.java:329)
    at org.apache.maven.plugins.site.render.SiteMojo.renderLocale (SiteMojo.java:181)
    at org.apache.maven.plugins.site.render.SiteMojo.execute (SiteMojo.java:135)
    at org.apache.maven.plugin.DefaultBuildPluginManager.executeMojo (DefaultBuildPluginManager.java:134)
    at org.apache.maven.lifecycle.internal.MojoExecutor.execute (MojoExecutor.java:208)
    at org.apache.maven.lifecycle.internal.MojoExecutor.execute (MojoExecutor.java:154)
    at org.apache.maven.lifecycle.internal.MojoExecutor.execute (MojoExecutor.java:146)
    at org.apache.maven.lifecycle.internal.LifecycleModuleBuilder.buildProject (LifecycleModuleBuilder.java:117)
    at org.apache.maven.lifecycle.internal.LifecycleModuleBuilder.buildProject (LifecycleModuleBuilder.java:81)
    at org.apache.maven.lifecycle.internal.builder.singlethreaded.SingleThreadedBuilder.build (SingleThreadedBuilder.java:51)
    at org.apache.maven.lifecycle.internal.LifecycleStarter.execute (LifecycleStarter.java:128)
    at org.apache.maven.DefaultMaven.doExecute (DefaultMaven.java:309)
    at org.apache.maven.DefaultMaven.doExecute (DefaultMaven.java:194)
    at org.apache.maven.DefaultMaven.execute (DefaultMaven.java:107)
    at org.apache.maven.cli.MavenCli.execute (MavenCli.java:955)
    at org.apache.maven.cli.MavenCli.doMain (MavenCli.java:290)
    at org.apache.maven.cli.MavenCli.main (MavenCli.java:194)
    at sun.reflect.NativeMethodAccessorImpl.invoke0 (Native Method)
    at sun.reflect.NativeMethodAccessorImpl.invoke (NativeMethodAccessorImpl.java:57)
    at sun.reflect.DelegatingMethodAccessorImpl.invoke (DelegatingMethodAccessorImpl.java:43)
    at java.lang.reflect.Method.invoke (Method.java:606)
    at org.codehaus.plexus.classworlds.launcher.Launcher.launchEnhanced (Launcher.java:289)
    at org.codehaus.plexus.classworlds.launcher.Launcher.launch (Launcher.java:229)
    at org.codehaus.plexus.classworlds.launcher.Launcher.mainWithExitCode (Launcher.java:415)
    at org.codehaus.plexus.classworlds.launcher.Launcher.main (Launcher.java:356)
[INFO] Generating "JavaDocs" report             --- maven-javadoc-plugin:2.10.3:javadoc
[INFO]
Loading source files for package actions.osgi...
Constructing Javadoc information...
Standard Doclet version 1.7.0_80
Building tree for all the packages and classes...
Generating <https://builds.apache.org/job/Struts-site-javadocs/ws/target/struts-project/bundles/demo/target/site/apidocs/actions/osgi/BundlesAction.html...>
Generating <https://builds.apache.org/job/Struts-site-javadocs/ws/target/struts-project/bundles/demo/target/site/apidocs/actions/osgi/HelloWorldAction.html...>
Generating <https://builds.apache.org/job/Struts-site-javadocs/ws/target/struts-project/bundles/demo/target/site/apidocs/actions/osgi/Message.html...>
Generating <https://builds.apache.org/job/Struts-site-javadocs/ws/target/struts-project/bundles/demo/target/site/apidocs/actions/osgi/package-frame.html...>
Generating <https://builds.apache.org/job/Struts-site-javadocs/ws/target/struts-project/bundles/demo/target/site/apidocs/actions/osgi/package-summary.html...>
Generating <https://builds.apache.org/job/Struts-site-javadocs/ws/target/struts-project/bundles/demo/target/site/apidocs/actions/osgi/package-tree.html...>
Generating <https://builds.apache.org/job/Struts-site-javadocs/ws/target/struts-project/bundles/demo/target/site/apidocs/constant-values.html...>
Generating <https://builds.apache.org/job/Struts-site-javadocs/ws/target/struts-project/bundles/demo/target/site/apidocs/serialized-form.html...>
Generating <https://builds.apache.org/job/Struts-site-javadocs/ws/target/struts-project/bundles/demo/target/site/apidocs/actions/osgi/class-use/Message.html...>
Generating <https://builds.apache.org/job/Struts-site-javadocs/ws/target/struts-project/bundles/demo/target/site/apidocs/actions/osgi/class-use/HelloWorldAction.html...>
Generating <https://builds.apache.org/job/Struts-site-javadocs/ws/target/struts-project/bundles/demo/target/site/apidocs/actions/osgi/class-use/BundlesAction.html...>
Generating <https://builds.apache.org/job/Struts-site-javadocs/ws/target/struts-project/bundles/demo/target/site/apidocs/actions/osgi/package-use.html...>
Building index for all the packages and classes...
Generating <https://builds.apache.org/job/Struts-site-javadocs/ws/target/struts-project/bundles/demo/target/site/apidocs/overview-tree.html...>
Generating <https://builds.apache.org/job/Struts-site-javadocs/ws/target/struts-project/bundles/demo/target/site/apidocs/index-all.html...>
Generating <https://builds.apache.org/job/Struts-site-javadocs/ws/target/struts-project/bundles/demo/target/site/apidocs/deprecated-list.html...>
Building index for all classes...
Generating <https://builds.apache.org/job/Struts-site-javadocs/ws/target/struts-project/bundles/demo/target/site/apidocs/allclasses-frame.html...>
Generating <https://builds.apache.org/job/Struts-site-javadocs/ws/target/struts-project/bundles/demo/target/site/apidocs/allclasses-noframe.html...>
Generating <https://builds.apache.org/job/Struts-site-javadocs/ws/target/struts-project/bundles/demo/target/site/apidocs/index.html...>
Generating <https://builds.apache.org/job/Struts-site-javadocs/ws/target/struts-project/bundles/demo/target/site/apidocs/help-doc.html...>
[INFO] Generating "Rat Report" report           --- apache-rat-plugin:0.11:rat
[INFO] 51 implicit excludes (use -debug for more details).
[INFO] Exclude: src/main/resources/org/apache/struts2/static/domTT.js
[INFO] Exclude: src/site/resources/tags/**/*.html
[INFO] Exclude: src/main/resources/*LICENSE.txt
[INFO] Exclude: src/test/resources/**/*.txt
[INFO] Exclude: src/main/webapp/**/*.css
[INFO] Exclude: src/main/webapp/**/*.map
[INFO] Exclude: src/main/webapp/**/*.js
[INFO] Exclude: src/main/webapp/**/*.svg
[INFO] Exclude: src/main/webapp/**/*.txt
[INFO] Exclude: src/main/resources/**/sitegraph-usage.txt
[INFO] Exclude: src/main/resources/**/docs-urls.txt
[INFO] Exclude: src/etc/header.txt
[INFO] Exclude: src/main/resources/static/css/**/*.css
[INFO] Exclude: src/main/resources/static/js/**/*.js
[INFO] Exclude: src/main/resources/docs.cfg
[INFO] Exclude: src/main/webapp/fonts/**/*
[INFO] 11 resources included (use -debug for more details)
[INFO] Generating "Dependency Check" report     --- dependency-check-maven:3.0.2:aggregate
[INFO] Checking for updates
[INFO] Skipping NVD check since last check was within 4 hours.
[INFO] Check for updates complete (13 ms)
[INFO] Analysis Started
[INFO] Finished Archive Analyzer (0 seconds)
[INFO] Finished File Name Analyzer (0 seconds)
[INFO] Finished Jar Analyzer (0 seconds)
[INFO] Finished Central Analyzer (0 seconds)
[INFO] Finished Dependency Merging Analyzer (0 seconds)
[INFO] Finished Version Filter Analyzer (0 seconds)
[INFO] Finished Hint Analyzer (0 seconds)
[INFO] Created CPE Index (0 seconds)
[INFO] Finished CPE Analyzer (1 seconds)
[INFO] Finished False Positive Analyzer (0 seconds)
[INFO] Finished Cpe Suppression Analyzer (0 seconds)
[INFO] Finished NVD CVE Analyzer (0 seconds)
[INFO] Finished Vulnerability Suppression Analyzer (0 seconds)
[INFO] Finished Dependency Bundling Analyzer (0 seconds)
[INFO] Analysis Complete (2 seconds)
[WARNING]

One or more dependencies were identified with known vulnerabilities in Struts 2 OSGi Demo Bundle:

struts-core-1.3.8.jar (org.apache.struts:struts-core:1.3.8, cpe:/a:apache:struts:1.3.8) : CVE-2016-1181, CVE-2016-1182, CVE-2014-0114, CVE-2015-0899
struts-tiles-1.3.8.jar (cpe:/a:apache:tiles:1.3.8, org.apache.struts:struts-tiles:1.3.8, cpe:/a:apache:struts:1.3.8) : CVE-2016-1181, CVE-2016-1182, CVE-2014-0114, CVE-2015-0899


See the dependency-check report for more details.


[INFO] Generating "Dependency Updates Report" report --- versions-maven-plugin:2.5:dependency-updates-report
[INFO] Generating "Plugin Updates Report" report --- versions-maven-plugin:2.5:plugin-updates-report
[INFO] Generating "Property Updates Report" report --- versions-maven-plugin:2.5:property-updates-report
[INFO]
[INFO] --- maven-site-plugin:3.5.1:stage (default-cli) @ struts2-osgi-demo-bundle ---
[INFO] Using this base directory for staging: <https://builds.apache.org/job/Struts-site-javadocs/ws/target/struts-project/bundles/content/maven>
file://<https://builds.apache.org/job/Struts-site-javadocs/ws/target/struts-project/bundles/content/maven/> - Session: Opened  
[INFO] Pushing <https://builds.apache.org/job/Struts-site-javadocs/ws/target/struts-project/bundles/demo/target/site>
[INFO]    >>> to file://<https://builds.apache.org/job/Struts-site-javadocs/ws/target/struts-project/bundles/content/maven/struts2-parent/struts2-osgi-bundles/struts2-osgi-demo-bundle>
file://<https://builds.apache.org/job/Struts-site-javadocs/ws/target/struts-project/bundles/content/maven/> - Session: Disconnecting  
file://<https://builds.apache.org/job/Struts-site-javadocs/ws/target/struts-project/bundles/content/maven/> - Session: Disconnected
[INFO]
[INFO] ------------------------------------------------------------------------
[INFO] Building Struts 2 Assembly 2.5.14.1
[INFO] ------------------------------------------------------------------------
[INFO]
[INFO] --- maven-site-plugin:3.5.1:site (default-cli) @ struts2-assembly ---
[INFO] maven.site.skip = true: Skipping site generation
[INFO]
[INFO] --- maven-site-plugin:3.5.1:stage (default-cli) @ struts2-assembly ---
[INFO] maven.site.skip = true: Skipping site staging
[INFO] ------------------------------------------------------------------------
[INFO] Reactor Summary:
[INFO]
[INFO] Struts 2 Bill of Materials ......................... SUCCESS [  1.265 s]
[INFO] Struts 2 ........................................... SUCCESS [07:42 min]
[INFO] Struts 2 Core ...................................... SUCCESS [ 27.375 s]
[INFO] Struts Plugins ..................................... SUCCESS [ 13.162 s]
[INFO] Struts 2 Configuration Browser Plugin .............. SUCCESS [  8.479 s]
[INFO] Struts 2 Sitemesh Plugin ........................... SUCCESS [ 10.180 s]
[INFO] Struts 2 Tiles Plugin .............................. SUCCESS [ 10.085 s]
[INFO] Struts 2 DWR Plugin ................................ SUCCESS [  7.754 s]
[INFO] Struts 2 Spring Plugin ............................. SUCCESS [  9.841 s]
[INFO] Struts 2 Convention Plugin ......................... SUCCESS [ 15.752 s]
[INFO] Struts 2 JUnit Plugin .............................. SUCCESS [  9.626 s]
[INFO] Struts 2 JSON Plugin ............................... SUCCESS [ 10.922 s]
[INFO] Struts 2 Bean Validation Plugin .................... SUCCESS [  8.501 s]
[INFO] Struts 2 Webapps ................................... SUCCESS [  0.008 s]
[INFO] Struts 2 Showcase Webapp ........................... SUCCESS [  0.024 s]
[INFO] Struts 2 REST Plugin ............................... SUCCESS [ 10.034 s]
[INFO] Struts 2 Rest Showcase Webapp ...................... SUCCESS [  0.019 s]
[INFO] Struts 2 CDI Plugin ................................ SUCCESS [  9.105 s]
[INFO] Struts 2 Embedded JSP Plugin ....................... SUCCESS [ 14.444 s]
[INFO] Struts 2 GXP Plugin ................................ SUCCESS [  8.568 s]
[INFO] Struts 2 Jasper Reports Plugin ..................... SUCCESS [ 10.472 s]
[INFO] Struts 2 Java Templates Plugin ..................... SUCCESS [  9.016 s]
[INFO] Struts 2 JFreeChart Plugin ......................... SUCCESS [  8.821 s]
[INFO] Struts 2 OSGi Plugin ............................... SUCCESS [ 10.154 s]
[INFO] Struts 2 OVal Plugin ............................... SUCCESS [  8.629 s]
[INFO] Struts 2 Pell Multipart Plugin ..................... SUCCESS [  7.597 s]
[INFO] Struts 2 Plexus Plugin ............................. SUCCESS [  7.999 s]
[INFO] Struts 2 Portlet Plugin ............................ SUCCESS [ 12.517 s]
[INFO] Struts 2 Portlet Tiles Plugin ...................... SUCCESS [  8.926 s]
[INFO] DEPRECATED: Struts 2 Sitegraph Plugin .............. SUCCESS [ 11.504 s]
[INFO] Struts 2 TestNG Plugin ............................. SUCCESS [  8.177 s]
[INFO] Struts OSGi Bundles ................................ SUCCESS [  6.965 s]
[INFO] Struts 2 OSGi Admin Bundle ......................... SUCCESS [ 10.007 s]
[INFO] Struts 2 OSGi Demo Bundle .......................... SUCCESS [  9.809 s]
[INFO] Struts 2 Assembly .................................. SUCCESS [  0.022 s]
[INFO] ------------------------------------------------------------------------
[INFO] BUILD SUCCESS
[INFO] ------------------------------------------------------------------------
[INFO] Total time: 12:51 min
[INFO] Finished at: 2017-12-04T07:54:35Z
[INFO] Final Memory: 163M/8607M
[INFO] ------------------------------------------------------------------------
+ cd ../..
Setting MAVEN_3_LATEST__HOME=/home/jenkins/tools/maven/latest3/
[Struts-site-javadocs] $ /bin/bash -xe /tmp/jenkins3422768544098085325.sh
+ git checkout asf-site
Previous HEAD position was b6d997f... Merge pull request #45 from dongido001/patch-1
Switched to a new branch 'asf-site'
Branch asf-site set up to track remote branch asf-site from origin.
+ git pull origin asf-site
From https://gitbox.apache.org/repos/asf/struts-site
 * branch            asf-site   -> FETCH_HEAD
Already up-to-date.
+ cp -r target/content/maven content
+ cp -r target/content/.htaccess content/.htaccess
cp: cannot stat 'target/content/.htaccess': No such file or directory
Build step 'Execute shell' marked build as failure
Setting MAVEN_3_LATEST__HOME=/home/jenkins/tools/maven/latest3/

---------------------------------------------------------------------
To unsubscribe, e-mail: [hidden email]
For additional commands, e-mail: [hidden email]

Reply | Threaded
Open this post in threaded view
|

Jenkins build is back to normal : Struts-site-javadocs #6

Apache Jenkins Server-2
See <https://builds.apache.org/job/Struts-site-javadocs/6/display/redirect?page=changes>


---------------------------------------------------------------------
To unsubscribe, e-mail: [hidden email]
For additional commands, e-mail: [hidden email]