Build failed in Jenkins: Struts-master-JDK8-dependency-check #152

classic Classic list List threaded Threaded
2 messages Options
Reply | Threaded
Open this post in threaded view
|

Build failed in Jenkins: Struts-master-JDK8-dependency-check #152

Apache Jenkins Server-2
See <https://builds.apache.org/job/Struts-master-JDK8-dependency-check/152/display/redirect>

------------------------------------------
[...truncated 2.22 KB...]
[INFO]
[INFO] Struts 2 Bill of Materials                                         [pom]
[INFO] Struts 2                                                           [pom]
[INFO] Struts 2 Core                                                      [jar]
[INFO] Struts 2 Plugins                                                   [pom]
[INFO] Struts 2 Configuration Browser Plugin                              [jar]
[INFO] Struts 2 Sitemesh Plugin                                           [jar]
[INFO] Struts 2 Tiles Plugin                                              [jar]
[INFO] Struts 2 DWR Plugin                                                [jar]
[INFO] Struts 2 Spring Plugin                                             [jar]
[INFO] Struts 2 Convention Plugin                                         [jar]
[INFO] Struts 2 JUnit Plugin                                              [jar]
[INFO] Struts 2 JSON Plugin                                               [jar]
[INFO] Struts 2 Bean Validation Plugin                                    [jar]
[INFO] Struts 2 Async Plugin                                              [jar]
[INFO] Struts 2 Webapps                                                   [pom]
[INFO] Struts 2 Showcase Webapp                                           [war]
[INFO] Struts 2 REST Plugin                                               [jar]
[INFO] Struts 2 Rest Showcase Webapp                                      [war]
[INFO] Struts 2 CDI Plugin                                                [jar]
[INFO] DEPRECATED: Struts 2 Embedded JSP Plugin                           [jar]
[INFO] Struts 2 GXP Plugin                                                [jar]
[INFO] Struts 2 Jasper Reports Plugin                                     [jar]
[INFO] Struts 2 Java Templates Plugin                                     [jar]
[INFO] Struts 2 JFreeChart Plugin                                         [jar]
[INFO] Struts 2 OSGi Plugin                                               [jar]
[INFO] Struts 2 OVal Plugin                                               [jar]
[INFO] Struts 2 Pell Multipart Plugin                                     [jar]
[INFO] Struts 2 Plexus Plugin                                             [jar]
[INFO] Struts 2 Portlet Plugin                                            [jar]
[INFO] Struts 2 Portlet Tiles Plugin                                      [jar]
[INFO] Struts 2 TestNG Plugin                                             [jar]
[INFO] Struts 2 OSGi Bundles                                              [pom]
[INFO] Struts 2 OSGi Admin Bundle                                      [bundle]
[INFO] Struts 2 OSGi Demo Bundle                                       [bundle]
[INFO] Struts 2 Assembly                                                  [pom]
[INFO]
[INFO] -------------------< org.apache.struts:struts2-bom >--------------------
[INFO] Building Struts 2 Bill of Materials 2.6-SNAPSHOT                  [1/35]
[INFO] --------------------------------[ pom ]---------------------------------
[INFO]
[INFO] --- maven-enforcer-plugin:1.4.1:enforce (enforce-maven-version) @ struts2-bom ---
[INFO]
[INFO] --- maven-remote-resources-plugin:1.5:process (process-resource-bundles) @ struts2-bom ---
[INFO]
[INFO] --- maven-site-plugin:3.7.1:attach-descriptor (attach-descriptor) @ struts2-bom ---
[INFO] No site descriptor found: nothing to attach.
[INFO]
[INFO] ------------------< org.apache.struts:struts2-parent >------------------
[INFO] Building Struts 2 2.6-SNAPSHOT                                    [2/35]
[INFO] --------------------------------[ pom ]---------------------------------
[INFO]
[INFO] --- maven-enforcer-plugin:3.0.0-M2:enforce (enforce) @ struts2-parent ---
[INFO]
[INFO] --- maven-enforcer-plugin:3.0.0-M2:enforce (enforce-maven-version) @ struts2-parent ---
[INFO]
[INFO] --- maven-remote-resources-plugin:1.5:process (process-resource-bundles) @ struts2-parent ---
[INFO]
[INFO] --- maven-bundle-plugin:3.5.0:manifest (bundle-manifest) @ struts2-parent ---
[WARNING] Ignoring project type pom - supportedProjectTypes = [jar, bundle]
[INFO]
[INFO] --- apache-rat-plugin:0.12:check (default) @ struts2-parent ---
[INFO] Added 1 additional default licenses.
[INFO] Added 1 custom approved licenses.
[INFO] Will parse SCM ignores for exclusions...
[INFO] Parsing exclusions from <https://builds.apache.org/job/Struts-master-JDK8-dependency-check/ws/.gitignore>
[INFO] Finished adding exclusions from SCM ignore files.
[INFO] 113 implicit excludes (use -debug for more details).
[INFO] Exclude: Jenkinsfile
[INFO] Exclude: src/main/groovy/Jenkinsfile.gdsl
[INFO] Exclude: src/main/resources/org/apache/struts2/static/domTT.js
[INFO] Exclude: src/site/resources/tags/**/*.html
[INFO] Exclude: src/main/resources/*LICENSE.txt
[INFO] Exclude: src/test/resources/**/*.txt
[INFO] Exclude: src/main/webapp/**/*.css
[INFO] Exclude: src/main/webapp/**/*.map
[INFO] Exclude: src/main/webapp/**/*.js
[INFO] Exclude: src/main/webapp/**/*.svg
[INFO] Exclude: src/main/webapp/**/*.txt
[INFO] Exclude: src/main/resources/**/docs-urls.txt
[INFO] Exclude: src/etc/header.txt
[INFO] Exclude: src/main/resources/static/css/**/*.css
[INFO] Exclude: src/main/resources/static/js/**/*.js
[INFO] Exclude: src/main/resources/docs.cfg
[INFO] Exclude: src/main/webapp/fonts/**/*
[INFO] 3 resources included (use -debug for more details)
[INFO] Rat check: Summary over all files. Unapproved: 0, unknown: 0, generated: 0, approved: 3 licenses.
[INFO]
[INFO] >>> maven-source-plugin:3.0.1:jar (attach-sources) > generate-sources @ struts2-parent >>>
[INFO]
[INFO] --- maven-enforcer-plugin:3.0.0-M2:enforce (enforce) @ struts2-parent ---
[INFO]
[INFO] --- maven-enforcer-plugin:3.0.0-M2:enforce (enforce-maven-version) @ struts2-parent ---
[INFO]
[INFO] <<< maven-source-plugin:3.0.1:jar (attach-sources) < generate-sources @ struts2-parent <<<
[INFO]
[INFO]
[INFO] --- maven-source-plugin:3.0.1:jar (attach-sources) @ struts2-parent ---
[INFO]
[INFO] --- maven-site-plugin:3.7.1:attach-descriptor (attach-descriptor) @ struts2-parent ---
[INFO] Attaching 'src/site/site.xml' site descriptor with classifier 'site'.
[INFO]
[INFO] --- dependency-check-maven:4.0.2:check (default) @ struts2-parent ---
[INFO] Central analyzer disabled
[INFO] Checking for updates
[INFO] starting getUpdatesNeeded() ...
[INFO] NVD CVE requires several updates; this could take a couple of minutes.
[INFO] Download Started for NVD CVE - 2007
[INFO] Download Started for NVD CVE - 2011
[INFO] Download Started for NVD CVE - 2003
[INFO] Download Started for NVD CVE - 2008
[INFO] Download Started for NVD CVE - 2004
[INFO] Download Started for NVD CVE - 2006
[INFO] Download Started for NVD CVE - 2010
[INFO] Download Started for NVD CVE - 2002
[INFO] Download Started for NVD CVE - 2005
[INFO] Download Started for NVD CVE - 2009
[INFO] Download Started for NVD CVE - 2015
[INFO] Download Started for NVD CVE - 2014
[INFO] Download Started for NVD CVE - 2013
[INFO] Download Started for NVD CVE - 2012
[INFO] Download Started for NVD CVE - 2016
[INFO] Download Started for NVD CVE - 2017
[INFO] Download Started for NVD CVE - 2018
[INFO] Download Started for NVD CVE - 2019
[INFO] Download Started for NVD CVE - Modified
[INFO] Download Complete for NVD CVE - 2003  (2595 ms)
[INFO] Processing Started for NVD CVE - 2003
[INFO] Download Complete for NVD CVE - Modified  (2820 ms)
[INFO] Processing Started for NVD CVE - Modified
[INFO] Download Complete for NVD CVE - 2013  (3457 ms)
[INFO] Processing Started for NVD CVE - 2013
[INFO] Download Complete for NVD CVE - 2015  (3745 ms)
[INFO] Download Complete for NVD CVE - 2009  (3769 ms)
[INFO] Processing Started for NVD CVE - 2009
[INFO] Processing Started for NVD CVE - 2015
[INFO] Download Complete for NVD CVE - 2017  (4896 ms)
[INFO] Processing Started for NVD CVE - 2017
[INFO] Download Complete for NVD CVE - 2011  (5105 ms)
[INFO] Download Complete for NVD CVE - 2018  (5110 ms)
[INFO] Processing Started for NVD CVE - 2018
[INFO] Processing Started for NVD CVE - 2011
[WARNING] Download Failed for NVD CVE - 2006
Some CVEs may not be reported.
[WARNING] Download Failed for NVD CVE - 2004
Some CVEs may not be reported.
[INFO] If you are behind a proxy you may need to configure dependency-check to use the proxy.
[INFO] If you are behind a proxy you may need to configure dependency-check to use the proxy.
[WARNING] Download Failed for NVD CVE - 2019
Some CVEs may not be reported.
[INFO] If you are behind a proxy you may need to configure dependency-check to use the proxy.
[WARNING] Download Failed for NVD CVE - 2008
Some CVEs may not be reported.
[INFO] If you are behind a proxy you may need to configure dependency-check to use the proxy.
[WARNING] Download Failed for NVD CVE - 2016
Some CVEs may not be reported.
[INFO] If you are behind a proxy you may need to configure dependency-check to use the proxy.
[WARNING] Download Failed for NVD CVE - 2012
Some CVEs may not be reported.
[INFO] If you are behind a proxy you may need to configure dependency-check to use the proxy.
[WARNING] Download Failed for NVD CVE - 2005
Some CVEs may not be reported.
[WARNING] Download Failed for NVD CVE - 2007
Some CVEs may not be reported.
[INFO] If you are behind a proxy you may need to configure dependency-check to use the proxy.
[INFO] If you are behind a proxy you may need to configure dependency-check to use the proxy.
[WARNING] Download Failed for NVD CVE - 2014
Some CVEs may not be reported.
[INFO] If you are behind a proxy you may need to configure dependency-check to use the proxy.
[WARNING] Download Failed for NVD CVE - 2010
Some CVEs may not be reported.
[INFO] If you are behind a proxy you may need to configure dependency-check to use the proxy.
[WARNING] Download Failed for NVD CVE - 2002
Some CVEs may not be reported.
[INFO] If you are behind a proxy you may need to configure dependency-check to use the proxy.
[WARNING] Unable to update Cached Web DataSource, using local data instead. Results may not include recent vulnerabilities.
[INFO] Analysis Started
[INFO] Finished File Name Analyzer (0 seconds)
[INFO] Finished Dependency Merging Analyzer (0 seconds)
[INFO] Finished Version Filter Analyzer (0 seconds)
[INFO] Finished Hint Analyzer (0 seconds)
[INFO] Created CPE Index (17 seconds)
[INFO] Skipping CPE Analysis for npm
[INFO] Finished CPE Analyzer (18 seconds)
[INFO] Finished False Positive Analyzer (0 seconds)
[INFO] Finished NVD CVE Analyzer (0 seconds)
[INFO] Finished Vulnerability Suppression Analyzer (0 seconds)
[INFO] Finished Dependency Bundling Analyzer (0 seconds)
[INFO] Analysis Complete (18 seconds)
[INFO] ------------------------------------------------------------------------
[INFO] Reactor Summary for Struts 2 2.6-SNAPSHOT:
[INFO]
[INFO] Struts 2 Bill of Materials ......................... SUCCESS [  1.998 s]
[INFO] Struts 2 ........................................... FAILURE [ 47.761 s]
[INFO] Struts 2 Core ...................................... SKIPPED
[INFO] Struts 2 Plugins ................................... SKIPPED
[INFO] Struts 2 Configuration Browser Plugin .............. SKIPPED
[INFO] Struts 2 Sitemesh Plugin ........................... SKIPPED
[INFO] Struts 2 Tiles Plugin .............................. SKIPPED
[INFO] Struts 2 DWR Plugin ................................ SKIPPED
[INFO] Struts 2 Spring Plugin ............................. SKIPPED
[INFO] Struts 2 Convention Plugin ......................... SKIPPED
[INFO] Struts 2 JUnit Plugin .............................. SKIPPED
[INFO] Struts 2 JSON Plugin ............................... SKIPPED
[INFO] Struts 2 Bean Validation Plugin .................... SKIPPED
[INFO] Struts 2 Async Plugin .............................. SKIPPED
[INFO] Struts 2 Webapps ................................... SKIPPED
[INFO] Struts 2 Showcase Webapp ........................... SKIPPED
[INFO] Struts 2 REST Plugin ............................... SKIPPED
[INFO] Struts 2 Rest Showcase Webapp ...................... SKIPPED
[INFO] Struts 2 CDI Plugin ................................ SKIPPED
[INFO] DEPRECATED: Struts 2 Embedded JSP Plugin ........... SKIPPED
[INFO] Struts 2 GXP Plugin ................................ SKIPPED
[INFO] Struts 2 Jasper Reports Plugin ..................... SKIPPED
[INFO] Struts 2 Java Templates Plugin ..................... SKIPPED
[INFO] Struts 2 JFreeChart Plugin ......................... SKIPPED
[INFO] Struts 2 OSGi Plugin ............................... SKIPPED
[INFO] Struts 2 OVal Plugin ............................... SKIPPED
[INFO] Struts 2 Pell Multipart Plugin ..................... SKIPPED
[INFO] Struts 2 Plexus Plugin ............................. SKIPPED
[INFO] Struts 2 Portlet Plugin ............................ SKIPPED
[INFO] Struts 2 Portlet Tiles Plugin ...................... SKIPPED
[INFO] Struts 2 TestNG Plugin ............................. SKIPPED
[INFO] Struts 2 OSGi Bundles .............................. SKIPPED
[INFO] Struts 2 OSGi Admin Bundle ......................... SKIPPED
[INFO] Struts 2 OSGi Demo Bundle .......................... SKIPPED
[INFO] Struts 2 Assembly .................................. SKIPPED
[INFO] ------------------------------------------------------------------------
[INFO] BUILD FAILURE
[INFO] ------------------------------------------------------------------------
[INFO] Total time:  52.031 s
[INFO] Finished at: 2019-03-10T07:55:00Z
[INFO] ------------------------------------------------------------------------
[ERROR] Failed to execute goal org.owasp:dependency-check-maven:4.0.2:check (default) on project struts2-parent: One or more exceptions occurred during dependency-check analysis: One or more exceptions occurred during dependency-check analysis
[ERROR] The download was interrupted; unable to complete the update
[ERROR] -> [Help 1]
[ERROR]
[ERROR] To see the full stack trace of the errors, re-run Maven with the -e switch.
[ERROR] Re-run Maven using the -X switch to enable full debug logging.
[ERROR]
[ERROR] For more information about the errors and possible solutions, please read the following articles:
[ERROR] [Help 1] http://cwiki.apache.org/confluence/display/MAVEN/MojoExecutionException
[ERROR]
[ERROR] After correcting the problems, you can resume the build with the command
[ERROR]   mvn <goals> -rf :struts2-parent
Build step 'Execute shell' marked build as failure
[locks-and-latches] Releasing all the locks
[locks-and-latches] All the locks released
Setting MAVEN_3_LATEST__HOME=/home/jenkins/tools/maven/latest3/

---------------------------------------------------------------------
To unsubscribe, e-mail: [hidden email]
For additional commands, e-mail: [hidden email]

Reply | Threaded
Open this post in threaded view
|

Jenkins build is back to normal : Struts-master-JDK8-dependency-check #153

Apache Jenkins Server-2
See <https://builds.apache.org/job/Struts-master-JDK8-dependency-check/153/display/redirect?page=changes>


---------------------------------------------------------------------
To unsubscribe, e-mail: [hidden email]
For additional commands, e-mail: [hidden email]