Build failed in Jenkins: Struts-master-JDK8 #256

classic Classic list List threaded Threaded
2 messages Options
Reply | Threaded
Open this post in threaded view
|

Build failed in Jenkins: Struts-master-JDK8 #256

Apache Jenkins Server-2
See <https://builds.apache.org/job/Struts-master-JDK8/256/display/redirect?page=changes>

Changes:

[yasserzamani] fix logMissingProperties (WW-4999)

[yasserzamani] not log user exceptions as missing properties (WW-4999)

[yasserzamani] test not throw exception on top missing property (WW-4999)

[yasserzamani] decouple logMissingProperties from devMode (WW-4999)

[yasserzamani] test false for logMissingProperties (WW-4999)

------------------------------------------
[...truncated 290.94 KB...]
Generating <https://builds.apache.org/job/Struts-master-JDK8/ws/core/target/apidocs/org/apache/struts2/views/velocity/components/class-use/DoubleSelectDirective.html...>
Generating <https://builds.apache.org/job/Struts-master-JDK8/ws/core/target/apidocs/org/apache/struts2/views/velocity/components/class-use/CheckBoxDirective.html...>
Generating <https://builds.apache.org/job/Struts-master-JDK8/ws/core/target/apidocs/org/apache/struts2/views/velocity/components/class-use/ComboBoxDirective.html...>
Generating <https://builds.apache.org/job/Struts-master-JDK8/ws/core/target/apidocs/org/apache/struts2/views/velocity/components/class-use/ComponentDirective.html...>
Generating <https://builds.apache.org/job/Struts-master-JDK8/ws/core/target/apidocs/org/apache/struts2/views/velocity/components/class-use/TextFieldDirective.html...>
Generating <https://builds.apache.org/job/Struts-master-JDK8/ws/core/target/apidocs/org/apache/struts2/views/velocity/components/class-use/PushDirective.html...>
Generating <https://builds.apache.org/job/Struts-master-JDK8/ws/core/target/apidocs/org/apache/struts2/result/class-use/HttpHeaderResult.html...>
Generating <https://builds.apache.org/job/Struts-master-JDK8/ws/core/target/apidocs/org/apache/struts2/result/class-use/ServletDispatcherResult.html...>
Generating <https://builds.apache.org/job/Struts-master-JDK8/ws/core/target/apidocs/org/apache/struts2/result/class-use/StreamResult.html...>
Generating <https://builds.apache.org/job/Struts-master-JDK8/ws/core/target/apidocs/org/apache/struts2/result/class-use/StrutsResultSupport.html...>
Generating <https://builds.apache.org/job/Struts-master-JDK8/ws/core/target/apidocs/org/apache/struts2/result/class-use/PostbackResult.html...>
Generating <https://builds.apache.org/job/Struts-master-JDK8/ws/core/target/apidocs/org/apache/struts2/result/class-use/Redirectable.html...>
Generating <https://builds.apache.org/job/Struts-master-JDK8/ws/core/target/apidocs/org/apache/struts2/result/class-use/ServletActionRedirectResult.html...>
Generating <https://builds.apache.org/job/Struts-master-JDK8/ws/core/target/apidocs/org/apache/struts2/result/class-use/ServletRedirectResult.html...>
Generating <https://builds.apache.org/job/Struts-master-JDK8/ws/core/target/apidocs/org/apache/struts2/result/class-use/PlainTextResult.html...>
Generating <https://builds.apache.org/job/Struts-master-JDK8/ws/core/target/apidocs/org/apache/struts2/result/class-use/VelocityResult.html...>
Generating <https://builds.apache.org/job/Struts-master-JDK8/ws/core/target/apidocs/com/opensymphony/xwork2/package-use.html...>
Generating <https://builds.apache.org/job/Struts-master-JDK8/ws/core/target/apidocs/com/opensymphony/xwork2/config/package-use.html...>
Generating <https://builds.apache.org/job/Struts-master-JDK8/ws/core/target/apidocs/com/opensymphony/xwork2/config/entities/package-use.html...>
Generating <https://builds.apache.org/job/Struts-master-JDK8/ws/core/target/apidocs/com/opensymphony/xwork2/config/impl/package-use.html...>
Generating <https://builds.apache.org/job/Struts-master-JDK8/ws/core/target/apidocs/com/opensymphony/xwork2/config/providers/package-use.html...>
Generating <https://builds.apache.org/job/Struts-master-JDK8/ws/core/target/apidocs/com/opensymphony/xwork2/conversion/package-use.html...>
Generating <https://builds.apache.org/job/Struts-master-JDK8/ws/core/target/apidocs/com/opensymphony/xwork2/conversion/annotations/package-use.html...>
Generating <https://builds.apache.org/job/Struts-master-JDK8/ws/core/target/apidocs/com/opensymphony/xwork2/conversion/impl/package-use.html...>
Generating <https://builds.apache.org/job/Struts-master-JDK8/ws/core/target/apidocs/com/opensymphony/xwork2/conversion/metadata/package-use.html...>
Generating <https://builds.apache.org/job/Struts-master-JDK8/ws/core/target/apidocs/com/opensymphony/xwork2/factory/package-use.html...>
Generating <https://builds.apache.org/job/Struts-master-JDK8/ws/core/target/apidocs/com/opensymphony/xwork2/inject/package-use.html...>
Generating <https://builds.apache.org/job/Struts-master-JDK8/ws/core/target/apidocs/com/opensymphony/xwork2/inject/util/package-use.html...>
Generating <https://builds.apache.org/job/Struts-master-JDK8/ws/core/target/apidocs/com/opensymphony/xwork2/interceptor/package-use.html...>
Generating <https://builds.apache.org/job/Struts-master-JDK8/ws/core/target/apidocs/com/opensymphony/xwork2/interceptor/annotations/package-use.html...>
Generating <https://builds.apache.org/job/Struts-master-JDK8/ws/core/target/apidocs/com/opensymphony/xwork2/mock/package-use.html...>
Generating <https://builds.apache.org/job/Struts-master-JDK8/ws/core/target/apidocs/com/opensymphony/xwork2/ognl/package-use.html...>
Generating <https://builds.apache.org/job/Struts-master-JDK8/ws/core/target/apidocs/com/opensymphony/xwork2/ognl/accessor/package-use.html...>
Generating <https://builds.apache.org/job/Struts-master-JDK8/ws/core/target/apidocs/com/opensymphony/xwork2/result/package-use.html...>
Generating <https://builds.apache.org/job/Struts-master-JDK8/ws/core/target/apidocs/com/opensymphony/xwork2/security/package-use.html...>
Generating <https://builds.apache.org/job/Struts-master-JDK8/ws/core/target/apidocs/com/opensymphony/xwork2/spring/package-use.html...>
Generating <https://builds.apache.org/job/Struts-master-JDK8/ws/core/target/apidocs/com/opensymphony/xwork2/spring/interceptor/package-use.html...>
Generating <https://builds.apache.org/job/Struts-master-JDK8/ws/core/target/apidocs/com/opensymphony/xwork2/test/package-use.html...>
Generating <https://builds.apache.org/job/Struts-master-JDK8/ws/core/target/apidocs/com/opensymphony/xwork2/util/package-use.html...>
Generating <https://builds.apache.org/job/Struts-master-JDK8/ws/core/target/apidocs/com/opensymphony/xwork2/util/classloader/package-use.html...>
Generating <https://builds.apache.org/job/Struts-master-JDK8/ws/core/target/apidocs/com/opensymphony/xwork2/util/finder/package-use.html...>
Generating <https://builds.apache.org/job/Struts-master-JDK8/ws/core/target/apidocs/com/opensymphony/xwork2/util/fs/package-use.html...>
Generating <https://builds.apache.org/job/Struts-master-JDK8/ws/core/target/apidocs/com/opensymphony/xwork2/util/location/package-use.html...>
Generating <https://builds.apache.org/job/Struts-master-JDK8/ws/core/target/apidocs/com/opensymphony/xwork2/util/reflection/package-use.html...>
Generating <https://builds.apache.org/job/Struts-master-JDK8/ws/core/target/apidocs/com/opensymphony/xwork2/validator/package-use.html...>
Generating <https://builds.apache.org/job/Struts-master-JDK8/ws/core/target/apidocs/com/opensymphony/xwork2/validator/annotations/package-use.html...>
Generating <https://builds.apache.org/job/Struts-master-JDK8/ws/core/target/apidocs/com/opensymphony/xwork2/validator/validators/package-use.html...>
Generating <https://builds.apache.org/job/Struts-master-JDK8/ws/core/target/apidocs/org/apache/struts2/package-use.html...>
Generating <https://builds.apache.org/job/Struts-master-JDK8/ws/core/target/apidocs/org/apache/struts2/action/package-use.html...>
Generating <https://builds.apache.org/job/Struts-master-JDK8/ws/core/target/apidocs/org/apache/struts2/components/package-use.html...>
Generating <https://builds.apache.org/job/Struts-master-JDK8/ws/core/target/apidocs/org/apache/struts2/components/template/package-use.html...>
Generating <https://builds.apache.org/job/Struts-master-JDK8/ws/core/target/apidocs/org/apache/struts2/config/package-use.html...>
Generating <https://builds.apache.org/job/Struts-master-JDK8/ws/core/target/apidocs/org/apache/struts2/config/entities/package-use.html...>
Generating <https://builds.apache.org/job/Struts-master-JDK8/ws/core/target/apidocs/org/apache/struts2/conversion/package-use.html...>
Generating <https://builds.apache.org/job/Struts-master-JDK8/ws/core/target/apidocs/org/apache/struts2/dispatcher/package-use.html...>
Generating <https://builds.apache.org/job/Struts-master-JDK8/ws/core/target/apidocs/org/apache/struts2/dispatcher/filter/package-use.html...>
Generating <https://builds.apache.org/job/Struts-master-JDK8/ws/core/target/apidocs/org/apache/struts2/dispatcher/listener/package-use.html...>
Generating <https://builds.apache.org/job/Struts-master-JDK8/ws/core/target/apidocs/org/apache/struts2/dispatcher/mapper/package-use.html...>
Generating <https://builds.apache.org/job/Struts-master-JDK8/ws/core/target/apidocs/org/apache/struts2/dispatcher/multipart/package-use.html...>
Generating <https://builds.apache.org/job/Struts-master-JDK8/ws/core/target/apidocs/org/apache/struts2/dispatcher/servlet/package-use.html...>
Generating <https://builds.apache.org/job/Struts-master-JDK8/ws/core/target/apidocs/org/apache/struts2/factory/package-use.html...>
Generating <https://builds.apache.org/job/Struts-master-JDK8/ws/core/target/apidocs/org/apache/struts2/interceptor/package-use.html...>
Generating <https://builds.apache.org/job/Struts-master-JDK8/ws/core/target/apidocs/org/apache/struts2/interceptor/debugging/package-use.html...>
Generating <https://builds.apache.org/job/Struts-master-JDK8/ws/core/target/apidocs/org/apache/struts2/interceptor/servlet/package-use.html...>
Generating <https://builds.apache.org/job/Struts-master-JDK8/ws/core/target/apidocs/org/apache/struts2/interceptor/validation/package-use.html...>
Generating <https://builds.apache.org/job/Struts-master-JDK8/ws/core/target/apidocs/org/apache/struts2/result/package-use.html...>
Generating <https://builds.apache.org/job/Struts-master-JDK8/ws/core/target/apidocs/org/apache/struts2/util/package-use.html...>
Generating <https://builds.apache.org/job/Struts-master-JDK8/ws/core/target/apidocs/org/apache/struts2/util/fs/package-use.html...>
Generating <https://builds.apache.org/job/Struts-master-JDK8/ws/core/target/apidocs/org/apache/struts2/util/tomcat/buf/package-use.html...>
Generating <https://builds.apache.org/job/Struts-master-JDK8/ws/core/target/apidocs/org/apache/struts2/views/package-use.html...>
Generating <https://builds.apache.org/job/Struts-master-JDK8/ws/core/target/apidocs/org/apache/struts2/views/annotations/package-use.html...>
Generating <https://builds.apache.org/job/Struts-master-JDK8/ws/core/target/apidocs/org/apache/struts2/views/freemarker/package-use.html...>
Generating <https://builds.apache.org/job/Struts-master-JDK8/ws/core/target/apidocs/org/apache/struts2/views/freemarker/tags/package-use.html...>
Generating <https://builds.apache.org/job/Struts-master-JDK8/ws/core/target/apidocs/org/apache/struts2/views/jsp/package-use.html...>
Generating <https://builds.apache.org/job/Struts-master-JDK8/ws/core/target/apidocs/org/apache/struts2/views/jsp/iterator/package-use.html...>
Generating <https://builds.apache.org/job/Struts-master-JDK8/ws/core/target/apidocs/org/apache/struts2/views/jsp/ui/package-use.html...>
Generating <https://builds.apache.org/job/Struts-master-JDK8/ws/core/target/apidocs/org/apache/struts2/views/util/package-use.html...>
Generating <https://builds.apache.org/job/Struts-master-JDK8/ws/core/target/apidocs/org/apache/struts2/views/velocity/package-use.html...>
Generating <https://builds.apache.org/job/Struts-master-JDK8/ws/core/target/apidocs/org/apache/struts2/views/velocity/components/package-use.html...>
Generating <https://builds.apache.org/job/Struts-master-JDK8/ws/core/target/apidocs/org/apache/struts2/views/xslt/package-use.html...>
Building index for all the packages and classes...
Generating <https://builds.apache.org/job/Struts-master-JDK8/ws/core/target/apidocs/overview-tree.html...>
Generating <https://builds.apache.org/job/Struts-master-JDK8/ws/core/target/apidocs/index-all.html...>
Generating <https://builds.apache.org/job/Struts-master-JDK8/ws/core/target/apidocs/deprecated-list.html...>
Building index for all classes...
Generating <https://builds.apache.org/job/Struts-master-JDK8/ws/core/target/apidocs/allclasses-frame.html...>
Generating <https://builds.apache.org/job/Struts-master-JDK8/ws/core/target/apidocs/allclasses-noframe.html...>
Generating <https://builds.apache.org/job/Struts-master-JDK8/ws/core/target/apidocs/index.html...>
Generating <https://builds.apache.org/job/Struts-master-JDK8/ws/core/target/apidocs/overview-summary.html...>
Generating <https://builds.apache.org/job/Struts-master-JDK8/ws/core/target/apidocs/help-doc.html...>
12 warnings
[WARNING] Javadoc Warnings
[WARNING] <https://builds.apache.org/job/Struts-master-JDK8/ws/core/src/main/java/com/opensymphony/xwork2/conversion/annotations/TypeConversion.java>:191: warning - Tag @see:illegal character: "123" in "{@link #converterClass()}"
[WARNING] <https://builds.apache.org/job/Struts-master-JDK8/ws/core/src/main/java/com/opensymphony/xwork2/conversion/annotations/TypeConversion.java>:191: warning - Tag @see:illegal character: "64" in "{@link #converterClass()}"
[WARNING] <https://builds.apache.org/job/Struts-master-JDK8/ws/core/src/main/java/com/opensymphony/xwork2/conversion/annotations/TypeConversion.java>:191: warning - Tag @see: reference not found: {@link #converterClass()}
[WARNING] <https://builds.apache.org/job/Struts-master-JDK8/ws/core/src/main/java/com/opensymphony/xwork2/ognl/OgnlValueStackFactory.java>:122: warning - @return tag has no arguments.
[WARNING] <https://builds.apache.org/job/Struts-master-JDK8/ws/core/src/main/java/com/opensymphony/xwork2/ognl/OgnlValueStackFactory.java>:131: warning - @return tag has no arguments.
[WARNING] <https://builds.apache.org/job/Struts-master-JDK8/ws/core/src/main/java/com/opensymphony/xwork2/ognl/SecurityMemberAccess.java>:169: warning - @return tag has no arguments.
[WARNING] <https://builds.apache.org/job/Struts-master-JDK8/ws/core/src/main/java/com/opensymphony/xwork2/ognl/SecurityMemberAccess.java>:190: warning - @return tag has no arguments.
[WARNING] <https://builds.apache.org/job/Struts-master-JDK8/ws/core/src/main/java/com/opensymphony/xwork2/ognl/SecurityMemberAccess.java>:207: warning - @return tag has no arguments.
[WARNING] <https://builds.apache.org/job/Struts-master-JDK8/ws/core/src/main/java/org/apache/struts2/dispatcher/HttpParameters.java>:204: warning - @return tag has no arguments.
[WARNING] <https://builds.apache.org/job/Struts-master-JDK8/ws/core/src/main/java/org/apache/struts2/interceptor/TokenSessionStoreInterceptor.java>:130: warning - @return tag has no arguments.
[WARNING] <https://builds.apache.org/job/Struts-master-JDK8/ws/core/src/main/java/org/apache/struts2/interceptor/TokenSessionStoreInterceptor.java>:181: warning - @return tag has no arguments.
[WARNING] <https://builds.apache.org/job/Struts-master-JDK8/ws/core/src/main/java/org/apache/struts2/interceptor/TokenSessionStoreInterceptor.java>:181: warning - Tag @link: reference not found: handleInvalidToken
[INFO] Building jar: <https://builds.apache.org/job/Struts-master-JDK8/ws/core/target/struts2-core-2.6-SNAPSHOT-javadoc.jar>
[INFO]
[INFO] --- maven-enforcer-plugin:3.0.0-M2:enforce (enforce) @ struts2-core ---
[INFO]
[INFO] --- maven-enforcer-plugin:3.0.0-M2:enforce (enforce-maven-version) @ struts2-core ---
[INFO]
[INFO] --- maven-remote-resources-plugin:1.5:process (process-resource-bundles) @ struts2-core ---
[INFO]
[INFO] --- maven-resources-plugin:3.1.0:resources (default-resources) @ struts2-core ---
[INFO] Using 'UTF-8' encoding to copy filtered resources.
[INFO] Copying 198 resources
[INFO] Copying 3 resources
[INFO]
[INFO] --- maven-compiler-plugin:3.7.0:compile (default-compile) @ struts2-core ---
[INFO] Changes detected - recompiling the module!
[INFO] Compiling 760 source files to <https://builds.apache.org/job/Struts-master-JDK8/ws/core/target/classes>
[INFO] <https://builds.apache.org/job/Struts-master-JDK8/ws/core/src/main/java/org/apache/struts2/dispatcher/HttpParameters.java>: Some input files use or override a deprecated API.
[INFO] <https://builds.apache.org/job/Struts-master-JDK8/ws/core/src/main/java/org/apache/struts2/dispatcher/HttpParameters.java>: Recompile with -Xlint:deprecation for details.
[INFO] <https://builds.apache.org/job/Struts-master-JDK8/ws/core/src/main/java/org/apache/struts2/dispatcher/Dispatcher.java>: Some input files use unchecked or unsafe operations.
[INFO] <https://builds.apache.org/job/Struts-master-JDK8/ws/core/src/main/java/org/apache/struts2/dispatcher/Dispatcher.java>: Recompile with -Xlint:unchecked for details.
[INFO]
[INFO] --- jshint-maven-plugin:1.6.0:lint (default) @ struts2-core ---
[INFO] using jshint version 2.5.6
[INFO] Using configuration file: <https://builds.apache.org/job/Struts-master-JDK8/ws/core/src/main/resources/jshint.conf.js>
[WARNING] Excluding <https://builds.apache.org/job/Struts-master-JDK8/ws/core/src/main/resources/org/apache/struts2/static/domTT.js>
[INFO]   <https://builds.apache.org/job/Struts-master-JDK8/ws/core/src/main/resources/template/css_xhtml/validation.js>
[INFO]   <https://builds.apache.org/job/Struts-master-JDK8/ws/core/src/main/resources/template/xhtml/validation.js>
[INFO]   <https://builds.apache.org/job/Struts-master-JDK8/ws/core/src/main/resources/org/apache/struts2/interceptor/debugging/webconsole.js>
[INFO]   <https://builds.apache.org/job/Struts-master-JDK8/ws/core/src/main/resources/org/apache/struts2/static/inputtransferselect.js>
[INFO]   <https://builds.apache.org/job/Struts-master-JDK8/ws/core/src/main/resources/org/apache/struts2/static/optiontransferselect.js>
[INFO]   <https://builds.apache.org/job/Struts-master-JDK8/ws/core/src/main/resources/org/apache/struts2/static/utils.js>
[INFO]   <https://builds.apache.org/job/Struts-master-JDK8/ws/core/src/main/resources/jshint.conf.js>
[INFO]
[INFO] --- maven-compiler-plugin:3.7.0:compile (default) @ struts2-core ---
[INFO] Changes detected - recompiling the module!
[INFO] Compiling 760 source files to <https://builds.apache.org/job/Struts-master-JDK8/ws/core/target/classes>
[INFO] <https://builds.apache.org/job/Struts-master-JDK8/ws/core/src/main/java/org/apache/struts2/dispatcher/HttpParameters.java>: Some input files use or override a deprecated API.
[INFO] <https://builds.apache.org/job/Struts-master-JDK8/ws/core/src/main/java/org/apache/struts2/dispatcher/HttpParameters.java>: Recompile with -Xlint:deprecation for details.
[INFO] <https://builds.apache.org/job/Struts-master-JDK8/ws/core/src/main/java/org/apache/struts2/dispatcher/Dispatcher.java>: Some input files use unchecked or unsafe operations.
[INFO] <https://builds.apache.org/job/Struts-master-JDK8/ws/core/src/main/java/org/apache/struts2/dispatcher/Dispatcher.java>: Recompile with -Xlint:unchecked for details.
[INFO]
[INFO] --- maven-bundle-plugin:3.5.0:manifest (bundle-manifest) @ struts2-core ---
[WARNING] Manifest org.apache.struts:struts2-core:jar:2.6-SNAPSHOT : Export com.opensymphony.xwork2,  has 1,  private references [com.opensymphony.xwork2.conversion.impl],
[WARNING] Manifest org.apache.struts:struts2-core:jar:2.6-SNAPSHOT : Export com.opensymphony.xwork2.conversion.annotations,  has 1,  private references [com.opensymphony.xwork2.conversion.impl],
[WARNING] Manifest org.apache.struts:struts2-core:jar:2.6-SNAPSHOT : Export com.opensymphony.xwork2.ognl,  has 1,  private references [com.opensymphony.xwork2.conversion.impl],
[WARNING] Manifest org.apache.struts:struts2-core:jar:2.6-SNAPSHOT : Export com.opensymphony.xwork2.ognl.accessor,  has 1,  private references [com.opensymphony.xwork2.conversion.impl],
[WARNING] Manifest org.apache.struts:struts2-core:jar:2.6-SNAPSHOT : Export org.apache.struts2.conversion,  has 1,  private references [com.opensymphony.xwork2.conversion.impl],
[WARNING] Manifest org.apache.struts:struts2-core:jar:2.6-SNAPSHOT : Export org.apache.struts2.util,  has 1,  private references [com.opensymphony.xwork2.conversion.impl],
[INFO]
[INFO] --- maven-resources-plugin:3.1.0:testResources (default-testResources) @ struts2-core ---
[INFO] Using 'UTF-8' encoding to copy filtered resources.
[INFO] Copying 348 resources
[INFO] Copying 3 resources
[INFO]
[INFO] --- maven-compiler-plugin:3.7.0:testCompile (default-testCompile) @ struts2-core ---
[INFO] Changes detected - recompiling the module!
[INFO] Compiling 425 source files to <https://builds.apache.org/job/Struts-master-JDK8/ws/core/target/test-classes>
[INFO] <https://builds.apache.org/job/Struts-master-JDK8/ws/core/src/test/java/com/opensymphony/xwork2/test/AnnotationDataAware.java>: Some input files use or override a deprecated API.
[INFO] <https://builds.apache.org/job/Struts-master-JDK8/ws/core/src/test/java/com/opensymphony/xwork2/test/AnnotationDataAware.java>: Recompile with -Xlint:deprecation for details.
[INFO] <https://builds.apache.org/job/Struts-master-JDK8/ws/core/src/test/java/org/apache/struts2/views/jsp/AbstractTagTest.java>: Some input files use unchecked or unsafe operations.
[INFO] <https://builds.apache.org/job/Struts-master-JDK8/ws/core/src/test/java/org/apache/struts2/views/jsp/AbstractTagTest.java>: Recompile with -Xlint:unchecked for details.
[INFO] -------------------------------------------------------------
[WARNING] COMPILATION WARNING :
[INFO] -------------------------------------------------------------
[WARNING] <https://builds.apache.org/job/Struts-master-JDK8/ws/core/src/test/java/com/opensymphony/xwork2/config/providers/XmlConfigurationProviderTest.java>:[30,46] com.sun.org.apache.xerces.internal.dom.ElementImpl is internal proprietary API and may be removed in a future release
[WARNING] <https://builds.apache.org/job/Struts-master-JDK8/ws/core/src/test/java/com/opensymphony/xwork2/config/providers/XmlConfigurationProviderTest.java>:[30,46] com.sun.org.apache.xerces.internal.dom.ElementImpl is internal proprietary API and may be removed in a future release
[WARNING] <https://builds.apache.org/job/Struts-master-JDK8/ws/core/src/test/java/com/opensymphony/xwork2/config/providers/XmlConfigurationProviderTest.java>:[30,46] com.sun.org.apache.xerces.internal.dom.ElementImpl is internal proprietary API and may be removed in a future release
[INFO] 3 warnings
[INFO] -------------------------------------------------------------
[INFO] -------------------------------------------------------------
[ERROR] COMPILATION ERROR :
[INFO] -------------------------------------------------------------
[ERROR] <https://builds.apache.org/job/Struts-master-JDK8/ws/core/src/test/java/com/opensymphony/xwork2/ognl/OgnlValueStackTest.java>:[1521,13] no suitable constructor found for AbstractAppender(java.lang.String,<nulltype>,<nulltype>,boolean,<nulltype>)
    constructor org.apache.logging.log4j.core.appender.AbstractAppender.AbstractAppender(java.lang.String,org.apache.logging.log4j.core.Filter,org.apache.logging.log4j.core.Layout<? extends java.io.Serializable>) is not applicable
      (actual and formal argument lists differ in length)
    constructor org.apache.logging.log4j.core.appender.AbstractAppender.AbstractAppender(java.lang.String,org.apache.logging.log4j.core.Filter,org.apache.logging.log4j.core.Layout<? extends java.io.Serializable>,boolean) is not applicable
      (actual and formal argument lists differ in length)
[INFO] 1 error
[INFO] -------------------------------------------------------------
[INFO] ------------------------------------------------------------------------
[INFO] Reactor Summary for Struts 2 2.6-SNAPSHOT:
[INFO]
[INFO] Struts 2 Bill of Materials ......................... SUCCESS [  9.379 s]
[INFO] Struts 2 ........................................... SUCCESS [ 11.749 s]
[INFO] Struts 2 Core ...................................... FAILURE [ 50.599 s]
[INFO] Struts 2 Plugins ................................... SKIPPED
[INFO] Struts 2 Configuration Browser Plugin .............. SKIPPED
[INFO] Struts 2 Sitemesh Plugin ........................... SKIPPED
[INFO] Struts 2 Tiles Plugin .............................. SKIPPED
[INFO] Struts 2 DWR Plugin ................................ SKIPPED
[INFO] Struts 2 Spring Plugin ............................. SKIPPED
[INFO] Struts 2 Convention Plugin ......................... SKIPPED
[INFO] Struts 2 JUnit Plugin .............................. SKIPPED
[INFO] Struts 2 JSON Plugin ............................... SKIPPED
[INFO] Struts 2 Bean Validation Plugin .................... SKIPPED
[INFO] Struts 2 Async Plugin .............................. SKIPPED
[INFO] Struts 2 Webapps ................................... SKIPPED
[INFO] Struts 2 Showcase Webapp ........................... SKIPPED
[INFO] Struts 2 REST Plugin ............................... SKIPPED
[INFO] Struts 2 Rest Showcase Webapp ...................... SKIPPED
[INFO] Struts 2 CDI Plugin ................................ SKIPPED
[INFO] DEPRECATED: Struts 2 Embedded JSP Plugin ........... SKIPPED
[INFO] Struts 2 GXP Plugin ................................ SKIPPED
[INFO] Struts 2 Jasper Reports Plugin ..................... SKIPPED
[INFO] Struts 2 Java Templates Plugin ..................... SKIPPED
[INFO] Struts 2 JFreeChart Plugin ......................... SKIPPED
[INFO] Struts 2 OSGi Plugin ............................... SKIPPED
[INFO] Struts 2 OVal Plugin ............................... SKIPPED
[INFO] Struts 2 Pell Multipart Plugin ..................... SKIPPED
[INFO] Struts 2 Plexus Plugin ............................. SKIPPED
[INFO] Struts 2 Portlet Plugin ............................ SKIPPED
[INFO] Struts 2 Portlet Tiles Plugin ...................... SKIPPED
[INFO] Struts 2 TestNG Plugin ............................. SKIPPED
[INFO] Struts 2 OSGi Bundles .............................. SKIPPED
[INFO] Struts 2 OSGi Admin Bundle ......................... SKIPPED
[INFO] Struts 2 OSGi Demo Bundle .......................... SKIPPED
[INFO] Struts 2 Assembly .................................. SKIPPED
[INFO] ------------------------------------------------------------------------
[INFO] BUILD FAILURE
[INFO] ------------------------------------------------------------------------
[INFO] Total time:  01:15 min
[INFO] Finished at: 2019-06-03T07:51:27Z
[INFO] ------------------------------------------------------------------------
[ERROR] Failed to execute goal org.apache.maven.plugins:maven-compiler-plugin:3.7.0:testCompile (default-testCompile) on project struts2-core: Compilation failure
[ERROR] <https://builds.apache.org/job/Struts-master-JDK8/ws/core/src/test/java/com/opensymphony/xwork2/ognl/OgnlValueStackTest.java>:[1521,13] no suitable constructor found for AbstractAppender(java.lang.String,<nulltype>,<nulltype>,boolean,<nulltype>)
[ERROR]     constructor org.apache.logging.log4j.core.appender.AbstractAppender.AbstractAppender(java.lang.String,org.apache.logging.log4j.core.Filter,org.apache.logging.log4j.core.Layout<? extends java.io.Serializable>) is not applicable
[ERROR]       (actual and formal argument lists differ in length)
[ERROR]     constructor org.apache.logging.log4j.core.appender.AbstractAppender.AbstractAppender(java.lang.String,org.apache.logging.log4j.core.Filter,org.apache.logging.log4j.core.Layout<? extends java.io.Serializable>,boolean) is not applicable
[ERROR]       (actual and formal argument lists differ in length)
[ERROR]
[ERROR] -> [Help 1]
[ERROR]
[ERROR] To see the full stack trace of the errors, re-run Maven with the -e switch.
[ERROR] Re-run Maven using the -X switch to enable full debug logging.
[ERROR]
[ERROR] For more information about the errors and possible solutions, please read the following articles:
[ERROR] [Help 1] http://cwiki.apache.org/confluence/display/MAVEN/MojoFailureException
[ERROR]
[ERROR] After correcting the problems, you can resume the build with the command
[ERROR]   mvn <goals> -rf :struts2-core
Build step 'Execute shell' marked build as failure
[locks-and-latches] Releasing all the locks
[locks-and-latches] All the locks released
[JIRA] Updating issue WW-4999
Setting MAVEN_3_LATEST__HOME=/home/jenkins/tools/maven/latest3/

---------------------------------------------------------------------
To unsubscribe, e-mail: [hidden email]
For additional commands, e-mail: [hidden email]

Reply | Threaded
Open this post in threaded view
|

Jenkins build is back to normal : Struts-master-JDK8 #257

Apache Jenkins Server-2
See <https://builds.apache.org/job/Struts-master-JDK8/257/display/redirect?page=changes>


---------------------------------------------------------------------
To unsubscribe, e-mail: [hidden email]
For additional commands, e-mail: [hidden email]