Build failed in Jenkins: Struts-master-JDK8 #237

classic Classic list List threaded Threaded
2 messages Options
Reply | Threaded
Open this post in threaded view
|

Build failed in Jenkins: Struts-master-JDK8 #237

Apache Jenkins Server-2
See <https://builds.apache.org/job/Struts-master-JDK8/237/display/redirect?page=changes>

Changes:

[jogep] Add maven enforce plugin with rule to avoid dependency convergence

[jogep] Solve some dependency convergence issues reported by maven enforce

[jogep] Use latest available hibernate-validator version for bean validation

------------------------------------------
[...truncated 1.71 MB...]
[INFO] Skipping execution of surefire because it has already been run for this configuration
[INFO]
[INFO] --- apache-rat-plugin:0.12:check (default) @ struts2-rest-plugin ---
[INFO] Added 1 additional default licenses.
[INFO] Added 1 custom approved licenses.
[INFO] Will parse SCM ignores for exclusions...
[INFO] Finished adding exclusions from SCM ignore files.
[INFO] 61 implicit excludes (use -debug for more details).
[INFO] Exclude: Jenkinsfile
[INFO] Exclude: src/main/groovy/Jenkinsfile.gdsl
[INFO] Exclude: src/main/resources/org/apache/struts2/static/domTT.js
[INFO] Exclude: src/site/resources/tags/**/*.html
[INFO] Exclude: src/main/resources/*LICENSE.txt
[INFO] Exclude: src/test/resources/**/*.txt
[INFO] Exclude: src/main/webapp/**/*.css
[INFO] Exclude: src/main/webapp/**/*.map
[INFO] Exclude: src/main/webapp/**/*.js
[INFO] Exclude: src/main/webapp/**/*.svg
[INFO] Exclude: src/main/webapp/**/*.txt
[INFO] Exclude: src/main/resources/**/sitegraph-usage.txt
[INFO] Exclude: src/main/resources/**/docs-urls.txt
[INFO] Exclude: src/etc/header.txt
[INFO] Exclude: src/main/resources/static/css/**/*.css
[INFO] Exclude: src/main/resources/static/js/**/*.js
[INFO] Exclude: src/main/resources/docs.cfg
[INFO] Exclude: src/main/webapp/fonts/**/*
[INFO] 39 resources included (use -debug for more details)
[INFO] Rat check: Summary over all files. Unapproved: 0, unknown: 0, generated: 0, approved: 38 licenses.
[INFO]
[INFO] --- maven-jar-plugin:3.1.0:jar (default-jar) @ struts2-rest-plugin ---
[INFO] Building jar: <https://builds.apache.org/job/Struts-master-JDK8/ws/plugins/rest/target/struts2-rest-plugin-2.6-SNAPSHOT.jar>
[INFO]
[INFO] >>> maven-source-plugin:3.0.1:jar (attach-sources) > generate-sources @ struts2-rest-plugin >>>
[INFO]
[INFO] --- maven-enforcer-plugin:3.0.0-M2:enforce (enforce) @ struts2-rest-plugin ---
[INFO]
[INFO] --- maven-enforcer-plugin:3.0.0-M2:enforce (enforce-maven-version) @ struts2-rest-plugin ---
[INFO]
[INFO] <<< maven-source-plugin:3.0.1:jar (attach-sources) < generate-sources @ struts2-rest-plugin <<<
[INFO]
[INFO]
[INFO] --- maven-source-plugin:3.0.1:jar (attach-sources) @ struts2-rest-plugin ---
[INFO] Building jar: <https://builds.apache.org/job/Struts-master-JDK8/ws/plugins/rest/target/struts2-rest-plugin-2.6-SNAPSHOT-sources.jar>
[INFO]
[INFO] --- maven-site-plugin:3.7.1:attach-descriptor (attach-descriptor) @ struts2-rest-plugin ---
[INFO] Skipping because packaging 'jar' is not pom.
[INFO]
[INFO] --- maven-install-plugin:2.5.2:install (default-install) @ struts2-rest-plugin ---
[INFO] Installing <https://builds.apache.org/job/Struts-master-JDK8/ws/plugins/rest/target/struts2-rest-plugin-2.6-SNAPSHOT.jar> to /home/jenkins/.m2/repository/org/apache/struts/struts2-rest-plugin/2.6-SNAPSHOT/struts2-rest-plugin-2.6-SNAPSHOT.jar
[INFO] Installing <https://builds.apache.org/job/Struts-master-JDK8/ws/plugins/rest/pom.xml> to /home/jenkins/.m2/repository/org/apache/struts/struts2-rest-plugin/2.6-SNAPSHOT/struts2-rest-plugin-2.6-SNAPSHOT.pom
[INFO] Installing <https://builds.apache.org/job/Struts-master-JDK8/ws/plugins/rest/target/struts2-rest-plugin-2.6-SNAPSHOT-sources.jar> to /home/jenkins/.m2/repository/org/apache/struts/struts2-rest-plugin/2.6-SNAPSHOT/struts2-rest-plugin-2.6-SNAPSHOT-sources.jar
[INFO] Installing <https://builds.apache.org/job/Struts-master-JDK8/ws/plugins/rest/target/struts2-rest-plugin-2.6-SNAPSHOT-javadoc.jar> to /home/jenkins/.m2/repository/org/apache/struts/struts2-rest-plugin/2.6-SNAPSHOT/struts2-rest-plugin-2.6-SNAPSHOT-javadoc.jar
[INFO] Installing <https://builds.apache.org/job/Struts-master-JDK8/ws/plugins/rest/target/struts2-rest-plugin-2.6-SNAPSHOT-sources.jar> to /home/jenkins/.m2/repository/org/apache/struts/struts2-rest-plugin/2.6-SNAPSHOT/struts2-rest-plugin-2.6-SNAPSHOT-sources.jar
[INFO] Installing <https://builds.apache.org/job/Struts-master-JDK8/ws/plugins/rest/target/struts2-rest-plugin-2.6-SNAPSHOT-sources.jar> to /home/jenkins/.m2/repository/org/apache/struts/struts2-rest-plugin/2.6-SNAPSHOT/struts2-rest-plugin-2.6-SNAPSHOT-sources.jar
[INFO]
[INFO] --- maven-deploy-plugin:2.8.2:deploy (default-deploy) @ struts2-rest-plugin ---
Downloading from apache.snapshots.https: https://repository.apache.org/content/repositories/snapshots/org/apache/struts/struts2-rest-plugin/2.6-SNAPSHOT/maven-metadata.xml
Progress (1): 1.2 kB                    Downloaded from apache.snapshots.https: https://repository.apache.org/content/repositories/snapshots/org/apache/struts/struts2-rest-plugin/2.6-SNAPSHOT/maven-metadata.xml (1.2 kB at 2.0 kB/s)
Uploading to apache.snapshots.https: https://repository.apache.org/content/repositories/snapshots/org/apache/struts/struts2-rest-plugin/2.6-SNAPSHOT/struts2-rest-plugin-2.6-20190209.142029-162.jar
Progress (1): 2.0/53 kBProgress (1): 4.1/53 kBProgress (1): 6.1/53 kBProgress (1): 8.2/53 kBProgress (1): 10/53 kB Progress (1): 12/53 kBProgress (1): 14/53 kBProgress (1): 16/53 kBProgress (1): 18/53 kBProgress (1): 20/53 kBProgress (1): 23/53 kBProgress (1): 25/53 kBProgress (1): 27/53 kBProgress (1): 29/53 kBProgress (1): 31/53 kBProgress (1): 33/53 kBProgress (1): 35/53 kBProgress (1): 37/53 kBProgress (1): 39/53 kBProgress (1): 41/53 kBProgress (1): 43/53 kBProgress (1): 45/53 kBProgress (1): 47/53 kBProgress (1): 49/53 kBProgress (1): 51/53 kBProgress (1): 53 kB                      Uploaded to apache.snapshots.https: https://repository.apache.org/content/repositories/snapshots/org/apache/struts/struts2-rest-plugin/2.6-SNAPSHOT/struts2-rest-plugin-2.6-20190209.142029-162.jar (53 kB at 41 kB/s)
Uploading to apache.snapshots.https: https://repository.apache.org/content/repositories/snapshots/org/apache/struts/struts2-rest-plugin/2.6-SNAPSHOT/struts2-rest-plugin-2.6-20190209.142029-162.pom
Progress (1): 2.0/3.8 kBProgress (1): 3.8 kB                        Uploaded to apache.snapshots.https: https://repository.apache.org/content/repositories/snapshots/org/apache/struts/struts2-rest-plugin/2.6-SNAPSHOT/struts2-rest-plugin-2.6-20190209.142029-162.pom (3.8 kB at 3.4 kB/s)
Downloading from apache.snapshots.https: https://repository.apache.org/content/repositories/snapshots/org/apache/struts/struts2-rest-plugin/maven-metadata.xml
Progress (1): 1.4 kB                    Downloaded from apache.snapshots.https: https://repository.apache.org/content/repositories/snapshots/org/apache/struts/struts2-rest-plugin/maven-metadata.xml (1.4 kB at 2.2 kB/s)
Uploading to apache.snapshots.https: https://repository.apache.org/content/repositories/snapshots/org/apache/struts/struts2-rest-plugin/2.6-SNAPSHOT/maven-metadata.xml
Progress (1): 1.2 kB                    Uploaded to apache.snapshots.https: https://repository.apache.org/content/repositories/snapshots/org/apache/struts/struts2-rest-plugin/2.6-SNAPSHOT/maven-metadata.xml (1.2 kB at 1.1 kB/s)
Uploading to apache.snapshots.https: https://repository.apache.org/content/repositories/snapshots/org/apache/struts/struts2-rest-plugin/maven-metadata.xml
Progress (1): 1.4 kB                    Uploaded to apache.snapshots.https: https://repository.apache.org/content/repositories/snapshots/org/apache/struts/struts2-rest-plugin/maven-metadata.xml (1.4 kB at 1.2 kB/s)
Uploading to apache.snapshots.https: https://repository.apache.org/content/repositories/snapshots/org/apache/struts/struts2-rest-plugin/2.6-SNAPSHOT/struts2-rest-plugin-2.6-20190209.142029-162-sources.jar
Progress (1): 2.0/51 kBProgress (1): 4.1/51 kBProgress (1): 6.1/51 kBProgress (1): 8.2/51 kBProgress (1): 10/51 kB Progress (1): 12/51 kBProgress (1): 14/51 kBProgress (1): 16/51 kBProgress (1): 18/51 kBProgress (1): 20/51 kBProgress (1): 23/51 kBProgress (1): 25/51 kBProgress (1): 27/51 kBProgress (1): 29/51 kBProgress (1): 31/51 kBProgress (1): 33/51 kBProgress (1): 35/51 kBProgress (1): 37/51 kBProgress (1): 39/51 kBProgress (1): 41/51 kBProgress (1): 43/51 kBProgress (1): 45/51 kBProgress (1): 47/51 kBProgress (1): 49/51 kBProgress (1): 51/51 kBProgress (1): 51 kB                      Uploaded to apache.snapshots.https: https://repository.apache.org/content/repositories/snapshots/org/apache/struts/struts2-rest-plugin/2.6-SNAPSHOT/struts2-rest-plugin-2.6-20190209.142029-162-sources.jar (51 kB at 41 kB/s)
Uploading to apache.snapshots.https: https://repository.apache.org/content/repositories/snapshots/org/apache/struts/struts2-rest-plugin/2.6-SNAPSHOT/maven-metadata.xml
Progress (1): 1.2 kB                    Uploaded to apache.snapshots.https: https://repository.apache.org/content/repositories/snapshots/org/apache/struts/struts2-rest-plugin/2.6-SNAPSHOT/maven-metadata.xml (1.2 kB at 1.1 kB/s)
Uploading to apache.snapshots.https: https://repository.apache.org/content/repositories/snapshots/org/apache/struts/struts2-rest-plugin/2.6-SNAPSHOT/struts2-rest-plugin-2.6-20190209.142029-162-javadoc.jar
Progress (1): 2.0/176 kBProgress (1): 4.1/176 kBProgress (1): 6.1/176 kBProgress (1): 8.2/176 kBProgress (1): 10/176 kB Progress (1): 12/176 kBProgress (1): 14/176 kBProgress (1): 16/176 kBProgress (1): 18/176 kBProgress (1): 20/176 kBProgress (1): 23/176 kBProgress (1): 25/176 kBProgress (1): 27/176 kBProgress (1): 29/176 kBProgress (1): 31/176 kBProgress (1): 33/176 kBProgress (1): 35/176 kBProgress (1): 37/176 kBProgress (1): 39/176 kBProgress (1): 41/176 kBProgress (1): 43/176 kBProgress (1): 45/176 kBProgress (1): 47/176 kBProgress (1): 49/176 kBProgress (1): 51/176 kBProgress (1): 53/176 kBProgress (1): 55/176 kBProgress (1): 57/176 kBProgress (1): 59/176 kBProgress (1): 61/176 kBProgress (1): 63/176 kBProgress (1): 66/176 kBProgress (1): 68/176 kBProgress (1): 70/176 kBProgress (1): 72/176 kBProgress (1): 74/176 kBProgress (1): 76/176 kBProgress (1): 78/176 kBProgress (1): 80/176 kBProgress (1): 82/176 kBProgress (1): 84/176 kBProgress (1): 86/176 kBProgress (1): 88/176 kBProgress (1): 90/176 kBProgress (1): 92/176 kBProgress (1): 94/176 kBProgress (1): 96/176 kBProgress (1): 98/176 kBProgress (1): 100/176 kBProgress (1): 102/176 kBProgress (1): 104/176 kBProgress (1): 106/176 kBProgress (1): 109/176 kBProgress (1): 111/176 kBProgress (1): 113/176 kBProgress (1): 115/176 kBProgress (1): 117/176 kBProgress (1): 119/176 kBProgress (1): 121/176 kBProgress (1): 123/176 kBProgress (1): 125/176 kBProgress (1): 127/176 kBProgress (1): 129/176 kBProgress (1): 131/176 kBProgress (1): 133/176 kBProgress (1): 135/176 kBProgress (1): 137/176 kBProgress (1): 139/176 kBProgress (1): 141/176 kBProgress (1): 143/176 kBProgress (1): 145/176 kBProgress (1): 147/176 kBProgress (1): 150/176 kBProgress (1): 152/176 kBProgress (1): 154/176 kBProgress (1): 156/176 kBProgress (1): 158/176 kBProgress (1): 160/176 kBProgress (1): 162/176 kBProgress (1): 164/176 kBProgress (1): 166/176 kBProgress (1): 168/176 kBProgress (1): 170/176 kBProgress (1): 172/176 kBProgress (1): 174/176 kBProgress (1): 176 kB                        Uploaded to apache.snapshots.https: https://repository.apache.org/content/repositories/snapshots/org/apache/struts/struts2-rest-plugin/2.6-SNAPSHOT/struts2-rest-plugin-2.6-20190209.142029-162-javadoc.jar (176 kB at 132 kB/s)
Uploading to apache.snapshots.https: https://repository.apache.org/content/repositories/snapshots/org/apache/struts/struts2-rest-plugin/2.6-SNAPSHOT/maven-metadata.xml
Progress (1): 1.2 kB                    Uploaded to apache.snapshots.https: https://repository.apache.org/content/repositories/snapshots/org/apache/struts/struts2-rest-plugin/2.6-SNAPSHOT/maven-metadata.xml (1.2 kB at 1.1 kB/s)
Uploading to apache.snapshots.https: https://repository.apache.org/content/repositories/snapshots/org/apache/struts/struts2-rest-plugin/2.6-SNAPSHOT/struts2-rest-plugin-2.6-20190209.142029-162-sources.jar
Progress (1): 2.0/51 kBProgress (1): 4.1/51 kBProgress (1): 6.1/51 kBProgress (1): 8.2/51 kBProgress (1): 10/51 kB Progress (1): 12/51 kBProgress (1): 14/51 kBProgress (1): 16/51 kBProgress (1): 18/51 kBProgress (1): 20/51 kBProgress (1): 23/51 kBProgress (1): 25/51 kBProgress (1): 27/51 kBProgress (1): 29/51 kBProgress (1): 31/51 kBProgress (1): 33/51 kBProgress (1): 35/51 kBProgress (1): 37/51 kBProgress (1): 39/51 kBProgress (1): 41/51 kBProgress (1): 43/51 kBProgress (1): 45/51 kBProgress (1): 47/51 kBProgress (1): 49/51 kBProgress (1): 51/51 kBProgress (1): 51 kB                      Uploaded to apache.snapshots.https: https://repository.apache.org/content/repositories/snapshots/org/apache/struts/struts2-rest-plugin/2.6-SNAPSHOT/struts2-rest-plugin-2.6-20190209.142029-162-sources.jar (51 kB at 42 kB/s)
Uploading to apache.snapshots.https: https://repository.apache.org/content/repositories/snapshots/org/apache/struts/struts2-rest-plugin/2.6-SNAPSHOT/maven-metadata.xml
Progress (1): 1.2 kB                    Uploaded to apache.snapshots.https: https://repository.apache.org/content/repositories/snapshots/org/apache/struts/struts2-rest-plugin/2.6-SNAPSHOT/maven-metadata.xml (1.2 kB at 1.1 kB/s)
Uploading to apache.snapshots.https: https://repository.apache.org/content/repositories/snapshots/org/apache/struts/struts2-rest-plugin/2.6-SNAPSHOT/struts2-rest-plugin-2.6-20190209.142029-162-sources.jar
Progress (1): 2.0/51 kBProgress (1): 4.1/51 kBProgress (1): 6.1/51 kBProgress (1): 8.2/51 kBProgress (1): 10/51 kB Progress (1): 12/51 kBProgress (1): 14/51 kBProgress (1): 16/51 kBProgress (1): 18/51 kBProgress (1): 20/51 kBProgress (1): 23/51 kBProgress (1): 25/51 kBProgress (1): 27/51 kBProgress (1): 29/51 kBProgress (1): 31/51 kBProgress (1): 33/51 kBProgress (1): 35/51 kBProgress (1): 37/51 kBProgress (1): 39/51 kBProgress (1): 41/51 kBProgress (1): 43/51 kBProgress (1): 45/51 kBProgress (1): 47/51 kBProgress (1): 49/51 kBProgress (1): 51/51 kBProgress (1): 51 kB                      Uploaded to apache.snapshots.https: https://repository.apache.org/content/repositories/snapshots/org/apache/struts/struts2-rest-plugin/2.6-SNAPSHOT/struts2-rest-plugin-2.6-20190209.142029-162-sources.jar (51 kB at 42 kB/s)
Uploading to apache.snapshots.https: https://repository.apache.org/content/repositories/snapshots/org/apache/struts/struts2-rest-plugin/2.6-SNAPSHOT/maven-metadata.xml
Progress (1): 1.2 kB                    Uploaded to apache.snapshots.https: https://repository.apache.org/content/repositories/snapshots/org/apache/struts/struts2-rest-plugin/2.6-SNAPSHOT/maven-metadata.xml (1.2 kB at 1.1 kB/s)
[INFO]
[INFO] --------------< org.apache.struts:struts2-rest-showcase >---------------
[INFO] Building Struts 2 Rest Showcase Webapp 2.6-SNAPSHOT              [18/36]
[INFO] --------------------------------[ war ]---------------------------------
Downloading from central: https://repo.maven.apache.org/maven2/net/sourceforge/jwebunit/jwebunit-core/3.3/jwebunit-core-3.3.pom
Progress (1): 2.2/3.2 kBProgress (1): 3.2 kB                        Downloaded from central: https://repo.maven.apache.org/maven2/net/sourceforge/jwebunit/jwebunit-core/3.3/jwebunit-core-3.3.pom (3.2 kB at 191 kB/s)
Downloading from central: https://repo.maven.apache.org/maven2/net/sourceforge/jwebunit/jwebunit/3.3/jwebunit-3.3.pom
Progress (1): 2.2/24 kBProgress (1): 5.0/24 kBProgress (1): 7.8/24 kBProgress (1): 11/24 kB Progress (1): 13/24 kBProgress (1): 16/24 kBProgress (1): 19/24 kBProgress (1): 21/24 kBProgress (1): 24 kB                      Downloaded from central: https://repo.maven.apache.org/maven2/net/sourceforge/jwebunit/jwebunit/3.3/jwebunit-3.3.pom (24 kB at 1.5 MB/s)
Downloading from central: https://repo.maven.apache.org/maven2/net/sourceforge/jwebunit/jwebunit-htmlunit-plugin/3.3/jwebunit-htmlunit-plugin-3.3.pom
Progress (1): 2.2/2.5 kBProgress (1): 2.5 kB                        Downloaded from central: https://repo.maven.apache.org/maven2/net/sourceforge/jwebunit/jwebunit-htmlunit-plugin/3.3/jwebunit-htmlunit-plugin-3.3.pom (2.5 kB at 193 kB/s)
Downloading from central: https://repo.maven.apache.org/maven2/net/sourceforge/jwebunit/jwebunit-core/3.3/jwebunit-core-3.3.jar
Downloading from central: https://repo.maven.apache.org/maven2/net/sourceforge/jwebunit/jwebunit-htmlunit-plugin/3.3/jwebunit-htmlunit-plugin-3.3.jar
Progress (1): 2.2/67 kBProgress (1): 5.0/67 kBProgress (1): 7.7/67 kBProgress (1): 10/67 kB Progress (1): 13/67 kBProgress (1): 16/67 kBProgress (1): 19/67 kBProgress (2): 19/67 kB | 2.2/31 kBProgress (2): 21/67 kB | 2.2/31 kBProgress (2): 21/67 kB | 5.0/31 kBProgress (2): 24/67 kB | 5.0/31 kBProgress (2): 24/67 kB | 7.7/31 kBProgress (2): 27/67 kB | 7.7/31 kBProgress (2): 27/67 kB | 10/31 kB Progress (2): 30/67 kB | 10/31 kBProgress (2): 30/67 kB | 13/31 kBProgress (2): 32/67 kB | 13/31 kBProgress (2): 32/67 kB | 16/31 kBProgress (2): 32/67 kB | 19/31 kBProgress (2): 32/67 kB | 21/31 kBProgress (2): 32/67 kB | 24/31 kBProgress (2): 36/67 kB | 24/31 kBProgress (2): 36/67 kB | 27/31 kBProgress (2): 40/67 kB | 27/31 kBProgress (2): 40/67 kB | 30/31 kBProgress (2): 45/67 kB | 30/31 kBProgress (2): 45/67 kB | 31 kB   Progress (2): 49/67 kB | 31 kBProgress (2): 53/67 kB | 31 kBProgress (2): 57/67 kB | 31 kBProgress (2): 61/67 kB | 31 kBProgress (2): 65/67 kB | 31 kBProgress (2): 67 kB | 31 kB                              Downloaded from central: https://repo.maven.apache.org/maven2/net/sourceforge/jwebunit/jwebunit-htmlunit-plugin/3.3/jwebunit-htmlunit-plugin-3.3.jar (31 kB at 1.3 MB/s)
Downloaded from central: https://repo.maven.apache.org/maven2/net/sourceforge/jwebunit/jwebunit-core/3.3/jwebunit-core-3.3.jar (67 kB at 2.7 MB/s)
[INFO]
[INFO] --- maven-clean-plugin:3.1.0:clean (default-clean) @ struts2-rest-showcase ---
[INFO]
[INFO] >>> maven-source-plugin:3.0.1:jar (default-cli) > generate-sources @ struts2-rest-showcase >>>
[INFO]
[INFO] --- maven-enforcer-plugin:3.0.0-M2:enforce (enforce) @ struts2-rest-showcase ---
[INFO]
[INFO] --- maven-enforcer-plugin:3.0.0-M2:enforce (enforce-maven-version) @ struts2-rest-showcase ---
[INFO]
[INFO] <<< maven-source-plugin:3.0.1:jar (default-cli) < generate-sources @ struts2-rest-showcase <<<
[INFO]
[INFO]
[INFO] --- maven-source-plugin:3.0.1:jar (default-cli) @ struts2-rest-showcase ---
[INFO] Building jar: <https://builds.apache.org/job/Struts-master-JDK8/ws/apps/rest-showcase/target/struts2-rest-showcase-sources.jar>
[INFO]
[INFO] --- maven-javadoc-plugin:3.0.1:jar (default-cli) @ struts2-rest-showcase ---
[INFO]
Loading source files for package org.demo.rest.example...
Constructing Javadoc information...
Standard Doclet version 1.8.0_191
Building tree for all the packages and classes...
Generating <https://builds.apache.org/job/Struts-master-JDK8/ws/apps/rest-showcase/target/apidocs/org/demo/rest/example/IndexController.html...>
Generating <https://builds.apache.org/job/Struts-master-JDK8/ws/apps/rest-showcase/target/apidocs/org/demo/rest/example/Order.html...>
Generating <https://builds.apache.org/job/Struts-master-JDK8/ws/apps/rest-showcase/target/apidocs/org/demo/rest/example/OrdersController.html...>
Generating <https://builds.apache.org/job/Struts-master-JDK8/ws/apps/rest-showcase/target/apidocs/org/demo/rest/example/OrdersService.html...>
Generating <https://builds.apache.org/job/Struts-master-JDK8/ws/apps/rest-showcase/target/apidocs/org/demo/rest/example/package-frame.html...>
Generating <https://builds.apache.org/job/Struts-master-JDK8/ws/apps/rest-showcase/target/apidocs/org/demo/rest/example/package-summary.html...>
Generating <https://builds.apache.org/job/Struts-master-JDK8/ws/apps/rest-showcase/target/apidocs/org/demo/rest/example/package-tree.html...>
Generating <https://builds.apache.org/job/Struts-master-JDK8/ws/apps/rest-showcase/target/apidocs/constant-values.html...>
Generating <https://builds.apache.org/job/Struts-master-JDK8/ws/apps/rest-showcase/target/apidocs/serialized-form.html...>
Generating <https://builds.apache.org/job/Struts-master-JDK8/ws/apps/rest-showcase/target/apidocs/org/demo/rest/example/class-use/OrdersService.html...>
Generating <https://builds.apache.org/job/Struts-master-JDK8/ws/apps/rest-showcase/target/apidocs/org/demo/rest/example/class-use/Order.html...>
Generating <https://builds.apache.org/job/Struts-master-JDK8/ws/apps/rest-showcase/target/apidocs/org/demo/rest/example/class-use/IndexController.html...>
Generating <https://builds.apache.org/job/Struts-master-JDK8/ws/apps/rest-showcase/target/apidocs/org/demo/rest/example/class-use/OrdersController.html...>
Generating <https://builds.apache.org/job/Struts-master-JDK8/ws/apps/rest-showcase/target/apidocs/org/demo/rest/example/package-use.html...>
Building index for all the packages and classes...
Generating <https://builds.apache.org/job/Struts-master-JDK8/ws/apps/rest-showcase/target/apidocs/overview-tree.html...>
Generating <https://builds.apache.org/job/Struts-master-JDK8/ws/apps/rest-showcase/target/apidocs/index-all.html...>
Generating <https://builds.apache.org/job/Struts-master-JDK8/ws/apps/rest-showcase/target/apidocs/deprecated-list.html...>
Building index for all classes...
Generating <https://builds.apache.org/job/Struts-master-JDK8/ws/apps/rest-showcase/target/apidocs/allclasses-frame.html...>
Generating <https://builds.apache.org/job/Struts-master-JDK8/ws/apps/rest-showcase/target/apidocs/allclasses-noframe.html...>
Generating <https://builds.apache.org/job/Struts-master-JDK8/ws/apps/rest-showcase/target/apidocs/index.html...>
Generating <https://builds.apache.org/job/Struts-master-JDK8/ws/apps/rest-showcase/target/apidocs/help-doc.html...>
[INFO] Building jar: <https://builds.apache.org/job/Struts-master-JDK8/ws/apps/rest-showcase/target/struts2-rest-showcase-javadoc.jar>
[INFO]
[INFO] --- maven-enforcer-plugin:3.0.0-M2:enforce (enforce) @ struts2-rest-showcase ---
[INFO]
[INFO] --- maven-enforcer-plugin:3.0.0-M2:enforce (enforce-maven-version) @ struts2-rest-showcase ---
[INFO]
[INFO] --- maven-antrun-plugin:1.8:run (copy-sources) @ struts2-rest-showcase ---
[INFO] Executing tasks

main:
     [copy] Copying 4 files to <https://builds.apache.org/job/Struts-master-JDK8/ws/apps/rest-showcase/target/struts2-rest-showcase/WEB-INF/src/java>
     [copy] Copying 3 files to <https://builds.apache.org/job/Struts-master-JDK8/ws/apps/rest-showcase/target/struts2-rest-showcase/WEB-INF/src/java>
[INFO] Executed tasks
[INFO]
[INFO] --- maven-remote-resources-plugin:1.5:process (process-resource-bundles) @ struts2-rest-showcase ---
[INFO]
[INFO] --- maven-resources-plugin:3.1.0:resources (default-resources) @ struts2-rest-showcase ---
[INFO] Using 'UTF-8' encoding to copy filtered resources.
[INFO] Copying 3 resources
[INFO] Copying 3 resources
[INFO]
[INFO] --- maven-compiler-plugin:3.7.0:compile (default-compile) @ struts2-rest-showcase ---
[INFO] Changes detected - recompiling the module!
[INFO] Compiling 4 source files to <https://builds.apache.org/job/Struts-master-JDK8/ws/apps/rest-showcase/target/classes>
[INFO]
[INFO] --- maven-bundle-plugin:3.5.0:manifest (bundle-manifest) @ struts2-rest-showcase ---
[WARNING] Ignoring project type war - supportedProjectTypes = [jar, bundle]
[INFO]
[INFO] --- maven-resources-plugin:3.1.0:testResources (default-testResources) @ struts2-rest-showcase ---
[INFO] Using 'UTF-8' encoding to copy filtered resources.
[INFO] skip non existing resourceDirectory <https://builds.apache.org/job/Struts-master-JDK8/ws/apps/rest-showcase/src/test/resources>
[INFO] Copying 3 resources
[INFO]
[INFO] --- maven-compiler-plugin:3.7.0:testCompile (default-testCompile) @ struts2-rest-showcase ---
[INFO] Changes detected - recompiling the module!
[INFO] Compiling 4 source files to <https://builds.apache.org/job/Struts-master-JDK8/ws/apps/rest-showcase/target/test-classes>
[INFO] -------------------------------------------------------------
[ERROR] COMPILATION ERROR :
[INFO] -------------------------------------------------------------
[ERROR] <https://builds.apache.org/job/Struts-master-JDK8/ws/apps/rest-showcase/src/test/java/it/org/apache/struts2/rest/example/PostOrderTest.java>:[22,37] package org.apache.commons.httpclient does not exist
[ERROR] <https://builds.apache.org/job/Struts-master-JDK8/ws/apps/rest-showcase/src/test/java/it/org/apache/struts2/rest/example/PostOrderTest.java>:[23,45] package org.apache.commons.httpclient.methods does not exist
[ERROR] <https://builds.apache.org/job/Struts-master-JDK8/ws/apps/rest-showcase/src/test/java/it/org/apache/struts2/rest/example/PostOrderTest.java>:[24,45] package org.apache.commons.httpclient.methods does not exist
[INFO] 3 errors
[INFO] -------------------------------------------------------------
[INFO] ------------------------------------------------------------------------
[INFO] Reactor Summary for Struts 2 2.6-SNAPSHOT:
[INFO]
[INFO] Struts 2 Bill of Materials ......................... SUCCESS [  8.324 s]
[INFO] Struts 2 ........................................... SUCCESS [ 11.325 s]
[INFO] Struts 2 Core ...................................... SUCCESS [02:44 min]
[INFO] Struts 2 Plugins ................................... SUCCESS [  9.751 s]
[INFO] Struts 2 Configuration Browser Plugin .............. SUCCESS [ 18.043 s]
[INFO] Struts 2 Sitemesh Plugin ........................... SUCCESS [ 18.871 s]
[INFO] Struts 2 Tiles Plugin .............................. SUCCESS [ 20.021 s]
[INFO] Struts 2 DWR Plugin ................................ SUCCESS [ 17.106 s]
[INFO] Struts 2 Spring Plugin ............................. SUCCESS [ 19.892 s]
[INFO] Struts 2 Convention Plugin ......................... SUCCESS [ 24.954 s]
[INFO] Struts 2 JUnit Plugin .............................. SUCCESS [ 23.383 s]
[INFO] Struts 2 JSON Plugin ............................... SUCCESS [ 26.319 s]
[INFO] Struts 2 Bean Validation Plugin .................... SUCCESS [ 21.123 s]
[INFO] Struts 2 Async Plugin .............................. SUCCESS [ 18.750 s]
[INFO] Struts 2 Webapps ................................... SUCCESS [  5.397 s]
[INFO] Struts 2 Showcase Webapp ........................... SUCCESS [01:38 min]
[INFO] Struts 2 REST Plugin ............................... SUCCESS [ 23.382 s]
[INFO] Struts 2 Rest Showcase Webapp ...................... FAILURE [  2.521 s]
[INFO] Struts 2 CDI Plugin ................................ SKIPPED
[INFO] DEPRECATED: Struts 2 Embedded JSP Plugin ........... SKIPPED
[INFO] Struts 2 GXP Plugin ................................ SKIPPED
[INFO] Struts 2 Jasper Reports Plugin ..................... SKIPPED
[INFO] Struts 2 Java Templates Plugin ..................... SKIPPED
[INFO] Struts 2 JFreeChart Plugin ......................... SKIPPED
[INFO] Struts 2 OSGi Plugin ............................... SKIPPED
[INFO] Struts 2 OVal Plugin ............................... SKIPPED
[INFO] Struts 2 Pell Multipart Plugin ..................... SKIPPED
[INFO] Struts 2 Plexus Plugin ............................. SKIPPED
[INFO] Struts 2 Portlet Plugin ............................ SKIPPED
[INFO] Struts 2 Portlet Tiles Plugin ...................... SKIPPED
[INFO] DEPRECATED: Struts 2 Sitegraph Plugin .............. SKIPPED
[INFO] Struts 2 TestNG Plugin ............................. SKIPPED
[INFO] Struts 2 OSGi Bundles .............................. SKIPPED
[INFO] Struts 2 OSGi Admin Bundle ......................... SKIPPED
[INFO] Struts 2 OSGi Demo Bundle .......................... SKIPPED
[INFO] Struts 2 Assembly .................................. SKIPPED
[INFO] ------------------------------------------------------------------------
[INFO] BUILD FAILURE
[INFO] ------------------------------------------------------------------------
[INFO] Total time:  08:55 min
[INFO] Finished at: 2019-02-09T14:20:46Z
[INFO] ------------------------------------------------------------------------
[ERROR] Failed to execute goal org.apache.maven.plugins:maven-compiler-plugin:3.7.0:testCompile (default-testCompile) on project struts2-rest-showcase: Compilation failure: Compilation failure:
[ERROR] <https://builds.apache.org/job/Struts-master-JDK8/ws/apps/rest-showcase/src/test/java/it/org/apache/struts2/rest/example/PostOrderTest.java>:[22,37] package org.apache.commons.httpclient does not exist
[ERROR] <https://builds.apache.org/job/Struts-master-JDK8/ws/apps/rest-showcase/src/test/java/it/org/apache/struts2/rest/example/PostOrderTest.java>:[23,45] package org.apache.commons.httpclient.methods does not exist
[ERROR] <https://builds.apache.org/job/Struts-master-JDK8/ws/apps/rest-showcase/src/test/java/it/org/apache/struts2/rest/example/PostOrderTest.java>:[24,45] package org.apache.commons.httpclient.methods does not exist
[ERROR] -> [Help 1]
[ERROR]
[ERROR] To see the full stack trace of the errors, re-run Maven with the -e switch.
[ERROR] Re-run Maven using the -X switch to enable full debug logging.
[ERROR]
[ERROR] For more information about the errors and possible solutions, please read the following articles:
[ERROR] [Help 1] http://cwiki.apache.org/confluence/display/MAVEN/MojoFailureException
[ERROR]
[ERROR] After correcting the problems, you can resume the build with the command
[ERROR]   mvn <goals> -rf :struts2-rest-showcase
Build step 'Execute shell' marked build as failure
[locks-and-latches] Releasing all the locks
[locks-and-latches] All the locks released
Setting MAVEN_3_LATEST__HOME=/home/jenkins/tools/maven/latest3/

---------------------------------------------------------------------
To unsubscribe, e-mail: [hidden email]
For additional commands, e-mail: [hidden email]

Reply | Threaded
Open this post in threaded view
|

Jenkins build is back to normal : Struts-master-JDK8 #238

Apache Jenkins Server-2
See <https://builds.apache.org/job/Struts-master-JDK8/238/display/redirect?page=changes>


---------------------------------------------------------------------
To unsubscribe, e-mail: [hidden email]
For additional commands, e-mail: [hidden email]