Build failed in Jenkins: Struts-master-JDK8 #102

classic Classic list List threaded Threaded
3 messages Options
Reply | Threaded
Open this post in threaded view
|

Build failed in Jenkins: Struts-master-JDK8 #102

Apache Jenkins Server-2
See <https://builds.apache.org/job/Struts-master-JDK8/102/display/redirect?page=changes>

Changes:

[lukaszlenart] Adds Jackson XML binding dependency

[lukaszlenart] Defines a new handler using Jackson XML

[lukaszlenart] Adds test to cover basic functionality

[lukaszlenart] Adds example how to use the handler

[lukaszlenart] Adds explanation how to use the commented configuration

------------------------------------------
[...truncated 1.57 MB...]
Generating <https://builds.apache.org/job/Struts-master-JDK8/ws/apps/showcase/target/apidocs/org/apache/struts2/showcase/ajax/tree/class-use/GetCategory.html...>
Generating <https://builds.apache.org/job/Struts-master-JDK8/ws/apps/showcase/target/apidocs/org/apache/struts2/showcase/actionchaining/class-use/ActionChain3.html...>
Generating <https://builds.apache.org/job/Struts-master-JDK8/ws/apps/showcase/target/apidocs/org/apache/struts2/showcase/actionchaining/class-use/ActionChain1.html...>
Generating <https://builds.apache.org/job/Struts-master-JDK8/ws/apps/showcase/target/apidocs/org/apache/struts2/showcase/actionchaining/class-use/ActionChain2.html...>
Generating <https://builds.apache.org/job/Struts-master-JDK8/ws/apps/showcase/target/apidocs/org/apache/struts2/showcase/freemarker/class-use/StandardTagsAction.html...>
Generating <https://builds.apache.org/job/Struts-master-JDK8/ws/apps/showcase/target/apidocs/org/apache/struts2/showcase/freemarker/class-use/CustomFreemarkerManagerUtil.html...>
Generating <https://builds.apache.org/job/Struts-master-JDK8/ws/apps/showcase/target/apidocs/org/apache/struts2/showcase/freemarker/class-use/CustomFreemarkerManager.html...>
Generating <https://builds.apache.org/job/Struts-master-JDK8/ws/apps/showcase/target/apidocs/org/apache/struts2/showcase/hangman/class-use/Hangman.html...>
Generating <https://builds.apache.org/job/Struts-master-JDK8/ws/apps/showcase/target/apidocs/org/apache/struts2/showcase/hangman/class-use/HangmanException.html...>
Generating <https://builds.apache.org/job/Struts-master-JDK8/ws/apps/showcase/target/apidocs/org/apache/struts2/showcase/hangman/class-use/VocabSource.html...>
Generating <https://builds.apache.org/job/Struts-master-JDK8/ws/apps/showcase/target/apidocs/org/apache/struts2/showcase/hangman/class-use/GetUpdatedHangmanAction.html...>
Generating <https://builds.apache.org/job/Struts-master-JDK8/ws/apps/showcase/target/apidocs/org/apache/struts2/showcase/hangman/class-use/GuessCharacterAction.html...>
Generating <https://builds.apache.org/job/Struts-master-JDK8/ws/apps/showcase/target/apidocs/org/apache/struts2/showcase/hangman/class-use/HangmanConstants.html...>
Generating <https://builds.apache.org/job/Struts-master-JDK8/ws/apps/showcase/target/apidocs/org/apache/struts2/showcase/hangman/class-use/Vocab.html...>
Generating <https://builds.apache.org/job/Struts-master-JDK8/ws/apps/showcase/target/apidocs/org/apache/struts2/showcase/hangman/class-use/StartHangmanAction.html...>
Generating <https://builds.apache.org/job/Struts-master-JDK8/ws/apps/showcase/target/apidocs/org/apache/struts2/showcase/hangman/class-use/HangmanService.html...>
Generating <https://builds.apache.org/job/Struts-master-JDK8/ws/apps/showcase/target/apidocs/org/apache/struts2/showcase/hangman/class-use/PropertiesVocabSource.html...>
Generating <https://builds.apache.org/job/Struts-master-JDK8/ws/apps/showcase/target/apidocs/org/apache/struts2/showcase/chat/class-use/ChatException.html...>
Generating <https://builds.apache.org/job/Struts-master-JDK8/ws/apps/showcase/target/apidocs/org/apache/struts2/showcase/chat/class-use/ChatException.ErrorType.html...>
Generating <https://builds.apache.org/job/Struts-master-JDK8/ws/apps/showcase/target/apidocs/org/apache/struts2/showcase/chat/class-use/SendMessageToRoomAction.html...>
Generating <https://builds.apache.org/job/Struts-master-JDK8/ws/apps/showcase/target/apidocs/org/apache/struts2/showcase/chat/class-use/RoomsAvailableAction.html...>
Generating <https://builds.apache.org/job/Struts-master-JDK8/ws/apps/showcase/target/apidocs/org/apache/struts2/showcase/chat/class-use/EnterRoomAction.html...>
Generating <https://builds.apache.org/job/Struts-master-JDK8/ws/apps/showcase/target/apidocs/org/apache/struts2/showcase/chat/class-use/MessagesAvailableInRoomAction.html...>
Generating <https://builds.apache.org/job/Struts-master-JDK8/ws/apps/showcase/target/apidocs/org/apache/struts2/showcase/chat/class-use/ChatLoginAction.html...>
Generating <https://builds.apache.org/job/Struts-master-JDK8/ws/apps/showcase/target/apidocs/org/apache/struts2/showcase/chat/class-use/UsersAvailableInRoomAction.html...>
Generating <https://builds.apache.org/job/Struts-master-JDK8/ws/apps/showcase/target/apidocs/org/apache/struts2/showcase/chat/class-use/DateConverter.html...>
Generating <https://builds.apache.org/job/Struts-master-JDK8/ws/apps/showcase/target/apidocs/org/apache/struts2/showcase/chat/class-use/ChatMessage.html...>
Generating <https://builds.apache.org/job/Struts-master-JDK8/ws/apps/showcase/target/apidocs/org/apache/struts2/showcase/chat/class-use/ExitRoomAction.html...>
Generating <https://builds.apache.org/job/Struts-master-JDK8/ws/apps/showcase/target/apidocs/org/apache/struts2/showcase/chat/class-use/Room.html...>
Generating <https://builds.apache.org/job/Struts-master-JDK8/ws/apps/showcase/target/apidocs/org/apache/struts2/showcase/chat/class-use/ChatLogoutAction.html...>
Generating <https://builds.apache.org/job/Struts-master-JDK8/ws/apps/showcase/target/apidocs/org/apache/struts2/showcase/chat/class-use/UsersAvailableAction.html...>
Generating <https://builds.apache.org/job/Struts-master-JDK8/ws/apps/showcase/target/apidocs/org/apache/struts2/showcase/chat/class-use/ChatServiceImpl.html...>
Generating <https://builds.apache.org/job/Struts-master-JDK8/ws/apps/showcase/target/apidocs/org/apache/struts2/showcase/chat/class-use/ChatSessionListener.html...>
Generating <https://builds.apache.org/job/Struts-master-JDK8/ws/apps/showcase/target/apidocs/org/apache/struts2/showcase/chat/class-use/ChatInterceptor.html...>
Generating <https://builds.apache.org/job/Struts-master-JDK8/ws/apps/showcase/target/apidocs/org/apache/struts2/showcase/chat/class-use/ChatService.html...>
Generating <https://builds.apache.org/job/Struts-master-JDK8/ws/apps/showcase/target/apidocs/org/apache/struts2/showcase/chat/class-use/User.html...>
Generating <https://builds.apache.org/job/Struts-master-JDK8/ws/apps/showcase/target/apidocs/org/apache/struts2/showcase/chat/class-use/CrudRoomAction.html...>
Generating <https://builds.apache.org/job/Struts-master-JDK8/ws/apps/showcase/target/apidocs/org/apache/struts2/showcase/chat/class-use/Constants.html...>
Generating <https://builds.apache.org/job/Struts-master-JDK8/ws/apps/showcase/target/apidocs/org/apache/struts2/showcase/chat/class-use/ChatAuthenticationInterceptor.html...>
Generating <https://builds.apache.org/job/Struts-master-JDK8/ws/apps/showcase/target/apidocs/org/apache/struts2/showcase/model/class-use/IdEntity.html...>
Generating <https://builds.apache.org/job/Struts-master-JDK8/ws/apps/showcase/target/apidocs/org/apache/struts2/showcase/model/class-use/Employee.html...>
Generating <https://builds.apache.org/job/Struts-master-JDK8/ws/apps/showcase/target/apidocs/org/apache/struts2/showcase/model/class-use/Skill.html...>
Generating <https://builds.apache.org/job/Struts-master-JDK8/ws/apps/showcase/target/apidocs/org/apache/struts2/showcase/application/class-use/TestDataProvider.html...>
Generating <https://builds.apache.org/job/Struts-master-JDK8/ws/apps/showcase/target/apidocs/org/apache/struts2/showcase/application/class-use/MemoryStorage.html...>
Generating <https://builds.apache.org/job/Struts-master-JDK8/ws/apps/showcase/target/apidocs/org/apache/struts2/showcase/application/class-use/Storage.html...>
Generating <https://builds.apache.org/job/Struts-master-JDK8/ws/apps/showcase/target/apidocs/org/apache/struts2/showcase/xslt/class-use/JVMAction.html...>
Generating <https://builds.apache.org/job/Struts-master-JDK8/ws/apps/showcase/target/apidocs/org/apache/struts2/showcase/xslt/class-use/JVMAction.ImportantInfo.html...>
Generating <https://builds.apache.org/job/Struts-master-JDK8/ws/apps/showcase/target/apidocs/org/apache/struts2/showcase/package-use.html...>
Generating <https://builds.apache.org/job/Struts-master-JDK8/ws/apps/showcase/target/apidocs/org/apache/struts2/showcase/action/package-use.html...>
Generating <https://builds.apache.org/job/Struts-master-JDK8/ws/apps/showcase/target/apidocs/org/apache/struts2/showcase/actionchaining/package-use.html...>
Generating <https://builds.apache.org/job/Struts-master-JDK8/ws/apps/showcase/target/apidocs/org/apache/struts2/showcase/ajax/package-use.html...>
Generating <https://builds.apache.org/job/Struts-master-JDK8/ws/apps/showcase/target/apidocs/org/apache/struts2/showcase/ajax/tree/package-use.html...>
Generating <https://builds.apache.org/job/Struts-master-JDK8/ws/apps/showcase/target/apidocs/org/apache/struts2/showcase/application/package-use.html...>
Generating <https://builds.apache.org/job/Struts-master-JDK8/ws/apps/showcase/target/apidocs/org/apache/struts2/showcase/chat/package-use.html...>
Generating <https://builds.apache.org/job/Struts-master-JDK8/ws/apps/showcase/target/apidocs/org/apache/struts2/showcase/conversion/package-use.html...>
Generating <https://builds.apache.org/job/Struts-master-JDK8/ws/apps/showcase/target/apidocs/org/apache/struts2/showcase/dao/package-use.html...>
Generating <https://builds.apache.org/job/Struts-master-JDK8/ws/apps/showcase/target/apidocs/org/apache/struts2/showcase/exception/package-use.html...>
Generating <https://builds.apache.org/job/Struts-master-JDK8/ws/apps/showcase/target/apidocs/org/apache/struts2/showcase/filedownload/package-use.html...>
Generating <https://builds.apache.org/job/Struts-master-JDK8/ws/apps/showcase/target/apidocs/org/apache/struts2/showcase/fileupload/package-use.html...>
Generating <https://builds.apache.org/job/Struts-master-JDK8/ws/apps/showcase/target/apidocs/org/apache/struts2/showcase/freemarker/package-use.html...>
Generating <https://builds.apache.org/job/Struts-master-JDK8/ws/apps/showcase/target/apidocs/org/apache/struts2/showcase/hangman/package-use.html...>
Generating <https://builds.apache.org/job/Struts-master-JDK8/ws/apps/showcase/target/apidocs/org/apache/struts2/showcase/model/package-use.html...>
Generating <https://builds.apache.org/job/Struts-master-JDK8/ws/apps/showcase/target/apidocs/org/apache/struts2/showcase/modelDriven/package-use.html...>
Generating <https://builds.apache.org/job/Struts-master-JDK8/ws/apps/showcase/target/apidocs/org/apache/struts2/showcase/person/package-use.html...>
Generating <https://builds.apache.org/job/Struts-master-JDK8/ws/apps/showcase/target/apidocs/org/apache/struts2/showcase/source/package-use.html...>
Generating <https://builds.apache.org/job/Struts-master-JDK8/ws/apps/showcase/target/apidocs/org/apache/struts2/showcase/tag/nonui/actionPrefix/package-use.html...>
Generating <https://builds.apache.org/job/Struts-master-JDK8/ws/apps/showcase/target/apidocs/org/apache/struts2/showcase/tag/nonui/actiontag/package-use.html...>
Generating <https://builds.apache.org/job/Struts-master-JDK8/ws/apps/showcase/target/apidocs/org/apache/struts2/showcase/tag/nonui/debugtag/package-use.html...>
Generating <https://builds.apache.org/job/Struts-master-JDK8/ws/apps/showcase/target/apidocs/org/apache/struts2/showcase/tag/nonui/iteratortag/package-use.html...>
Generating <https://builds.apache.org/job/Struts-master-JDK8/ws/apps/showcase/target/apidocs/org/apache/struts2/showcase/tiles/package-use.html...>
Generating <https://builds.apache.org/job/Struts-master-JDK8/ws/apps/showcase/target/apidocs/org/apache/struts2/showcase/token/package-use.html...>
Generating <https://builds.apache.org/job/Struts-master-JDK8/ws/apps/showcase/target/apidocs/org/apache/struts2/showcase/validation/package-use.html...>
Generating <https://builds.apache.org/job/Struts-master-JDK8/ws/apps/showcase/target/apidocs/org/apache/struts2/showcase/wait/package-use.html...>
Generating <https://builds.apache.org/job/Struts-master-JDK8/ws/apps/showcase/target/apidocs/org/apache/struts2/showcase/xslt/package-use.html...>
Building index for all the packages and classes...
Generating <https://builds.apache.org/job/Struts-master-JDK8/ws/apps/showcase/target/apidocs/overview-tree.html...>
Generating <https://builds.apache.org/job/Struts-master-JDK8/ws/apps/showcase/target/apidocs/index-all.html...>
Generating <https://builds.apache.org/job/Struts-master-JDK8/ws/apps/showcase/target/apidocs/deprecated-list.html...>
Building index for all classes...
Generating <https://builds.apache.org/job/Struts-master-JDK8/ws/apps/showcase/target/apidocs/allclasses-frame.html...>
Generating <https://builds.apache.org/job/Struts-master-JDK8/ws/apps/showcase/target/apidocs/allclasses-noframe.html...>
Generating <https://builds.apache.org/job/Struts-master-JDK8/ws/apps/showcase/target/apidocs/index.html...>
Generating <https://builds.apache.org/job/Struts-master-JDK8/ws/apps/showcase/target/apidocs/overview-summary.html...>
Generating <https://builds.apache.org/job/Struts-master-JDK8/ws/apps/showcase/target/apidocs/help-doc.html...>
[INFO] Building jar: <https://builds.apache.org/job/Struts-master-JDK8/ws/apps/showcase/target/struts2-showcase-javadoc.jar>
[INFO]
[INFO] --- maven-antrun-plugin:1.8:run (copy-sources) @ struts2-showcase ---
[INFO] Executing tasks

main:
     [copy] Copying 113 files to <https://builds.apache.org/job/Struts-master-JDK8/ws/apps/showcase/target/struts2-showcase/WEB-INF/src/java>
     [copy] Copying 59 files to <https://builds.apache.org/job/Struts-master-JDK8/ws/apps/showcase/target/struts2-showcase/WEB-INF/src/java>
[INFO] Executed tasks
[INFO]
[INFO] --- maven-remote-resources-plugin:1.5:process (process-resource-bundles) @ struts2-showcase ---
[INFO]
[INFO] --- maven-resources-plugin:2.7:resources (default-resources) @ struts2-showcase ---
[INFO] Using 'UTF-8' encoding to copy filtered resources.
[INFO] Copying 59 resources
[INFO] Copying 113 resources
[INFO] Copying 3 resources
[INFO]
[INFO] --- maven-compiler-plugin:3.5.1:compile (default-compile) @ struts2-showcase ---
[INFO] Changes detected - recompiling the module!
[INFO] Compiling 113 source files to <https://builds.apache.org/job/Struts-master-JDK8/ws/apps/showcase/target/classes>
[INFO] <https://builds.apache.org/job/Struts-master-JDK8/ws/apps/showcase/src/main/java/org/apache/struts2/showcase/model/Skill.java>: <https://builds.apache.org/job/Struts-master-JDK8/ws/apps/showcase/src/main/java/org/apache/struts2/showcase/model/Skill.java> uses or overrides a deprecated API.
[INFO] <https://builds.apache.org/job/Struts-master-JDK8/ws/apps/showcase/src/main/java/org/apache/struts2/showcase/model/Skill.java>: Recompile with -Xlint:deprecation for details.
[INFO] <https://builds.apache.org/job/Struts-master-JDK8/ws/apps/showcase/src/main/java/org/apache/struts2/showcase/source/ViewSourceAction.java>: Some input files use unchecked or unsafe operations.
[INFO] <https://builds.apache.org/job/Struts-master-JDK8/ws/apps/showcase/src/main/java/org/apache/struts2/showcase/source/ViewSourceAction.java>: Recompile with -Xlint:unchecked for details.
[INFO]
[INFO] --- maven-bundle-plugin:2.1.0:manifest (bundle-manifest) @ struts2-showcase ---
[WARNING] Ignoring project type war - supportedProjectTypes = [jar, bundle]
[INFO]
[INFO] --- maven-resources-plugin:2.7:testResources (default-testResources) @ struts2-showcase ---
[INFO] Using 'UTF-8' encoding to copy filtered resources.
[INFO] skip non existing resourceDirectory <https://builds.apache.org/job/Struts-master-JDK8/ws/apps/showcase/src/test/resources>
[INFO] Copying 3 resources
[INFO]
[INFO] --- maven-compiler-plugin:3.5.1:testCompile (default-testCompile) @ struts2-showcase ---
[INFO] Changes detected - recompiling the module!
[INFO] Compiling 14 source files to <https://builds.apache.org/job/Struts-master-JDK8/ws/apps/showcase/target/test-classes>
[INFO] <https://builds.apache.org/job/Struts-master-JDK8/ws/apps/showcase/src/test/java/org/apache/struts2/showcase/filedownload/FileDownloadActionTest.java>: <https://builds.apache.org/job/Struts-master-JDK8/ws/apps/showcase/src/test/java/org/apache/struts2/showcase/filedownload/FileDownloadActionTest.java> uses or overrides a deprecated API.
[INFO] <https://builds.apache.org/job/Struts-master-JDK8/ws/apps/showcase/src/test/java/org/apache/struts2/showcase/filedownload/FileDownloadActionTest.java>: Recompile with -Xlint:deprecation for details.
[INFO]
[INFO] --- maven-surefire-plugin:2.20.1:test (default-test) @ struts2-showcase ---
[INFO]
[INFO] -------------------------------------------------------
[INFO]  T E S T S
[INFO] -------------------------------------------------------
[INFO] Running org.apache.struts2.showcase.filedownload.FileDownloadActionTest
[INFO] Tests run: 5, Failures: 0, Errors: 0, Skipped: 0, Time elapsed: 0.106 s - in org.apache.struts2.showcase.filedownload.FileDownloadActionTest
[INFO]
[INFO] Results:
[INFO]
[INFO] Tests run: 5, Failures: 0, Errors: 0, Skipped: 0
[INFO]
[INFO]
[INFO] --- apache-rat-plugin:0.11:check (default) @ struts2-showcase ---
[INFO] 51 implicit excludes (use -debug for more details).
[INFO] Exclude: src/main/resources/org/apache/struts2/static/domTT.js
[INFO] Exclude: src/site/resources/tags/**/*.html
[INFO] Exclude: src/main/resources/*LICENSE.txt
[INFO] Exclude: src/test/resources/**/*.txt
[INFO] Exclude: src/main/webapp/**/*.css
[INFO] Exclude: src/main/webapp/**/*.map
[INFO] Exclude: src/main/webapp/**/*.js
[INFO] Exclude: src/main/webapp/**/*.svg
[INFO] Exclude: src/main/webapp/**/*.txt
[INFO] Exclude: src/main/resources/**/sitegraph-usage.txt
[INFO] Exclude: src/main/resources/**/docs-urls.txt
[INFO] Exclude: src/etc/header.txt
[INFO] Exclude: src/main/resources/static/css/**/*.css
[INFO] Exclude: src/main/resources/static/js/**/*.js
[INFO] Exclude: src/main/resources/docs.cfg
[INFO] Exclude: src/main/webapp/fonts/**/*
[INFO] 367 resources included (use -debug for more details)
[INFO] Rat check: Summary of files. Unapproved: 0 unknown: 0 generated: 0 approved: 308 licence.
[INFO]
[INFO] --- maven-war-plugin:2.1:war (default-war) @ struts2-showcase ---
[INFO] Packaging webapp
[INFO] Assembling webapp [struts2-showcase] in [<https://builds.apache.org/job/Struts-master-JDK8/ws/apps/showcase/target/struts2-showcase]>
[INFO] Processing war project
[INFO] Copying webapp webResources [<https://builds.apache.org/job/Struts-master-JDK8/ws/apps/showcase/src/main/resources]> to [<https://builds.apache.org/job/Struts-master-JDK8/ws/apps/showcase/target/struts2-showcase]>
[INFO] Copying webapp resources [<https://builds.apache.org/job/Struts-master-JDK8/ws/apps/showcase/src/main/webapp]>
[INFO] Webapp assembled in [428 msecs]
[INFO] Building war: <https://builds.apache.org/job/Struts-master-JDK8/ws/apps/showcase/target/struts2-showcase.war>
[INFO] WEB-INF/web.xml already added, skipping
[INFO]
[INFO] >>> maven-source-plugin:3.0.0:jar (attach-sources) > generate-sources @ struts2-showcase >>>
[INFO]
[INFO] <<< maven-source-plugin:3.0.0:jar (attach-sources) < generate-sources @ struts2-showcase <<<
[INFO]
[INFO]
[INFO] --- maven-source-plugin:3.0.0:jar (attach-sources) @ struts2-showcase ---
[INFO] Building jar: <https://builds.apache.org/job/Struts-master-JDK8/ws/apps/showcase/target/struts2-showcase-sources.jar>
[INFO]
[INFO] --- maven-site-plugin:3.5.1:attach-descriptor (attach-descriptor) @ struts2-showcase ---
[INFO]
[INFO] ------------------------------------------------------------------------
[INFO] Building Struts 2 REST Plugin 2.6-SNAPSHOT
[INFO] ------------------------------------------------------------------------
Downloading from central: https://repo.maven.apache.org/maven2/com/fasterxml/jackson/core/jackson-core/2.9.4/jackson-core-2.9.4.pom
Progress (1): 2.8/3.4 kBProgress (1): 3.4 kB                        Downloaded from central: https://repo.maven.apache.org/maven2/com/fasterxml/jackson/core/jackson-core/2.9.4/jackson-core-2.9.4.pom (3.4 kB at 9.5 kB/s)
Downloading from central: https://repo.maven.apache.org/maven2/com/fasterxml/jackson/jackson-base/2.9.4/jackson-base-2.9.4.pom
Progress (1): 2.8/5.6 kBProgress (1): 5.5/5.6 kBProgress (1): 5.6 kB                        Downloaded from central: https://repo.maven.apache.org/maven2/com/fasterxml/jackson/jackson-base/2.9.4/jackson-base-2.9.4.pom (5.6 kB at 295 kB/s)
Downloading from central: https://repo.maven.apache.org/maven2/com/fasterxml/jackson/jackson-bom/2.9.4/jackson-bom-2.9.4.pom
Progress (1): 2.8/12 kBProgress (1): 5.5/12 kBProgress (1): 8.3/12 kBProgress (1): 11/12 kB Progress (1): 12 kB                      Downloaded from central: https://repo.maven.apache.org/maven2/com/fasterxml/jackson/jackson-bom/2.9.4/jackson-bom-2.9.4.pom (12 kB at 559 kB/s)
Downloading from central: https://repo.maven.apache.org/maven2/com/fasterxml/jackson/core/jackson-databind/2.9.4/jackson-databind-2.9.4.pom
Progress (1): 2.8/5.9 kBProgress (1): 5.5/5.9 kBProgress (1): 5.9 kB                        Downloaded from central: https://repo.maven.apache.org/maven2/com/fasterxml/jackson/core/jackson-databind/2.9.4/jackson-databind-2.9.4.pom (5.9 kB at 345 kB/s)
Downloading from central: https://repo.maven.apache.org/maven2/com/fasterxml/jackson/dataformat/jackson-dataformat-xml/2.9.4/jackson-dataformat-xml-2.9.4.pom
[WARNING] Failed to create parent directories for tracking file /home/jenkins/.m2/repository/com/fasterxml/jackson/dataformat/jackson-dataformat-xml/2.9.4/jackson-dataformat-xml-2.9.4.pom.lastUpdated
[INFO] ------------------------------------------------------------------------
[INFO] Reactor Summary:
[INFO]
[INFO] Struts 2 Bill of Materials ......................... SUCCESS [  2.591 s]
[INFO] Struts 2 ........................................... SUCCESS [  2.913 s]
[INFO] Struts 2 Core ...................................... SUCCESS [02:16 min]
[INFO] Struts Plugins ..................................... SUCCESS [  0.222 s]
[INFO] Struts 2 Configuration Browser Plugin .............. SUCCESS [  2.989 s]
[INFO] Struts 2 Sitemesh Plugin ........................... SUCCESS [  2.775 s]
[INFO] Struts 2 Tiles Plugin .............................. SUCCESS [  5.146 s]
[INFO] Struts 2 DWR Plugin ................................ SUCCESS [  2.212 s]
[INFO] Struts 2 Spring Plugin ............................. SUCCESS [  4.384 s]
[INFO] Struts 2 Convention Plugin ......................... SUCCESS [  8.622 s]
[INFO] Struts 2 JUnit Plugin .............................. SUCCESS [  8.767 s]
[INFO] Struts 2 JSON Plugin ............................... SUCCESS [ 11.043 s]
[INFO] Struts 2 Bean Validation Plugin .................... SUCCESS [  5.682 s]
[INFO] Struts 2 Webapps ................................... SUCCESS [  0.650 s]
[INFO] Struts 2 Showcase Webapp ........................... SUCCESS [ 12.851 s]
[INFO] Struts 2 REST Plugin ............................... FAILURE [  1.171 s]
[INFO] Struts 2 Rest Showcase Webapp ...................... SKIPPED
[INFO] Struts 2 CDI Plugin ................................ SKIPPED
[INFO] Struts 2 Embedded JSP Plugin ....................... SKIPPED
[INFO] Struts 2 GXP Plugin ................................ SKIPPED
[INFO] Struts 2 Jasper Reports Plugin ..................... SKIPPED
[INFO] Struts 2 Java Templates Plugin ..................... SKIPPED
[INFO] Struts 2 JFreeChart Plugin ......................... SKIPPED
[INFO] Struts 2 OSGi Plugin ............................... SKIPPED
[INFO] Struts 2 OVal Plugin ............................... SKIPPED
[INFO] Struts 2 Pell Multipart Plugin ..................... SKIPPED
[INFO] Struts 2 Plexus Plugin ............................. SKIPPED
[INFO] Struts 2 Portlet Plugin ............................ SKIPPED
[INFO] Struts 2 Portlet Tiles Plugin ...................... SKIPPED
[INFO] DEPRECATED: Struts 2 Sitegraph Plugin .............. SKIPPED
[INFO] Struts 2 TestNG Plugin ............................. SKIPPED
[INFO] Struts OSGi Bundles ................................ SKIPPED
[INFO] Struts 2 OSGi Admin Bundle ......................... SKIPPED
[INFO] Struts 2 OSGi Demo Bundle .......................... SKIPPED
[INFO] ------------------------------------------------------------------------
[INFO] BUILD FAILURE
[INFO] ------------------------------------------------------------------------
[INFO] Total time: 03:30 min
[INFO] Finished at: 2018-03-02T10:05:29Z
[INFO] Final Memory: 109M/4363M
[INFO] ------------------------------------------------------------------------
[ERROR] Failed to execute goal on project struts2-rest-plugin: Could not resolve dependencies for project org.apache.struts:struts2-rest-plugin:jar:2.6-SNAPSHOT: Failed to collect dependencies at com.fasterxml.jackson.dataformat:jackson-dataformat-xml:jar:2.9.4: Failed to read artifact descriptor for com.fasterxml.jackson.dataformat:jackson-dataformat-xml:jar:2.9.4: Could not transfer artifact com.fasterxml.jackson.dataformat:jackson-dataformat-xml:pom:2.9.4 from/to central (https://repo.maven.apache.org/maven2): /home/jenkins/.m2/repository/com/fasterxml/jackson/dataformat/jackson-dataformat-xml/2.9.4/jackson-dataformat-xml-2.9.4.pom.part.lock (No such file or directory) -> [Help 1]
[ERROR]
[ERROR] To see the full stack trace of the errors, re-run Maven with the -e switch.
[ERROR] Re-run Maven using the -X switch to enable full debug logging.
[ERROR]
[ERROR] For more information about the errors and possible solutions, please read the following articles:
[ERROR] [Help 1] http://cwiki.apache.org/confluence/display/MAVEN/DependencyResolutionException
[ERROR]
[ERROR] After correcting the problems, you can resume the build with the command
[ERROR]   mvn <goals> -rf :struts2-rest-plugin
Build step 'Execute shell' marked build as failure
[locks-and-latches] Releasing all the locks
[locks-and-latches] All the locks released
Setting MAVEN_3_LATEST__HOME=/home/jenkins/tools/maven/latest3/

---------------------------------------------------------------------
To unsubscribe, e-mail: [hidden email]
For additional commands, e-mail: [hidden email]

Reply | Threaded
Open this post in threaded view
|

Build failed in Jenkins: Struts-master-JDK8 #103

Apache Jenkins Server-2
See <https://builds.apache.org/job/Struts-master-JDK8/103/display/redirect?page=changes>

Changes:

[lukaszlenart] [maven-release-plugin] prepare release STRUTS_2_5_16

[lukaszlenart] [maven-release-plugin] prepare for next development iteration

------------------------------------------
[...truncated 1.53 MB...]
Generating <https://builds.apache.org/job/Struts-master-JDK8/ws/apps/showcase/target/apidocs/org/apache/struts2/showcase/chat/class-use/ChatServiceImpl.html...>
Generating <https://builds.apache.org/job/Struts-master-JDK8/ws/apps/showcase/target/apidocs/org/apache/struts2/showcase/chat/class-use/ChatMessage.html...>
Generating <https://builds.apache.org/job/Struts-master-JDK8/ws/apps/showcase/target/apidocs/org/apache/struts2/showcase/chat/class-use/ChatLoginAction.html...>
Generating <https://builds.apache.org/job/Struts-master-JDK8/ws/apps/showcase/target/apidocs/org/apache/struts2/showcase/chat/class-use/ChatException.html...>
Generating <https://builds.apache.org/job/Struts-master-JDK8/ws/apps/showcase/target/apidocs/org/apache/struts2/showcase/chat/class-use/ChatException.ErrorType.html...>
Generating <https://builds.apache.org/job/Struts-master-JDK8/ws/apps/showcase/target/apidocs/org/apache/struts2/showcase/chat/class-use/MessagesAvailableInRoomAction.html...>
Generating <https://builds.apache.org/job/Struts-master-JDK8/ws/apps/showcase/target/apidocs/org/apache/struts2/showcase/chat/class-use/Room.html...>
Generating <https://builds.apache.org/job/Struts-master-JDK8/ws/apps/showcase/target/apidocs/org/apache/struts2/showcase/chat/class-use/ChatLogoutAction.html...>
Generating <https://builds.apache.org/job/Struts-master-JDK8/ws/apps/showcase/target/apidocs/org/apache/struts2/showcase/chat/class-use/RoomsAvailableAction.html...>
Generating <https://builds.apache.org/job/Struts-master-JDK8/ws/apps/showcase/target/apidocs/org/apache/struts2/showcase/chat/class-use/SendMessageToRoomAction.html...>
Generating <https://builds.apache.org/job/Struts-master-JDK8/ws/apps/showcase/target/apidocs/org/apache/struts2/showcase/chat/class-use/User.html...>
Generating <https://builds.apache.org/job/Struts-master-JDK8/ws/apps/showcase/target/apidocs/org/apache/struts2/showcase/chat/class-use/UsersAvailableInRoomAction.html...>
Generating <https://builds.apache.org/job/Struts-master-JDK8/ws/apps/showcase/target/apidocs/org/apache/struts2/showcase/chat/class-use/UsersAvailableAction.html...>
Generating <https://builds.apache.org/job/Struts-master-JDK8/ws/apps/showcase/target/apidocs/org/apache/struts2/showcase/chat/class-use/ChatAuthenticationInterceptor.html...>
Generating <https://builds.apache.org/job/Struts-master-JDK8/ws/apps/showcase/target/apidocs/org/apache/struts2/showcase/chat/class-use/ChatInterceptor.html...>
Generating <https://builds.apache.org/job/Struts-master-JDK8/ws/apps/showcase/target/apidocs/org/apache/struts2/showcase/chat/class-use/CrudRoomAction.html...>
Generating <https://builds.apache.org/job/Struts-master-JDK8/ws/apps/showcase/target/apidocs/org/apache/struts2/showcase/fileupload/class-use/FileUploadAction.html...>
Generating <https://builds.apache.org/job/Struts-master-JDK8/ws/apps/showcase/target/apidocs/org/apache/struts2/showcase/fileupload/class-use/MultipleFileUploadUsingListAction.html...>
Generating <https://builds.apache.org/job/Struts-master-JDK8/ws/apps/showcase/target/apidocs/org/apache/struts2/showcase/fileupload/class-use/MultipleFileUploadUsingArrayAction.html...>
Generating <https://builds.apache.org/job/Struts-master-JDK8/ws/apps/showcase/target/apidocs/org/apache/struts2/showcase/person/class-use/PersonManager.html...>
Generating <https://builds.apache.org/job/Struts-master-JDK8/ws/apps/showcase/target/apidocs/org/apache/struts2/showcase/person/class-use/NewPersonAction.html...>
Generating <https://builds.apache.org/job/Struts-master-JDK8/ws/apps/showcase/target/apidocs/org/apache/struts2/showcase/person/class-use/EditPersonAction.html...>
Generating <https://builds.apache.org/job/Struts-master-JDK8/ws/apps/showcase/target/apidocs/org/apache/struts2/showcase/person/class-use/Person.html...>
Generating <https://builds.apache.org/job/Struts-master-JDK8/ws/apps/showcase/target/apidocs/org/apache/struts2/showcase/person/class-use/ListPeopleAction.html...>
Generating <https://builds.apache.org/job/Struts-master-JDK8/ws/apps/showcase/target/apidocs/org/apache/struts2/showcase/wait/class-use/LongProcessAction.html...>
Generating <https://builds.apache.org/job/Struts-master-JDK8/ws/apps/showcase/target/apidocs/org/apache/struts2/showcase/application/class-use/MemoryStorage.html...>
Generating <https://builds.apache.org/job/Struts-master-JDK8/ws/apps/showcase/target/apidocs/org/apache/struts2/showcase/application/class-use/Storage.html...>
Generating <https://builds.apache.org/job/Struts-master-JDK8/ws/apps/showcase/target/apidocs/org/apache/struts2/showcase/application/class-use/TestDataProvider.html...>
Generating <https://builds.apache.org/job/Struts-master-JDK8/ws/apps/showcase/target/apidocs/org/apache/struts2/showcase/action/class-use/SkillAction.html...>
Generating <https://builds.apache.org/job/Struts-master-JDK8/ws/apps/showcase/target/apidocs/org/apache/struts2/showcase/action/class-use/EmployeeAction.html...>
Generating <https://builds.apache.org/job/Struts-master-JDK8/ws/apps/showcase/target/apidocs/org/apache/struts2/showcase/action/class-use/JSPEvalAction.html...>
Generating <https://builds.apache.org/job/Struts-master-JDK8/ws/apps/showcase/target/apidocs/org/apache/struts2/showcase/action/class-use/AbstractCRUDAction.html...>
Generating <https://builds.apache.org/job/Struts-master-JDK8/ws/apps/showcase/target/apidocs/org/apache/struts2/showcase/action/class-use/ExampleAction.html...>
Generating <https://builds.apache.org/job/Struts-master-JDK8/ws/apps/showcase/target/apidocs/org/apache/struts2/showcase/tag/nonui/actiontag/class-use/ActionTagDemo.html...>
Generating <https://builds.apache.org/job/Struts-master-JDK8/ws/apps/showcase/target/apidocs/org/apache/struts2/showcase/tag/nonui/actionPrefix/class-use/SubmitAction.html...>
Generating <https://builds.apache.org/job/Struts-master-JDK8/ws/apps/showcase/target/apidocs/org/apache/struts2/showcase/tag/nonui/debugtag/class-use/DebugTagAction.html...>
Generating <https://builds.apache.org/job/Struts-master-JDK8/ws/apps/showcase/target/apidocs/org/apache/struts2/showcase/tag/nonui/iteratortag/class-use/IteratorGeneratorTagDemo.html...>
Generating <https://builds.apache.org/job/Struts-master-JDK8/ws/apps/showcase/target/apidocs/org/apache/struts2/showcase/tag/nonui/iteratortag/class-use/SubsetIteratorTagDemo.html...>
Generating <https://builds.apache.org/job/Struts-master-JDK8/ws/apps/showcase/target/apidocs/org/apache/struts2/showcase/tag/nonui/iteratortag/class-use/AppendIteratorTagDemo.html...>
Generating <https://builds.apache.org/job/Struts-master-JDK8/ws/apps/showcase/target/apidocs/org/apache/struts2/showcase/tag/nonui/iteratortag/class-use/MergeIteratorTagDemo.html...>
Generating <https://builds.apache.org/job/Struts-master-JDK8/ws/apps/showcase/target/apidocs/org/apache/struts2/showcase/validation/class-use/VisitorValidatorsExampleAction.html...>
Generating <https://builds.apache.org/job/Struts-master-JDK8/ws/apps/showcase/target/apidocs/org/apache/struts2/showcase/validation/class-use/AjaxFormSubmitSuccessAction.html...>
Generating <https://builds.apache.org/job/Struts-master-JDK8/ws/apps/showcase/target/apidocs/org/apache/struts2/showcase/validation/class-use/SubmitApplication.html...>
Generating <https://builds.apache.org/job/Struts-master-JDK8/ws/apps/showcase/target/apidocs/org/apache/struts2/showcase/validation/class-use/NonFieldValidatorsExampleAction.html...>
Generating <https://builds.apache.org/job/Struts-master-JDK8/ws/apps/showcase/target/apidocs/org/apache/struts2/showcase/validation/class-use/BeanValidationExampleAction.html...>
Generating <https://builds.apache.org/job/Struts-master-JDK8/ws/apps/showcase/target/apidocs/org/apache/struts2/showcase/validation/class-use/QuizAction.html...>
Generating <https://builds.apache.org/job/Struts-master-JDK8/ws/apps/showcase/target/apidocs/org/apache/struts2/showcase/validation/class-use/FieldValidatorsExampleAction.html...>
Generating <https://builds.apache.org/job/Struts-master-JDK8/ws/apps/showcase/target/apidocs/org/apache/struts2/showcase/validation/class-use/User.html...>
Generating <https://builds.apache.org/job/Struts-master-JDK8/ws/apps/showcase/target/apidocs/org/apache/struts2/showcase/validation/class-use/AbstractValidationActionSupport.html...>
Generating <https://builds.apache.org/job/Struts-master-JDK8/ws/apps/showcase/target/apidocs/org/apache/struts2/showcase/validation/class-use/AjaxFormSubmitAction.html...>
Generating <https://builds.apache.org/job/Struts-master-JDK8/ws/apps/showcase/target/apidocs/org/apache/struts2/showcase/actionchaining/class-use/ActionChain2.html...>
Generating <https://builds.apache.org/job/Struts-master-JDK8/ws/apps/showcase/target/apidocs/org/apache/struts2/showcase/actionchaining/class-use/ActionChain3.html...>
Generating <https://builds.apache.org/job/Struts-master-JDK8/ws/apps/showcase/target/apidocs/org/apache/struts2/showcase/actionchaining/class-use/ActionChain1.html...>
Generating <https://builds.apache.org/job/Struts-master-JDK8/ws/apps/showcase/target/apidocs/org/apache/struts2/showcase/modelDriven/class-use/Gangster.html...>
Generating <https://builds.apache.org/job/Struts-master-JDK8/ws/apps/showcase/target/apidocs/org/apache/struts2/showcase/modelDriven/class-use/ModelDrivenAction.html...>
Generating <https://builds.apache.org/job/Struts-master-JDK8/ws/apps/showcase/target/apidocs/org/apache/struts2/showcase/package-use.html...>
Generating <https://builds.apache.org/job/Struts-master-JDK8/ws/apps/showcase/target/apidocs/org/apache/struts2/showcase/action/package-use.html...>
Generating <https://builds.apache.org/job/Struts-master-JDK8/ws/apps/showcase/target/apidocs/org/apache/struts2/showcase/actionchaining/package-use.html...>
Generating <https://builds.apache.org/job/Struts-master-JDK8/ws/apps/showcase/target/apidocs/org/apache/struts2/showcase/ajax/package-use.html...>
Generating <https://builds.apache.org/job/Struts-master-JDK8/ws/apps/showcase/target/apidocs/org/apache/struts2/showcase/ajax/tree/package-use.html...>
Generating <https://builds.apache.org/job/Struts-master-JDK8/ws/apps/showcase/target/apidocs/org/apache/struts2/showcase/application/package-use.html...>
Generating <https://builds.apache.org/job/Struts-master-JDK8/ws/apps/showcase/target/apidocs/org/apache/struts2/showcase/chat/package-use.html...>
Generating <https://builds.apache.org/job/Struts-master-JDK8/ws/apps/showcase/target/apidocs/org/apache/struts2/showcase/conversion/package-use.html...>
Generating <https://builds.apache.org/job/Struts-master-JDK8/ws/apps/showcase/target/apidocs/org/apache/struts2/showcase/dao/package-use.html...>
Generating <https://builds.apache.org/job/Struts-master-JDK8/ws/apps/showcase/target/apidocs/org/apache/struts2/showcase/exception/package-use.html...>
Generating <https://builds.apache.org/job/Struts-master-JDK8/ws/apps/showcase/target/apidocs/org/apache/struts2/showcase/filedownload/package-use.html...>
Generating <https://builds.apache.org/job/Struts-master-JDK8/ws/apps/showcase/target/apidocs/org/apache/struts2/showcase/fileupload/package-use.html...>
Generating <https://builds.apache.org/job/Struts-master-JDK8/ws/apps/showcase/target/apidocs/org/apache/struts2/showcase/freemarker/package-use.html...>
Generating <https://builds.apache.org/job/Struts-master-JDK8/ws/apps/showcase/target/apidocs/org/apache/struts2/showcase/hangman/package-use.html...>
Generating <https://builds.apache.org/job/Struts-master-JDK8/ws/apps/showcase/target/apidocs/org/apache/struts2/showcase/model/package-use.html...>
Generating <https://builds.apache.org/job/Struts-master-JDK8/ws/apps/showcase/target/apidocs/org/apache/struts2/showcase/modelDriven/package-use.html...>
Generating <https://builds.apache.org/job/Struts-master-JDK8/ws/apps/showcase/target/apidocs/org/apache/struts2/showcase/person/package-use.html...>
Generating <https://builds.apache.org/job/Struts-master-JDK8/ws/apps/showcase/target/apidocs/org/apache/struts2/showcase/source/package-use.html...>
Generating <https://builds.apache.org/job/Struts-master-JDK8/ws/apps/showcase/target/apidocs/org/apache/struts2/showcase/tag/nonui/actionPrefix/package-use.html...>
Generating <https://builds.apache.org/job/Struts-master-JDK8/ws/apps/showcase/target/apidocs/org/apache/struts2/showcase/tag/nonui/actiontag/package-use.html...>
Generating <https://builds.apache.org/job/Struts-master-JDK8/ws/apps/showcase/target/apidocs/org/apache/struts2/showcase/tag/nonui/debugtag/package-use.html...>
Generating <https://builds.apache.org/job/Struts-master-JDK8/ws/apps/showcase/target/apidocs/org/apache/struts2/showcase/tag/nonui/iteratortag/package-use.html...>
Generating <https://builds.apache.org/job/Struts-master-JDK8/ws/apps/showcase/target/apidocs/org/apache/struts2/showcase/tiles/package-use.html...>
Generating <https://builds.apache.org/job/Struts-master-JDK8/ws/apps/showcase/target/apidocs/org/apache/struts2/showcase/token/package-use.html...>
Generating <https://builds.apache.org/job/Struts-master-JDK8/ws/apps/showcase/target/apidocs/org/apache/struts2/showcase/validation/package-use.html...>
Generating <https://builds.apache.org/job/Struts-master-JDK8/ws/apps/showcase/target/apidocs/org/apache/struts2/showcase/wait/package-use.html...>
Generating <https://builds.apache.org/job/Struts-master-JDK8/ws/apps/showcase/target/apidocs/org/apache/struts2/showcase/xslt/package-use.html...>
Building index for all the packages and classes...
Generating <https://builds.apache.org/job/Struts-master-JDK8/ws/apps/showcase/target/apidocs/overview-tree.html...>
Generating <https://builds.apache.org/job/Struts-master-JDK8/ws/apps/showcase/target/apidocs/index-all.html...>
Generating <https://builds.apache.org/job/Struts-master-JDK8/ws/apps/showcase/target/apidocs/deprecated-list.html...>
Building index for all classes...
Generating <https://builds.apache.org/job/Struts-master-JDK8/ws/apps/showcase/target/apidocs/allclasses-frame.html...>
Generating <https://builds.apache.org/job/Struts-master-JDK8/ws/apps/showcase/target/apidocs/allclasses-noframe.html...>
Generating <https://builds.apache.org/job/Struts-master-JDK8/ws/apps/showcase/target/apidocs/index.html...>
Generating <https://builds.apache.org/job/Struts-master-JDK8/ws/apps/showcase/target/apidocs/overview-summary.html...>
Generating <https://builds.apache.org/job/Struts-master-JDK8/ws/apps/showcase/target/apidocs/help-doc.html...>
[INFO] Building jar: <https://builds.apache.org/job/Struts-master-JDK8/ws/apps/showcase/target/struts2-showcase-javadoc.jar>
[INFO]
[INFO] --- maven-antrun-plugin:1.8:run (copy-sources) @ struts2-showcase ---
[INFO] Executing tasks

main:
     [copy] Copying 113 files to <https://builds.apache.org/job/Struts-master-JDK8/ws/apps/showcase/target/struts2-showcase/WEB-INF/src/java>
     [copy] Copying 59 files to <https://builds.apache.org/job/Struts-master-JDK8/ws/apps/showcase/target/struts2-showcase/WEB-INF/src/java>
[INFO] Executed tasks
[INFO]
[INFO] --- maven-remote-resources-plugin:1.5:process (process-resource-bundles) @ struts2-showcase ---
[INFO]
[INFO] --- maven-resources-plugin:2.7:resources (default-resources) @ struts2-showcase ---
[INFO] Using 'UTF-8' encoding to copy filtered resources.
[INFO] Copying 59 resources
[INFO] Copying 113 resources
[INFO] Copying 3 resources
[INFO]
[INFO] --- maven-compiler-plugin:3.5.1:compile (default-compile) @ struts2-showcase ---
[INFO] Changes detected - recompiling the module!
[INFO] Compiling 113 source files to <https://builds.apache.org/job/Struts-master-JDK8/ws/apps/showcase/target/classes>
[INFO] <https://builds.apache.org/job/Struts-master-JDK8/ws/apps/showcase/src/main/java/org/apache/struts2/showcase/model/Skill.java>: <https://builds.apache.org/job/Struts-master-JDK8/ws/apps/showcase/src/main/java/org/apache/struts2/showcase/model/Skill.java> uses or overrides a deprecated API.
[INFO] <https://builds.apache.org/job/Struts-master-JDK8/ws/apps/showcase/src/main/java/org/apache/struts2/showcase/model/Skill.java>: Recompile with -Xlint:deprecation for details.
[INFO] <https://builds.apache.org/job/Struts-master-JDK8/ws/apps/showcase/src/main/java/org/apache/struts2/showcase/source/ViewSourceAction.java>: Some input files use unchecked or unsafe operations.
[INFO] <https://builds.apache.org/job/Struts-master-JDK8/ws/apps/showcase/src/main/java/org/apache/struts2/showcase/source/ViewSourceAction.java>: Recompile with -Xlint:unchecked for details.
[INFO]
[INFO] --- maven-bundle-plugin:2.1.0:manifest (bundle-manifest) @ struts2-showcase ---
[WARNING] Ignoring project type war - supportedProjectTypes = [jar, bundle]
[INFO]
[INFO] --- maven-resources-plugin:2.7:testResources (default-testResources) @ struts2-showcase ---
[INFO] Using 'UTF-8' encoding to copy filtered resources.
[INFO] skip non existing resourceDirectory <https://builds.apache.org/job/Struts-master-JDK8/ws/apps/showcase/src/test/resources>
[INFO] Copying 3 resources
[INFO]
[INFO] --- maven-compiler-plugin:3.5.1:testCompile (default-testCompile) @ struts2-showcase ---
[INFO] Changes detected - recompiling the module!
[INFO] Compiling 14 source files to <https://builds.apache.org/job/Struts-master-JDK8/ws/apps/showcase/target/test-classes>
[INFO] <https://builds.apache.org/job/Struts-master-JDK8/ws/apps/showcase/src/test/java/org/apache/struts2/showcase/filedownload/FileDownloadActionTest.java>: <https://builds.apache.org/job/Struts-master-JDK8/ws/apps/showcase/src/test/java/org/apache/struts2/showcase/filedownload/FileDownloadActionTest.java> uses or overrides a deprecated API.
[INFO] <https://builds.apache.org/job/Struts-master-JDK8/ws/apps/showcase/src/test/java/org/apache/struts2/showcase/filedownload/FileDownloadActionTest.java>: Recompile with -Xlint:deprecation for details.
[INFO]
[INFO] --- maven-surefire-plugin:2.20.1:test (default-test) @ struts2-showcase ---
[INFO]
[INFO] -------------------------------------------------------
[INFO]  T E S T S
[INFO] -------------------------------------------------------
[INFO] Running org.apache.struts2.showcase.filedownload.FileDownloadActionTest
[INFO] Tests run: 5, Failures: 0, Errors: 0, Skipped: 0, Time elapsed: 0.089 s - in org.apache.struts2.showcase.filedownload.FileDownloadActionTest
[INFO]
[INFO] Results:
[INFO]
[INFO] Tests run: 5, Failures: 0, Errors: 0, Skipped: 0
[INFO]
[INFO]
[INFO] --- apache-rat-plugin:0.11:check (default) @ struts2-showcase ---
[INFO] 51 implicit excludes (use -debug for more details).
[INFO] Exclude: src/main/resources/org/apache/struts2/static/domTT.js
[INFO] Exclude: src/site/resources/tags/**/*.html
[INFO] Exclude: src/main/resources/*LICENSE.txt
[INFO] Exclude: src/test/resources/**/*.txt
[INFO] Exclude: src/main/webapp/**/*.css
[INFO] Exclude: src/main/webapp/**/*.map
[INFO] Exclude: src/main/webapp/**/*.js
[INFO] Exclude: src/main/webapp/**/*.svg
[INFO] Exclude: src/main/webapp/**/*.txt
[INFO] Exclude: src/main/resources/**/sitegraph-usage.txt
[INFO] Exclude: src/main/resources/**/docs-urls.txt
[INFO] Exclude: src/etc/header.txt
[INFO] Exclude: src/main/resources/static/css/**/*.css
[INFO] Exclude: src/main/resources/static/js/**/*.js
[INFO] Exclude: src/main/resources/docs.cfg
[INFO] Exclude: src/main/webapp/fonts/**/*
[INFO] 367 resources included (use -debug for more details)
[INFO] Rat check: Summary of files. Unapproved: 0 unknown: 0 generated: 0 approved: 308 licence.
[INFO]
[INFO] --- maven-war-plugin:2.1:war (default-war) @ struts2-showcase ---
[INFO] Packaging webapp
[INFO] Assembling webapp [struts2-showcase] in [<https://builds.apache.org/job/Struts-master-JDK8/ws/apps/showcase/target/struts2-showcase]>
[INFO] Processing war project
[INFO] Copying webapp webResources [<https://builds.apache.org/job/Struts-master-JDK8/ws/apps/showcase/src/main/resources]> to [<https://builds.apache.org/job/Struts-master-JDK8/ws/apps/showcase/target/struts2-showcase]>
[INFO] Copying webapp resources [<https://builds.apache.org/job/Struts-master-JDK8/ws/apps/showcase/src/main/webapp]>
[INFO] Webapp assembled in [314 msecs]
[INFO] Building war: <https://builds.apache.org/job/Struts-master-JDK8/ws/apps/showcase/target/struts2-showcase.war>
[INFO] WEB-INF/web.xml already added, skipping
[INFO]
[INFO] >>> maven-source-plugin:3.0.0:jar (attach-sources) > generate-sources @ struts2-showcase >>>
[INFO]
[INFO] <<< maven-source-plugin:3.0.0:jar (attach-sources) < generate-sources @ struts2-showcase <<<
[INFO]
[INFO]
[INFO] --- maven-source-plugin:3.0.0:jar (attach-sources) @ struts2-showcase ---
[INFO] Building jar: <https://builds.apache.org/job/Struts-master-JDK8/ws/apps/showcase/target/struts2-showcase-sources.jar>
[INFO]
[INFO] --- maven-site-plugin:3.5.1:attach-descriptor (attach-descriptor) @ struts2-showcase ---
[INFO]
[INFO] ------------------------------------------------------------------------
[INFO] Building Struts 2 REST Plugin 2.6-SNAPSHOT
[INFO] ------------------------------------------------------------------------
Downloading from central: https://repo.maven.apache.org/maven2/com/fasterxml/jackson/dataformat/jackson-dataformat-xml/2.9.4/jackson-dataformat-xml-2.9.4.pom
[WARNING] Failed to create parent directories for tracking file /home/jenkins/.m2/repository/com/fasterxml/jackson/dataformat/jackson-dataformat-xml/2.9.4/jackson-dataformat-xml-2.9.4.pom.lastUpdated
[INFO] ------------------------------------------------------------------------
[INFO] Reactor Summary:
[INFO]
[INFO] Struts 2 Bill of Materials ......................... SUCCESS [  1.979 s]
[INFO] Struts 2 ........................................... SUCCESS [  2.856 s]
[INFO] Struts 2 Core ...................................... SUCCESS [01:53 min]
[INFO] Struts Plugins ..................................... SUCCESS [  0.248 s]
[INFO] Struts 2 Configuration Browser Plugin .............. SUCCESS [  2.881 s]
[INFO] Struts 2 Sitemesh Plugin ........................... SUCCESS [  2.784 s]
[INFO] Struts 2 Tiles Plugin .............................. SUCCESS [  4.146 s]
[INFO] Struts 2 DWR Plugin ................................ SUCCESS [  1.967 s]
[INFO] Struts 2 Spring Plugin ............................. SUCCESS [  4.160 s]
[INFO] Struts 2 Convention Plugin ......................... SUCCESS [  7.585 s]
[INFO] Struts 2 JUnit Plugin .............................. SUCCESS [  7.323 s]
[INFO] Struts 2 JSON Plugin ............................... SUCCESS [  8.806 s]
[INFO] Struts 2 Bean Validation Plugin .................... SUCCESS [  5.116 s]
[INFO] Struts 2 Webapps ................................... SUCCESS [  0.468 s]
[INFO] Struts 2 Showcase Webapp ........................... SUCCESS [ 10.769 s]
[INFO] Struts 2 REST Plugin ............................... FAILURE [  0.654 s]
[INFO] Struts 2 Rest Showcase Webapp ...................... SKIPPED
[INFO] Struts 2 CDI Plugin ................................ SKIPPED
[INFO] Struts 2 Embedded JSP Plugin ....................... SKIPPED
[INFO] Struts 2 GXP Plugin ................................ SKIPPED
[INFO] Struts 2 Jasper Reports Plugin ..................... SKIPPED
[INFO] Struts 2 Java Templates Plugin ..................... SKIPPED
[INFO] Struts 2 JFreeChart Plugin ......................... SKIPPED
[INFO] Struts 2 OSGi Plugin ............................... SKIPPED
[INFO] Struts 2 OVal Plugin ............................... SKIPPED
[INFO] Struts 2 Pell Multipart Plugin ..................... SKIPPED
[INFO] Struts 2 Plexus Plugin ............................. SKIPPED
[INFO] Struts 2 Portlet Plugin ............................ SKIPPED
[INFO] Struts 2 Portlet Tiles Plugin ...................... SKIPPED
[INFO] DEPRECATED: Struts 2 Sitegraph Plugin .............. SKIPPED
[INFO] Struts 2 TestNG Plugin ............................. SKIPPED
[INFO] Struts OSGi Bundles ................................ SKIPPED
[INFO] Struts 2 OSGi Admin Bundle ......................... SKIPPED
[INFO] Struts 2 OSGi Demo Bundle .......................... SKIPPED
[INFO] ------------------------------------------------------------------------
[INFO] BUILD FAILURE
[INFO] ------------------------------------------------------------------------
[INFO] Total time: 02:57 min
[INFO] Finished at: 2018-03-02T12:03:29Z
[INFO] Final Memory: 97M/3774M
[INFO] ------------------------------------------------------------------------
[ERROR] Failed to execute goal on project struts2-rest-plugin: Could not resolve dependencies for project org.apache.struts:struts2-rest-plugin:jar:2.6-SNAPSHOT: Failed to collect dependencies at com.fasterxml.jackson.dataformat:jackson-dataformat-xml:jar:2.9.4: Failed to read artifact descriptor for com.fasterxml.jackson.dataformat:jackson-dataformat-xml:jar:2.9.4: Could not transfer artifact com.fasterxml.jackson.dataformat:jackson-dataformat-xml:pom:2.9.4 from/to central (https://repo.maven.apache.org/maven2): /home/jenkins/.m2/repository/com/fasterxml/jackson/dataformat/jackson-dataformat-xml/2.9.4/jackson-dataformat-xml-2.9.4.pom.part.lock (No such file or directory) -> [Help 1]
[ERROR]
[ERROR] To see the full stack trace of the errors, re-run Maven with the -e switch.
[ERROR] Re-run Maven using the -X switch to enable full debug logging.
[ERROR]
[ERROR] For more information about the errors and possible solutions, please read the following articles:
[ERROR] [Help 1] http://cwiki.apache.org/confluence/display/MAVEN/DependencyResolutionException
[ERROR]
[ERROR] After correcting the problems, you can resume the build with the command
[ERROR]   mvn <goals> -rf :struts2-rest-plugin
Build step 'Execute shell' marked build as failure
[locks-and-latches] Releasing all the locks
[locks-and-latches] All the locks released
Setting MAVEN_3_LATEST__HOME=/home/jenkins/tools/maven/latest3/

---------------------------------------------------------------------
To unsubscribe, e-mail: [hidden email]
For additional commands, e-mail: [hidden email]

Reply | Threaded
Open this post in threaded view
|

Jenkins build is back to normal : Struts-master-JDK8 #104

Apache Jenkins Server-2
See <https://builds.apache.org/job/Struts-master-JDK8/104/display/redirect>


---------------------------------------------------------------------
To unsubscribe, e-mail: [hidden email]
For additional commands, e-mail: [hidden email]