Build failed in Jenkins: Struts-master-JDK7-dependency-check #43

classic Classic list List threaded Threaded
26 messages Options
12
Reply | Threaded
Open this post in threaded view
|

Build failed in Jenkins: Struts-master-JDK7-dependency-check #63

Apache Jenkins Server-2
See <https://builds.apache.org/job/Struts-master-JDK7-dependency-check/63/display/redirect>

------------------------------------------
[...truncated 1.14 MB...]
[INFO] --- maven-compiler-plugin:3.5.1:compile (default-compile) @ struts2-tiles-plugin ---
[INFO] Changes detected - recompiling the module!
[INFO] Compiling 18 source files to <https://builds.apache.org/job/Struts-master-JDK7-dependency-check/ws/plugins/tiles/target/classes>
[INFO]
[INFO] --- maven-bundle-plugin:2.1.0:manifest (bundle-manifest) @ struts2-tiles-plugin ---
[WARNING] Warning in manifest for org.apache.struts:struts2-tiles-plugin:jar:2.6-SNAPSHOT : Superfluous export-package instructions: [org.apache.struts2.views, org.apache, org.apache.struts2, org]
[INFO]
[INFO] --- maven-resources-plugin:2.7:testResources (default-testResources) @ struts2-tiles-plugin ---
[INFO] Using 'UTF-8' encoding to copy filtered resources.
[INFO] skip non existing resourceDirectory <https://builds.apache.org/job/Struts-master-JDK7-dependency-check/ws/plugins/tiles/src/test/resources>
[INFO] Copying 3 resources
[INFO]
[INFO] --- maven-compiler-plugin:3.5.1:testCompile (default-testCompile) @ struts2-tiles-plugin ---
[INFO] Changes detected - recompiling the module!
[INFO] Compiling 4 source files to <https://builds.apache.org/job/Struts-master-JDK7-dependency-check/ws/plugins/tiles/target/test-classes>
[INFO]
[INFO] --- maven-surefire-plugin:2.20.1:test (default-test) @ struts2-tiles-plugin ---
[INFO]
[INFO] -------------------------------------------------------
[INFO]  T E S T S
[INFO] -------------------------------------------------------
[INFO] Running org.apache.struts2.tiles.StrutsTilesAnnotationProcessorTest
[INFO] Tests run: 6, Failures: 0, Errors: 0, Skipped: 0, Time elapsed: 0.1 s - in org.apache.struts2.tiles.StrutsTilesAnnotationProcessorTest
[INFO]
[INFO] Results:
[INFO]
[INFO] Tests run: 6, Failures: 0, Errors: 0, Skipped: 0
[INFO]
[INFO]
[INFO] --- apache-rat-plugin:0.11:check (default) @ struts2-tiles-plugin ---
[INFO] 51 implicit excludes (use -debug for more details).
[INFO] Exclude: src/main/resources/org/apache/struts2/static/domTT.js
[INFO] Exclude: src/site/resources/tags/**/*.html
[INFO] Exclude: src/main/resources/*LICENSE.txt
[INFO] Exclude: src/test/resources/**/*.txt
[INFO] Exclude: src/main/webapp/**/*.css
[INFO] Exclude: src/main/webapp/**/*.map
[INFO] Exclude: src/main/webapp/**/*.js
[INFO] Exclude: src/main/webapp/**/*.svg
[INFO] Exclude: src/main/webapp/**/*.txt
[INFO] Exclude: src/main/resources/**/sitegraph-usage.txt
[INFO] Exclude: src/main/resources/**/docs-urls.txt
[INFO] Exclude: src/etc/header.txt
[INFO] Exclude: src/main/resources/static/css/**/*.css
[INFO] Exclude: src/main/resources/static/js/**/*.js
[INFO] Exclude: src/main/resources/docs.cfg
[INFO] Exclude: src/main/webapp/fonts/**/*
[INFO] 26 resources included (use -debug for more details)
[INFO] Rat check: Summary of files. Unapproved: 0 unknown: 0 generated: 0 approved: 25 licence.
[INFO]
[INFO] --- maven-jar-plugin:3.0.0:jar (default-jar) @ struts2-tiles-plugin ---
[INFO] Building jar: <https://builds.apache.org/job/Struts-master-JDK7-dependency-check/ws/plugins/tiles/target/struts2-tiles-plugin-2.6-SNAPSHOT.jar>
[INFO]
[INFO] >>> maven-source-plugin:3.0.0:jar (attach-sources) > generate-sources @ struts2-tiles-plugin >>>
[INFO]
[INFO] <<< maven-source-plugin:3.0.0:jar (attach-sources) < generate-sources @ struts2-tiles-plugin <<<
[INFO]
[INFO]
[INFO] --- maven-source-plugin:3.0.0:jar (attach-sources) @ struts2-tiles-plugin ---
[INFO] Building jar: <https://builds.apache.org/job/Struts-master-JDK7-dependency-check/ws/plugins/tiles/target/struts2-tiles-plugin-2.6-SNAPSHOT-sources.jar>
[INFO]
[INFO] --- maven-site-plugin:3.5.1:attach-descriptor (attach-descriptor) @ struts2-tiles-plugin ---
[INFO]
[INFO] --- dependency-check-maven:3.1.1:check (default) @ struts2-tiles-plugin ---
[INFO] Checking for updates
[INFO] Skipping NVD check since last check was within 4 hours.
[INFO] Check for updates complete (230 ms)
[INFO] Analysis Started
[INFO] Finished Archive Analyzer (0 seconds)
[INFO] Finished File Name Analyzer (0 seconds)
[INFO] Finished Jar Analyzer (0 seconds)
[INFO] Finished Central Analyzer (0 seconds)
[INFO] Finished Dependency Merging Analyzer (0 seconds)
[INFO] Finished Version Filter Analyzer (0 seconds)
[INFO] Finished Hint Analyzer (0 seconds)
[INFO] Created CPE Index (0 seconds)
[INFO] Skipping CPE Analysis for npm
[INFO] Finished CPE Analyzer (0 seconds)
[INFO] Finished False Positive Analyzer (0 seconds)
[INFO] Finished Cpe Suppression Analyzer (0 seconds)
[INFO] Finished NVD CVE Analyzer (0 seconds)
[INFO] Finished Vulnerability Suppression Analyzer (0 seconds)
[INFO] Finished Dependency Bundling Analyzer (0 seconds)
[INFO] Analysis Complete (1 seconds)
[INFO]
[INFO] ------------------------------------------------------------------------
[INFO] Building Struts 2 DWR Plugin 2.6-SNAPSHOT
[INFO] ------------------------------------------------------------------------
[INFO]
[INFO] --- maven-remote-resources-plugin:1.5:process (process-resource-bundles) @ struts2-dwr-plugin ---
[INFO]
[INFO] --- maven-resources-plugin:2.7:resources (default-resources) @ struts2-dwr-plugin ---
[INFO] Using 'UTF-8' encoding to copy filtered resources.
[INFO] skip non existing resourceDirectory <https://builds.apache.org/job/Struts-master-JDK7-dependency-check/ws/plugins/dwr/src/main/resources>
[INFO] Copying 3 resources
[INFO]
[INFO] --- maven-compiler-plugin:3.5.1:compile (default-compile) @ struts2-dwr-plugin ---
[INFO] Changes detected - recompiling the module!
[INFO] Compiling 1 source file to <https://builds.apache.org/job/Struts-master-JDK7-dependency-check/ws/plugins/dwr/target/classes>
[INFO] <https://builds.apache.org/job/Struts-master-JDK7-dependency-check/ws/plugins/dwr/src/main/java/org/apache/struts2/validators/DWRValidator.java>: <https://builds.apache.org/job/Struts-master-JDK7-dependency-check/ws/plugins/dwr/src/main/java/org/apache/struts2/validators/DWRValidator.java> uses unchecked or unsafe operations.
[INFO] <https://builds.apache.org/job/Struts-master-JDK7-dependency-check/ws/plugins/dwr/src/main/java/org/apache/struts2/validators/DWRValidator.java>: Recompile with -Xlint:unchecked for details.
[INFO]
[INFO] --- maven-bundle-plugin:2.1.0:manifest (bundle-manifest) @ struts2-dwr-plugin ---
[WARNING] Warning in manifest for org.apache.struts:struts2-dwr-plugin:jar:2.6-SNAPSHOT : Superfluous export-package instructions: [org.apache, org.apache.struts2, org]
[INFO]
[INFO] --- maven-resources-plugin:2.7:testResources (default-testResources) @ struts2-dwr-plugin ---
[INFO] Using 'UTF-8' encoding to copy filtered resources.
[INFO] skip non existing resourceDirectory <https://builds.apache.org/job/Struts-master-JDK7-dependency-check/ws/plugins/dwr/src/test/resources>
[INFO] Copying 3 resources
[INFO]
[INFO] --- maven-compiler-plugin:3.5.1:testCompile (default-testCompile) @ struts2-dwr-plugin ---
[INFO] No sources to compile
[INFO]
[INFO] --- maven-surefire-plugin:2.20.1:test (default-test) @ struts2-dwr-plugin ---
[INFO]
[INFO] --- apache-rat-plugin:0.11:check (default) @ struts2-dwr-plugin ---
[INFO] 51 implicit excludes (use -debug for more details).
[INFO] Exclude: src/main/resources/org/apache/struts2/static/domTT.js
[INFO] Exclude: src/site/resources/tags/**/*.html
[INFO] Exclude: src/main/resources/*LICENSE.txt
[INFO] Exclude: src/test/resources/**/*.txt
[INFO] Exclude: src/main/webapp/**/*.css
[INFO] Exclude: src/main/webapp/**/*.map
[INFO] Exclude: src/main/webapp/**/*.js
[INFO] Exclude: src/main/webapp/**/*.svg
[INFO] Exclude: src/main/webapp/**/*.txt
[INFO] Exclude: src/main/resources/**/sitegraph-usage.txt
[INFO] Exclude: src/main/resources/**/docs-urls.txt
[INFO] Exclude: src/etc/header.txt
[INFO] Exclude: src/main/resources/static/css/**/*.css
[INFO] Exclude: src/main/resources/static/js/**/*.js
[INFO] Exclude: src/main/resources/docs.cfg
[INFO] Exclude: src/main/webapp/fonts/**/*
[INFO] 3 resources included (use -debug for more details)
[INFO] Rat check: Summary of files. Unapproved: 0 unknown: 0 generated: 0 approved: 3 licence.
[INFO]
[INFO] --- maven-jar-plugin:3.0.0:jar (default-jar) @ struts2-dwr-plugin ---
[INFO] Building jar: <https://builds.apache.org/job/Struts-master-JDK7-dependency-check/ws/plugins/dwr/target/struts2-dwr-plugin-2.6-SNAPSHOT.jar>
[INFO]
[INFO] >>> maven-source-plugin:3.0.0:jar (attach-sources) > generate-sources @ struts2-dwr-plugin >>>
[INFO]
[INFO] <<< maven-source-plugin:3.0.0:jar (attach-sources) < generate-sources @ struts2-dwr-plugin <<<
[INFO]
[INFO]
[INFO] --- maven-source-plugin:3.0.0:jar (attach-sources) @ struts2-dwr-plugin ---
[INFO] Building jar: <https://builds.apache.org/job/Struts-master-JDK7-dependency-check/ws/plugins/dwr/target/struts2-dwr-plugin-2.6-SNAPSHOT-sources.jar>
[INFO]
[INFO] --- maven-site-plugin:3.5.1:attach-descriptor (attach-descriptor) @ struts2-dwr-plugin ---
[INFO]
[INFO] --- dependency-check-maven:3.1.1:check (default) @ struts2-dwr-plugin ---
[INFO] Checking for updates
[INFO] Skipping NVD check since last check was within 4 hours.
[INFO] Check for updates complete (222 ms)
[INFO] Analysis Started
[INFO] Finished Archive Analyzer (0 seconds)
[INFO] Finished File Name Analyzer (0 seconds)
[INFO] Finished Jar Analyzer (0 seconds)
[INFO] Finished Central Analyzer (0 seconds)
[INFO] Finished Dependency Merging Analyzer (0 seconds)
[INFO] Finished Version Filter Analyzer (0 seconds)
[INFO] Finished Hint Analyzer (0 seconds)
[INFO] Created CPE Index (0 seconds)
[INFO] Skipping CPE Analysis for npm
[INFO] Finished CPE Analyzer (0 seconds)
[INFO] Finished False Positive Analyzer (0 seconds)
[INFO] Finished Cpe Suppression Analyzer (0 seconds)
[INFO] Finished NVD CVE Analyzer (0 seconds)
[INFO] Finished Vulnerability Suppression Analyzer (0 seconds)
[INFO] Finished Dependency Bundling Analyzer (0 seconds)
[INFO] Analysis Complete (1 seconds)
[WARNING]

One or more dependencies were identified with known vulnerabilities in Struts 2 DWR Plugin:

dwr-1.1.1.jar (uk.ltd.getahead:dwr:1.1.1, cpe:/a:getahead:direct_web_remoting:1.1.1) : CVE-2007-0185, CVE-2006-6916, CVE-2007-0184


See the dependency-check report for more details.


[INFO] ------------------------------------------------------------------------
[INFO] Reactor Summary:
[INFO]
[INFO] Struts 2 Bill of Materials ......................... SUCCESS [  1.358 s]
[INFO] Struts 2 ........................................... SUCCESS [56:03 min]
[INFO] Struts 2 Core ...................................... SUCCESS [01:43 min]
[INFO] Struts Plugins ..................................... SUCCESS [  4.405 s]
[INFO] Struts 2 Configuration Browser Plugin .............. SUCCESS [  4.628 s]
[INFO] Struts 2 Sitemesh Plugin ........................... SUCCESS [  5.237 s]
[INFO] Struts 2 Tiles Plugin .............................. SUCCESS [  5.800 s]
[INFO] Struts 2 DWR Plugin ................................ FAILURE [  4.044 s]
[INFO] Struts 2 Spring Plugin ............................. SKIPPED
[INFO] Struts 2 Convention Plugin ......................... SKIPPED
[INFO] Struts 2 JUnit Plugin .............................. SKIPPED
[INFO] Struts 2 JSON Plugin ............................... SKIPPED
[INFO] Struts 2 Bean Validation Plugin .................... SKIPPED
[INFO] Struts 2 Async Plugin .............................. SKIPPED
[INFO] Struts 2 Webapps ................................... SKIPPED
[INFO] Struts 2 Showcase Webapp ........................... SKIPPED
[INFO] Struts 2 REST Plugin ............................... SKIPPED
[INFO] Struts 2 Rest Showcase Webapp ...................... SKIPPED
[INFO] Struts 2 CDI Plugin ................................ SKIPPED
[INFO] Struts 2 Embedded JSP Plugin ....................... SKIPPED
[INFO] Struts 2 GXP Plugin ................................ SKIPPED
[INFO] Struts 2 Jasper Reports Plugin ..................... SKIPPED
[INFO] Struts 2 Java Templates Plugin ..................... SKIPPED
[INFO] Struts 2 JFreeChart Plugin ......................... SKIPPED
[INFO] Struts 2 OSGi Plugin ............................... SKIPPED
[INFO] Struts 2 OVal Plugin ............................... SKIPPED
[INFO] Struts 2 Pell Multipart Plugin ..................... SKIPPED
[INFO] Struts 2 Plexus Plugin ............................. SKIPPED
[INFO] Struts 2 Portlet Plugin ............................ SKIPPED
[INFO] Struts 2 Portlet Tiles Plugin ...................... SKIPPED
[INFO] DEPRECATED: Struts 2 Sitegraph Plugin .............. SKIPPED
[INFO] Struts 2 TestNG Plugin ............................. SKIPPED
[INFO] Struts OSGi Bundles ................................ SKIPPED
[INFO] Struts 2 OSGi Admin Bundle ......................... SKIPPED
[INFO] Struts 2 OSGi Demo Bundle .......................... SKIPPED
[INFO] Struts 2 Assembly .................................. SKIPPED
[INFO] ------------------------------------------------------------------------
[INFO] BUILD FAILURE
[INFO] ------------------------------------------------------------------------
[INFO] Total time: 58:14 min
[INFO] Finished at: 2018-05-06T23:27:21Z
[INFO] Final Memory: 70M/1945M
[INFO] ------------------------------------------------------------------------
[ERROR] Failed to execute goal org.owasp:dependency-check-maven:3.1.1:check (default) on project struts2-dwr-plugin:
[ERROR]
[ERROR] One or more dependencies were identified with vulnerabilities that have a CVSS score greater than or equal to '7.0':
[ERROR]
[ERROR] dwr-1.1.1.jar: CVE-2006-6916, CVE-2007-0184
[ERROR]
[ERROR] See the dependency-check report for more details.
[ERROR]
[ERROR]
[ERROR] -> [Help 1]
[ERROR]
[ERROR] To see the full stack trace of the errors, re-run Maven with the -e switch.
[ERROR] Re-run Maven using the -X switch to enable full debug logging.
[ERROR]
[ERROR] For more information about the errors and possible solutions, please read the following articles:
[ERROR] [Help 1] http://cwiki.apache.org/confluence/display/MAVEN/MojoFailureException
[ERROR]
[ERROR] After correcting the problems, you can resume the build with the command
[ERROR]   mvn <goals> -rf :struts2-dwr-plugin
Build step 'Execute shell' marked build as failure
[locks-and-latches] Releasing all the locks
[locks-and-latches] All the locks released
Setting MAVEN_3_LATEST__HOME=/home/jenkins/tools/maven/latest3/

---------------------------------------------------------------------
To unsubscribe, e-mail: [hidden email]
For additional commands, e-mail: [hidden email]

Reply | Threaded
Open this post in threaded view
|

Build failed in Jenkins: Struts-master-JDK7-dependency-check #64

Apache Jenkins Server-2
See <https://builds.apache.org/job/Struts-master-JDK7-dependency-check/64/display/redirect>

------------------------------------------
[...truncated 1.13 MB...]
[INFO] --- maven-compiler-plugin:3.5.1:compile (default-compile) @ struts2-tiles-plugin ---
[INFO] Changes detected - recompiling the module!
[INFO] Compiling 18 source files to <https://builds.apache.org/job/Struts-master-JDK7-dependency-check/ws/plugins/tiles/target/classes>
[INFO]
[INFO] --- maven-bundle-plugin:2.1.0:manifest (bundle-manifest) @ struts2-tiles-plugin ---
[WARNING] Warning in manifest for org.apache.struts:struts2-tiles-plugin:jar:2.6-SNAPSHOT : Superfluous export-package instructions: [org.apache.struts2.views, org.apache, org.apache.struts2, org]
[INFO]
[INFO] --- maven-resources-plugin:2.7:testResources (default-testResources) @ struts2-tiles-plugin ---
[INFO] Using 'UTF-8' encoding to copy filtered resources.
[INFO] skip non existing resourceDirectory <https://builds.apache.org/job/Struts-master-JDK7-dependency-check/ws/plugins/tiles/src/test/resources>
[INFO] Copying 3 resources
[INFO]
[INFO] --- maven-compiler-plugin:3.5.1:testCompile (default-testCompile) @ struts2-tiles-plugin ---
[INFO] Changes detected - recompiling the module!
[INFO] Compiling 4 source files to <https://builds.apache.org/job/Struts-master-JDK7-dependency-check/ws/plugins/tiles/target/test-classes>
[INFO]
[INFO] --- maven-surefire-plugin:2.20.1:test (default-test) @ struts2-tiles-plugin ---
[INFO]
[INFO] -------------------------------------------------------
[INFO]  T E S T S
[INFO] -------------------------------------------------------
[INFO] Running org.apache.struts2.tiles.StrutsTilesAnnotationProcessorTest
[INFO] Tests run: 6, Failures: 0, Errors: 0, Skipped: 0, Time elapsed: 0.144 s - in org.apache.struts2.tiles.StrutsTilesAnnotationProcessorTest
[INFO]
[INFO] Results:
[INFO]
[INFO] Tests run: 6, Failures: 0, Errors: 0, Skipped: 0
[INFO]
[INFO]
[INFO] --- apache-rat-plugin:0.11:check (default) @ struts2-tiles-plugin ---
[INFO] 51 implicit excludes (use -debug for more details).
[INFO] Exclude: src/main/resources/org/apache/struts2/static/domTT.js
[INFO] Exclude: src/site/resources/tags/**/*.html
[INFO] Exclude: src/main/resources/*LICENSE.txt
[INFO] Exclude: src/test/resources/**/*.txt
[INFO] Exclude: src/main/webapp/**/*.css
[INFO] Exclude: src/main/webapp/**/*.map
[INFO] Exclude: src/main/webapp/**/*.js
[INFO] Exclude: src/main/webapp/**/*.svg
[INFO] Exclude: src/main/webapp/**/*.txt
[INFO] Exclude: src/main/resources/**/sitegraph-usage.txt
[INFO] Exclude: src/main/resources/**/docs-urls.txt
[INFO] Exclude: src/etc/header.txt
[INFO] Exclude: src/main/resources/static/css/**/*.css
[INFO] Exclude: src/main/resources/static/js/**/*.js
[INFO] Exclude: src/main/resources/docs.cfg
[INFO] Exclude: src/main/webapp/fonts/**/*
[INFO] 26 resources included (use -debug for more details)
[INFO] Rat check: Summary of files. Unapproved: 0 unknown: 0 generated: 0 approved: 25 licence.
[INFO]
[INFO] --- maven-jar-plugin:3.0.0:jar (default-jar) @ struts2-tiles-plugin ---
[INFO] Building jar: <https://builds.apache.org/job/Struts-master-JDK7-dependency-check/ws/plugins/tiles/target/struts2-tiles-plugin-2.6-SNAPSHOT.jar>
[INFO]
[INFO] >>> maven-source-plugin:3.0.0:jar (attach-sources) > generate-sources @ struts2-tiles-plugin >>>
[INFO]
[INFO] <<< maven-source-plugin:3.0.0:jar (attach-sources) < generate-sources @ struts2-tiles-plugin <<<
[INFO]
[INFO]
[INFO] --- maven-source-plugin:3.0.0:jar (attach-sources) @ struts2-tiles-plugin ---
[INFO] Building jar: <https://builds.apache.org/job/Struts-master-JDK7-dependency-check/ws/plugins/tiles/target/struts2-tiles-plugin-2.6-SNAPSHOT-sources.jar>
[INFO]
[INFO] --- maven-site-plugin:3.5.1:attach-descriptor (attach-descriptor) @ struts2-tiles-plugin ---
[INFO]
[INFO] --- dependency-check-maven:3.1.1:check (default) @ struts2-tiles-plugin ---
[INFO] Checking for updates
[INFO] Skipping NVD check since last check was within 4 hours.
[INFO] Check for updates complete (297 ms)
[INFO] Analysis Started
[INFO] Finished Archive Analyzer (0 seconds)
[INFO] Finished File Name Analyzer (0 seconds)
[INFO] Finished Jar Analyzer (0 seconds)
[INFO] Finished Central Analyzer (0 seconds)
[INFO] Finished Dependency Merging Analyzer (0 seconds)
[INFO] Finished Version Filter Analyzer (0 seconds)
[INFO] Finished Hint Analyzer (0 seconds)
[INFO] Created CPE Index (0 seconds)
[INFO] Skipping CPE Analysis for npm
[INFO] Finished CPE Analyzer (0 seconds)
[INFO] Finished False Positive Analyzer (0 seconds)
[INFO] Finished Cpe Suppression Analyzer (0 seconds)
[INFO] Finished NVD CVE Analyzer (0 seconds)
[INFO] Finished Vulnerability Suppression Analyzer (0 seconds)
[INFO] Finished Dependency Bundling Analyzer (0 seconds)
[INFO] Analysis Complete (2 seconds)
[INFO]
[INFO] ------------------------------------------------------------------------
[INFO] Building Struts 2 DWR Plugin 2.6-SNAPSHOT
[INFO] ------------------------------------------------------------------------
[INFO]
[INFO] --- maven-remote-resources-plugin:1.5:process (process-resource-bundles) @ struts2-dwr-plugin ---
[INFO]
[INFO] --- maven-resources-plugin:2.7:resources (default-resources) @ struts2-dwr-plugin ---
[INFO] Using 'UTF-8' encoding to copy filtered resources.
[INFO] skip non existing resourceDirectory <https://builds.apache.org/job/Struts-master-JDK7-dependency-check/ws/plugins/dwr/src/main/resources>
[INFO] Copying 3 resources
[INFO]
[INFO] --- maven-compiler-plugin:3.5.1:compile (default-compile) @ struts2-dwr-plugin ---
[INFO] Changes detected - recompiling the module!
[INFO] Compiling 1 source file to <https://builds.apache.org/job/Struts-master-JDK7-dependency-check/ws/plugins/dwr/target/classes>
[INFO] <https://builds.apache.org/job/Struts-master-JDK7-dependency-check/ws/plugins/dwr/src/main/java/org/apache/struts2/validators/DWRValidator.java>: <https://builds.apache.org/job/Struts-master-JDK7-dependency-check/ws/plugins/dwr/src/main/java/org/apache/struts2/validators/DWRValidator.java> uses unchecked or unsafe operations.
[INFO] <https://builds.apache.org/job/Struts-master-JDK7-dependency-check/ws/plugins/dwr/src/main/java/org/apache/struts2/validators/DWRValidator.java>: Recompile with -Xlint:unchecked for details.
[INFO]
[INFO] --- maven-bundle-plugin:2.1.0:manifest (bundle-manifest) @ struts2-dwr-plugin ---
[WARNING] Warning in manifest for org.apache.struts:struts2-dwr-plugin:jar:2.6-SNAPSHOT : Superfluous export-package instructions: [org.apache, org.apache.struts2, org]
[INFO]
[INFO] --- maven-resources-plugin:2.7:testResources (default-testResources) @ struts2-dwr-plugin ---
[INFO] Using 'UTF-8' encoding to copy filtered resources.
[INFO] skip non existing resourceDirectory <https://builds.apache.org/job/Struts-master-JDK7-dependency-check/ws/plugins/dwr/src/test/resources>
[INFO] Copying 3 resources
[INFO]
[INFO] --- maven-compiler-plugin:3.5.1:testCompile (default-testCompile) @ struts2-dwr-plugin ---
[INFO] No sources to compile
[INFO]
[INFO] --- maven-surefire-plugin:2.20.1:test (default-test) @ struts2-dwr-plugin ---
[INFO]
[INFO] --- apache-rat-plugin:0.11:check (default) @ struts2-dwr-plugin ---
[INFO] 51 implicit excludes (use -debug for more details).
[INFO] Exclude: src/main/resources/org/apache/struts2/static/domTT.js
[INFO] Exclude: src/site/resources/tags/**/*.html
[INFO] Exclude: src/main/resources/*LICENSE.txt
[INFO] Exclude: src/test/resources/**/*.txt
[INFO] Exclude: src/main/webapp/**/*.css
[INFO] Exclude: src/main/webapp/**/*.map
[INFO] Exclude: src/main/webapp/**/*.js
[INFO] Exclude: src/main/webapp/**/*.svg
[INFO] Exclude: src/main/webapp/**/*.txt
[INFO] Exclude: src/main/resources/**/sitegraph-usage.txt
[INFO] Exclude: src/main/resources/**/docs-urls.txt
[INFO] Exclude: src/etc/header.txt
[INFO] Exclude: src/main/resources/static/css/**/*.css
[INFO] Exclude: src/main/resources/static/js/**/*.js
[INFO] Exclude: src/main/resources/docs.cfg
[INFO] Exclude: src/main/webapp/fonts/**/*
[INFO] 3 resources included (use -debug for more details)
[INFO] Rat check: Summary of files. Unapproved: 0 unknown: 0 generated: 0 approved: 3 licence.
[INFO]
[INFO] --- maven-jar-plugin:3.0.0:jar (default-jar) @ struts2-dwr-plugin ---
[INFO] Building jar: <https://builds.apache.org/job/Struts-master-JDK7-dependency-check/ws/plugins/dwr/target/struts2-dwr-plugin-2.6-SNAPSHOT.jar>
[INFO]
[INFO] >>> maven-source-plugin:3.0.0:jar (attach-sources) > generate-sources @ struts2-dwr-plugin >>>
[INFO]
[INFO] <<< maven-source-plugin:3.0.0:jar (attach-sources) < generate-sources @ struts2-dwr-plugin <<<
[INFO]
[INFO]
[INFO] --- maven-source-plugin:3.0.0:jar (attach-sources) @ struts2-dwr-plugin ---
[INFO] Building jar: <https://builds.apache.org/job/Struts-master-JDK7-dependency-check/ws/plugins/dwr/target/struts2-dwr-plugin-2.6-SNAPSHOT-sources.jar>
[INFO]
[INFO] --- maven-site-plugin:3.5.1:attach-descriptor (attach-descriptor) @ struts2-dwr-plugin ---
[INFO]
[INFO] --- dependency-check-maven:3.1.1:check (default) @ struts2-dwr-plugin ---
[INFO] Checking for updates
[INFO] Skipping NVD check since last check was within 4 hours.
[INFO] Check for updates complete (304 ms)
[INFO] Analysis Started
[INFO] Finished Archive Analyzer (0 seconds)
[INFO] Finished File Name Analyzer (0 seconds)
[INFO] Finished Jar Analyzer (0 seconds)
[INFO] Finished Central Analyzer (0 seconds)
[INFO] Finished Dependency Merging Analyzer (0 seconds)
[INFO] Finished Version Filter Analyzer (0 seconds)
[INFO] Finished Hint Analyzer (0 seconds)
[INFO] Created CPE Index (0 seconds)
[INFO] Skipping CPE Analysis for npm
[INFO] Finished CPE Analyzer (0 seconds)
[INFO] Finished False Positive Analyzer (0 seconds)
[INFO] Finished Cpe Suppression Analyzer (0 seconds)
[INFO] Finished NVD CVE Analyzer (0 seconds)
[INFO] Finished Vulnerability Suppression Analyzer (0 seconds)
[INFO] Finished Dependency Bundling Analyzer (0 seconds)
[INFO] Analysis Complete (1 seconds)
[WARNING]

One or more dependencies were identified with known vulnerabilities in Struts 2 DWR Plugin:

dwr-1.1.1.jar (uk.ltd.getahead:dwr:1.1.1, cpe:/a:getahead:direct_web_remoting:1.1.1) : CVE-2007-0185, CVE-2006-6916, CVE-2007-0184


See the dependency-check report for more details.


[INFO] ------------------------------------------------------------------------
[INFO] Reactor Summary:
[INFO]
[INFO] Struts 2 Bill of Materials ......................... SUCCESS [  1.778 s]
[INFO] Struts 2 ........................................... SUCCESS [31:38 min]
[INFO] Struts 2 Core ...................................... SUCCESS [02:29 min]
[INFO] Struts Plugins ..................................... SUCCESS [  5.368 s]
[INFO] Struts 2 Configuration Browser Plugin .............. SUCCESS [  5.618 s]
[INFO] Struts 2 Sitemesh Plugin ........................... SUCCESS [  6.794 s]
[INFO] Struts 2 Tiles Plugin .............................. SUCCESS [  8.921 s]
[INFO] Struts 2 DWR Plugin ................................ FAILURE [  5.197 s]
[INFO] Struts 2 Spring Plugin ............................. SKIPPED
[INFO] Struts 2 Convention Plugin ......................... SKIPPED
[INFO] Struts 2 JUnit Plugin .............................. SKIPPED
[INFO] Struts 2 JSON Plugin ............................... SKIPPED
[INFO] Struts 2 Bean Validation Plugin .................... SKIPPED
[INFO] Struts 2 Async Plugin .............................. SKIPPED
[INFO] Struts 2 Webapps ................................... SKIPPED
[INFO] Struts 2 Showcase Webapp ........................... SKIPPED
[INFO] Struts 2 REST Plugin ............................... SKIPPED
[INFO] Struts 2 Rest Showcase Webapp ...................... SKIPPED
[INFO] Struts 2 CDI Plugin ................................ SKIPPED
[INFO] Struts 2 Embedded JSP Plugin ....................... SKIPPED
[INFO] Struts 2 GXP Plugin ................................ SKIPPED
[INFO] Struts 2 Jasper Reports Plugin ..................... SKIPPED
[INFO] Struts 2 Java Templates Plugin ..................... SKIPPED
[INFO] Struts 2 JFreeChart Plugin ......................... SKIPPED
[INFO] Struts 2 OSGi Plugin ............................... SKIPPED
[INFO] Struts 2 OVal Plugin ............................... SKIPPED
[INFO] Struts 2 Pell Multipart Plugin ..................... SKIPPED
[INFO] Struts 2 Plexus Plugin ............................. SKIPPED
[INFO] Struts 2 Portlet Plugin ............................ SKIPPED
[INFO] Struts 2 Portlet Tiles Plugin ...................... SKIPPED
[INFO] DEPRECATED: Struts 2 Sitegraph Plugin .............. SKIPPED
[INFO] Struts 2 TestNG Plugin ............................. SKIPPED
[INFO] Struts OSGi Bundles ................................ SKIPPED
[INFO] Struts 2 OSGi Admin Bundle ......................... SKIPPED
[INFO] Struts 2 OSGi Demo Bundle .......................... SKIPPED
[INFO] Struts 2 Assembly .................................. SKIPPED
[INFO] ------------------------------------------------------------------------
[INFO] BUILD FAILURE
[INFO] ------------------------------------------------------------------------
[INFO] Total time: 34:44 min
[INFO] Finished at: 2018-05-10T23:58:54Z
[INFO] Final Memory: 69M/1895M
[INFO] ------------------------------------------------------------------------
[ERROR] Failed to execute goal org.owasp:dependency-check-maven:3.1.1:check (default) on project struts2-dwr-plugin:
[ERROR]
[ERROR] One or more dependencies were identified with vulnerabilities that have a CVSS score greater than or equal to '7.0':
[ERROR]
[ERROR] dwr-1.1.1.jar: CVE-2006-6916, CVE-2007-0184
[ERROR]
[ERROR] See the dependency-check report for more details.
[ERROR]
[ERROR]
[ERROR] -> [Help 1]
[ERROR]
[ERROR] To see the full stack trace of the errors, re-run Maven with the -e switch.
[ERROR] Re-run Maven using the -X switch to enable full debug logging.
[ERROR]
[ERROR] For more information about the errors and possible solutions, please read the following articles:
[ERROR] [Help 1] http://cwiki.apache.org/confluence/display/MAVEN/MojoFailureException
[ERROR]
[ERROR] After correcting the problems, you can resume the build with the command
[ERROR]   mvn <goals> -rf :struts2-dwr-plugin
Build step 'Execute shell' marked build as failure
[locks-and-latches] Releasing all the locks
[locks-and-latches] All the locks released
Setting MAVEN_3_LATEST__HOME=/home/jenkins/tools/maven/latest3/

---------------------------------------------------------------------
To unsubscribe, e-mail: [hidden email]
For additional commands, e-mail: [hidden email]

Reply | Threaded
Open this post in threaded view
|

Build failed in Jenkins: Struts-master-JDK7-dependency-check #65

Apache Jenkins Server-2
See <https://builds.apache.org/job/Struts-master-JDK7-dependency-check/65/display/redirect>

------------------------------------------
[...truncated 1.13 MB...]
[INFO] --- maven-compiler-plugin:3.5.1:compile (default-compile) @ struts2-tiles-plugin ---
[INFO] Changes detected - recompiling the module!
[INFO] Compiling 18 source files to <https://builds.apache.org/job/Struts-master-JDK7-dependency-check/ws/plugins/tiles/target/classes>
[INFO]
[INFO] --- maven-bundle-plugin:2.1.0:manifest (bundle-manifest) @ struts2-tiles-plugin ---
[WARNING] Warning in manifest for org.apache.struts:struts2-tiles-plugin:jar:2.6-SNAPSHOT : Superfluous export-package instructions: [org.apache.struts2.views, org.apache, org.apache.struts2, org]
[INFO]
[INFO] --- maven-resources-plugin:2.7:testResources (default-testResources) @ struts2-tiles-plugin ---
[INFO] Using 'UTF-8' encoding to copy filtered resources.
[INFO] skip non existing resourceDirectory <https://builds.apache.org/job/Struts-master-JDK7-dependency-check/ws/plugins/tiles/src/test/resources>
[INFO] Copying 3 resources
[INFO]
[INFO] --- maven-compiler-plugin:3.5.1:testCompile (default-testCompile) @ struts2-tiles-plugin ---
[INFO] Changes detected - recompiling the module!
[INFO] Compiling 4 source files to <https://builds.apache.org/job/Struts-master-JDK7-dependency-check/ws/plugins/tiles/target/test-classes>
[INFO]
[INFO] --- maven-surefire-plugin:2.20.1:test (default-test) @ struts2-tiles-plugin ---
[INFO]
[INFO] -------------------------------------------------------
[INFO]  T E S T S
[INFO] -------------------------------------------------------
[INFO] Running org.apache.struts2.tiles.StrutsTilesAnnotationProcessorTest
[INFO] Tests run: 6, Failures: 0, Errors: 0, Skipped: 0, Time elapsed: 0.1 s - in org.apache.struts2.tiles.StrutsTilesAnnotationProcessorTest
[INFO]
[INFO] Results:
[INFO]
[INFO] Tests run: 6, Failures: 0, Errors: 0, Skipped: 0
[INFO]
[INFO]
[INFO] --- apache-rat-plugin:0.11:check (default) @ struts2-tiles-plugin ---
[INFO] 51 implicit excludes (use -debug for more details).
[INFO] Exclude: src/main/resources/org/apache/struts2/static/domTT.js
[INFO] Exclude: src/site/resources/tags/**/*.html
[INFO] Exclude: src/main/resources/*LICENSE.txt
[INFO] Exclude: src/test/resources/**/*.txt
[INFO] Exclude: src/main/webapp/**/*.css
[INFO] Exclude: src/main/webapp/**/*.map
[INFO] Exclude: src/main/webapp/**/*.js
[INFO] Exclude: src/main/webapp/**/*.svg
[INFO] Exclude: src/main/webapp/**/*.txt
[INFO] Exclude: src/main/resources/**/sitegraph-usage.txt
[INFO] Exclude: src/main/resources/**/docs-urls.txt
[INFO] Exclude: src/etc/header.txt
[INFO] Exclude: src/main/resources/static/css/**/*.css
[INFO] Exclude: src/main/resources/static/js/**/*.js
[INFO] Exclude: src/main/resources/docs.cfg
[INFO] Exclude: src/main/webapp/fonts/**/*
[INFO] 26 resources included (use -debug for more details)
[INFO] Rat check: Summary of files. Unapproved: 0 unknown: 0 generated: 0 approved: 25 licence.
[INFO]
[INFO] --- maven-jar-plugin:3.0.0:jar (default-jar) @ struts2-tiles-plugin ---
[INFO] Building jar: <https://builds.apache.org/job/Struts-master-JDK7-dependency-check/ws/plugins/tiles/target/struts2-tiles-plugin-2.6-SNAPSHOT.jar>
[INFO]
[INFO] >>> maven-source-plugin:3.0.0:jar (attach-sources) > generate-sources @ struts2-tiles-plugin >>>
[INFO]
[INFO] <<< maven-source-plugin:3.0.0:jar (attach-sources) < generate-sources @ struts2-tiles-plugin <<<
[INFO]
[INFO]
[INFO] --- maven-source-plugin:3.0.0:jar (attach-sources) @ struts2-tiles-plugin ---
[INFO] Building jar: <https://builds.apache.org/job/Struts-master-JDK7-dependency-check/ws/plugins/tiles/target/struts2-tiles-plugin-2.6-SNAPSHOT-sources.jar>
[INFO]
[INFO] --- maven-site-plugin:3.5.1:attach-descriptor (attach-descriptor) @ struts2-tiles-plugin ---
[INFO]
[INFO] --- dependency-check-maven:3.1.1:check (default) @ struts2-tiles-plugin ---
[INFO] Checking for updates
[INFO] Skipping NVD check since last check was within 4 hours.
[INFO] Check for updates complete (210 ms)
[INFO] Analysis Started
[INFO] Finished Archive Analyzer (0 seconds)
[INFO] Finished File Name Analyzer (0 seconds)
[INFO] Finished Jar Analyzer (0 seconds)
[INFO] Finished Central Analyzer (0 seconds)
[INFO] Finished Dependency Merging Analyzer (0 seconds)
[INFO] Finished Version Filter Analyzer (0 seconds)
[INFO] Finished Hint Analyzer (0 seconds)
[INFO] Created CPE Index (0 seconds)
[INFO] Skipping CPE Analysis for npm
[INFO] Finished CPE Analyzer (0 seconds)
[INFO] Finished False Positive Analyzer (0 seconds)
[INFO] Finished Cpe Suppression Analyzer (0 seconds)
[INFO] Finished NVD CVE Analyzer (0 seconds)
[INFO] Finished Vulnerability Suppression Analyzer (0 seconds)
[INFO] Finished Dependency Bundling Analyzer (0 seconds)
[INFO] Analysis Complete (1 seconds)
[INFO]
[INFO] ------------------------------------------------------------------------
[INFO] Building Struts 2 DWR Plugin 2.6-SNAPSHOT
[INFO] ------------------------------------------------------------------------
[INFO]
[INFO] --- maven-remote-resources-plugin:1.5:process (process-resource-bundles) @ struts2-dwr-plugin ---
[INFO]
[INFO] --- maven-resources-plugin:2.7:resources (default-resources) @ struts2-dwr-plugin ---
[INFO] Using 'UTF-8' encoding to copy filtered resources.
[INFO] skip non existing resourceDirectory <https://builds.apache.org/job/Struts-master-JDK7-dependency-check/ws/plugins/dwr/src/main/resources>
[INFO] Copying 3 resources
[INFO]
[INFO] --- maven-compiler-plugin:3.5.1:compile (default-compile) @ struts2-dwr-plugin ---
[INFO] Changes detected - recompiling the module!
[INFO] Compiling 1 source file to <https://builds.apache.org/job/Struts-master-JDK7-dependency-check/ws/plugins/dwr/target/classes>
[INFO] <https://builds.apache.org/job/Struts-master-JDK7-dependency-check/ws/plugins/dwr/src/main/java/org/apache/struts2/validators/DWRValidator.java>: <https://builds.apache.org/job/Struts-master-JDK7-dependency-check/ws/plugins/dwr/src/main/java/org/apache/struts2/validators/DWRValidator.java> uses unchecked or unsafe operations.
[INFO] <https://builds.apache.org/job/Struts-master-JDK7-dependency-check/ws/plugins/dwr/src/main/java/org/apache/struts2/validators/DWRValidator.java>: Recompile with -Xlint:unchecked for details.
[INFO]
[INFO] --- maven-bundle-plugin:2.1.0:manifest (bundle-manifest) @ struts2-dwr-plugin ---
[WARNING] Warning in manifest for org.apache.struts:struts2-dwr-plugin:jar:2.6-SNAPSHOT : Superfluous export-package instructions: [org.apache, org.apache.struts2, org]
[INFO]
[INFO] --- maven-resources-plugin:2.7:testResources (default-testResources) @ struts2-dwr-plugin ---
[INFO] Using 'UTF-8' encoding to copy filtered resources.
[INFO] skip non existing resourceDirectory <https://builds.apache.org/job/Struts-master-JDK7-dependency-check/ws/plugins/dwr/src/test/resources>
[INFO] Copying 3 resources
[INFO]
[INFO] --- maven-compiler-plugin:3.5.1:testCompile (default-testCompile) @ struts2-dwr-plugin ---
[INFO] No sources to compile
[INFO]
[INFO] --- maven-surefire-plugin:2.20.1:test (default-test) @ struts2-dwr-plugin ---
[INFO]
[INFO] --- apache-rat-plugin:0.11:check (default) @ struts2-dwr-plugin ---
[INFO] 51 implicit excludes (use -debug for more details).
[INFO] Exclude: src/main/resources/org/apache/struts2/static/domTT.js
[INFO] Exclude: src/site/resources/tags/**/*.html
[INFO] Exclude: src/main/resources/*LICENSE.txt
[INFO] Exclude: src/test/resources/**/*.txt
[INFO] Exclude: src/main/webapp/**/*.css
[INFO] Exclude: src/main/webapp/**/*.map
[INFO] Exclude: src/main/webapp/**/*.js
[INFO] Exclude: src/main/webapp/**/*.svg
[INFO] Exclude: src/main/webapp/**/*.txt
[INFO] Exclude: src/main/resources/**/sitegraph-usage.txt
[INFO] Exclude: src/main/resources/**/docs-urls.txt
[INFO] Exclude: src/etc/header.txt
[INFO] Exclude: src/main/resources/static/css/**/*.css
[INFO] Exclude: src/main/resources/static/js/**/*.js
[INFO] Exclude: src/main/resources/docs.cfg
[INFO] Exclude: src/main/webapp/fonts/**/*
[INFO] 3 resources included (use -debug for more details)
[INFO] Rat check: Summary of files. Unapproved: 0 unknown: 0 generated: 0 approved: 3 licence.
[INFO]
[INFO] --- maven-jar-plugin:3.0.0:jar (default-jar) @ struts2-dwr-plugin ---
[INFO] Building jar: <https://builds.apache.org/job/Struts-master-JDK7-dependency-check/ws/plugins/dwr/target/struts2-dwr-plugin-2.6-SNAPSHOT.jar>
[INFO]
[INFO] >>> maven-source-plugin:3.0.0:jar (attach-sources) > generate-sources @ struts2-dwr-plugin >>>
[INFO]
[INFO] <<< maven-source-plugin:3.0.0:jar (attach-sources) < generate-sources @ struts2-dwr-plugin <<<
[INFO]
[INFO]
[INFO] --- maven-source-plugin:3.0.0:jar (attach-sources) @ struts2-dwr-plugin ---
[INFO] Building jar: <https://builds.apache.org/job/Struts-master-JDK7-dependency-check/ws/plugins/dwr/target/struts2-dwr-plugin-2.6-SNAPSHOT-sources.jar>
[INFO]
[INFO] --- maven-site-plugin:3.5.1:attach-descriptor (attach-descriptor) @ struts2-dwr-plugin ---
[INFO]
[INFO] --- dependency-check-maven:3.1.1:check (default) @ struts2-dwr-plugin ---
[INFO] Checking for updates
[INFO] Skipping NVD check since last check was within 4 hours.
[INFO] Check for updates complete (190 ms)
[INFO] Analysis Started
[INFO] Finished Archive Analyzer (0 seconds)
[INFO] Finished File Name Analyzer (0 seconds)
[INFO] Finished Jar Analyzer (0 seconds)
[INFO] Finished Central Analyzer (0 seconds)
[INFO] Finished Dependency Merging Analyzer (0 seconds)
[INFO] Finished Version Filter Analyzer (0 seconds)
[INFO] Finished Hint Analyzer (0 seconds)
[INFO] Created CPE Index (0 seconds)
[INFO] Skipping CPE Analysis for npm
[INFO] Finished CPE Analyzer (0 seconds)
[INFO] Finished False Positive Analyzer (0 seconds)
[INFO] Finished Cpe Suppression Analyzer (0 seconds)
[INFO] Finished NVD CVE Analyzer (0 seconds)
[INFO] Finished Vulnerability Suppression Analyzer (0 seconds)
[INFO] Finished Dependency Bundling Analyzer (0 seconds)
[INFO] Analysis Complete (1 seconds)
[WARNING]

One or more dependencies were identified with known vulnerabilities in Struts 2 DWR Plugin:

dwr-1.1.1.jar (uk.ltd.getahead:dwr:1.1.1, cpe:/a:getahead:direct_web_remoting:1.1.1) : CVE-2007-0185, CVE-2006-6916, CVE-2007-0184


See the dependency-check report for more details.


[INFO] ------------------------------------------------------------------------
[INFO] Reactor Summary:
[INFO]
[INFO] Struts 2 Bill of Materials ......................... SUCCESS [  1.396 s]
[INFO] Struts 2 ........................................... SUCCESS [19:49 min]
[INFO] Struts 2 Core ...................................... SUCCESS [01:44 min]
[INFO] Struts Plugins ..................................... SUCCESS [  4.040 s]
[INFO] Struts 2 Configuration Browser Plugin .............. SUCCESS [  4.572 s]
[INFO] Struts 2 Sitemesh Plugin ........................... SUCCESS [  4.942 s]
[INFO] Struts 2 Tiles Plugin .............................. SUCCESS [  5.846 s]
[INFO] Struts 2 DWR Plugin ................................ FAILURE [  3.880 s]
[INFO] Struts 2 Spring Plugin ............................. SKIPPED
[INFO] Struts 2 Convention Plugin ......................... SKIPPED
[INFO] Struts 2 JUnit Plugin .............................. SKIPPED
[INFO] Struts 2 JSON Plugin ............................... SKIPPED
[INFO] Struts 2 Bean Validation Plugin .................... SKIPPED
[INFO] Struts 2 Async Plugin .............................. SKIPPED
[INFO] Struts 2 Webapps ................................... SKIPPED
[INFO] Struts 2 Showcase Webapp ........................... SKIPPED
[INFO] Struts 2 REST Plugin ............................... SKIPPED
[INFO] Struts 2 Rest Showcase Webapp ...................... SKIPPED
[INFO] Struts 2 CDI Plugin ................................ SKIPPED
[INFO] Struts 2 Embedded JSP Plugin ....................... SKIPPED
[INFO] Struts 2 GXP Plugin ................................ SKIPPED
[INFO] Struts 2 Jasper Reports Plugin ..................... SKIPPED
[INFO] Struts 2 Java Templates Plugin ..................... SKIPPED
[INFO] Struts 2 JFreeChart Plugin ......................... SKIPPED
[INFO] Struts 2 OSGi Plugin ............................... SKIPPED
[INFO] Struts 2 OVal Plugin ............................... SKIPPED
[INFO] Struts 2 Pell Multipart Plugin ..................... SKIPPED
[INFO] Struts 2 Plexus Plugin ............................. SKIPPED
[INFO] Struts 2 Portlet Plugin ............................ SKIPPED
[INFO] Struts 2 Portlet Tiles Plugin ...................... SKIPPED
[INFO] DEPRECATED: Struts 2 Sitegraph Plugin .............. SKIPPED
[INFO] Struts 2 TestNG Plugin ............................. SKIPPED
[INFO] Struts OSGi Bundles ................................ SKIPPED
[INFO] Struts 2 OSGi Admin Bundle ......................... SKIPPED
[INFO] Struts 2 OSGi Demo Bundle .......................... SKIPPED
[INFO] Struts 2 Assembly .................................. SKIPPED
[INFO] ------------------------------------------------------------------------
[INFO] BUILD FAILURE
[INFO] ------------------------------------------------------------------------
[INFO] Total time: 22:00 min
[INFO] Finished at: 2018-05-13T22:50:15Z
[INFO] Final Memory: 66M/1860M
[INFO] ------------------------------------------------------------------------
[ERROR] Failed to execute goal org.owasp:dependency-check-maven:3.1.1:check (default) on project struts2-dwr-plugin:
[ERROR]
[ERROR] One or more dependencies were identified with vulnerabilities that have a CVSS score greater than or equal to '7.0':
[ERROR]
[ERROR] dwr-1.1.1.jar: CVE-2006-6916, CVE-2007-0184
[ERROR]
[ERROR] See the dependency-check report for more details.
[ERROR]
[ERROR]
[ERROR] -> [Help 1]
[ERROR]
[ERROR] To see the full stack trace of the errors, re-run Maven with the -e switch.
[ERROR] Re-run Maven using the -X switch to enable full debug logging.
[ERROR]
[ERROR] For more information about the errors and possible solutions, please read the following articles:
[ERROR] [Help 1] http://cwiki.apache.org/confluence/display/MAVEN/MojoFailureException
[ERROR]
[ERROR] After correcting the problems, you can resume the build with the command
[ERROR]   mvn <goals> -rf :struts2-dwr-plugin
Build step 'Execute shell' marked build as failure
[locks-and-latches] Releasing all the locks
[locks-and-latches] All the locks released
Setting MAVEN_3_LATEST__HOME=/home/jenkins/tools/maven/latest3/

---------------------------------------------------------------------
To unsubscribe, e-mail: [hidden email]
For additional commands, e-mail: [hidden email]

Reply | Threaded
Open this post in threaded view
|

Build failed in Jenkins: Struts-master-JDK7-dependency-check #66

Apache Jenkins Server-2
See <https://builds.apache.org/job/Struts-master-JDK7-dependency-check/66/display/redirect?page=changes>

Changes:

[loomchild] Adds sorted and navigable set support JSON plugin

[loomchild] Adds deque and queue support JSON plugin

------------------------------------------
[...truncated 1.04 MB...]
[INFO] --- maven-compiler-plugin:3.5.1:compile (default-compile) @ struts2-tiles-plugin ---
[INFO] Changes detected - recompiling the module!
[INFO] Compiling 18 source files to <https://builds.apache.org/job/Struts-master-JDK7-dependency-check/ws/plugins/tiles/target/classes>
[INFO]
[INFO] --- maven-bundle-plugin:2.1.0:manifest (bundle-manifest) @ struts2-tiles-plugin ---
[WARNING] Warning in manifest for org.apache.struts:struts2-tiles-plugin:jar:2.6-SNAPSHOT : Superfluous export-package instructions: [org.apache.struts2.views, org.apache, org.apache.struts2, org]
[INFO]
[INFO] --- maven-resources-plugin:2.7:testResources (default-testResources) @ struts2-tiles-plugin ---
[INFO] Using 'UTF-8' encoding to copy filtered resources.
[INFO] skip non existing resourceDirectory <https://builds.apache.org/job/Struts-master-JDK7-dependency-check/ws/plugins/tiles/src/test/resources>
[INFO] Copying 3 resources
[INFO]
[INFO] --- maven-compiler-plugin:3.5.1:testCompile (default-testCompile) @ struts2-tiles-plugin ---
[INFO] Changes detected - recompiling the module!
[INFO] Compiling 4 source files to <https://builds.apache.org/job/Struts-master-JDK7-dependency-check/ws/plugins/tiles/target/test-classes>
[INFO]
[INFO] --- maven-surefire-plugin:2.20.1:test (default-test) @ struts2-tiles-plugin ---
[INFO]
[INFO] -------------------------------------------------------
[INFO]  T E S T S
[INFO] -------------------------------------------------------
[INFO] Running org.apache.struts2.tiles.StrutsTilesAnnotationProcessorTest
[INFO] Tests run: 6, Failures: 0, Errors: 0, Skipped: 0, Time elapsed: 0.108 s - in org.apache.struts2.tiles.StrutsTilesAnnotationProcessorTest
[INFO]
[INFO] Results:
[INFO]
[INFO] Tests run: 6, Failures: 0, Errors: 0, Skipped: 0
[INFO]
[INFO]
[INFO] --- apache-rat-plugin:0.11:check (default) @ struts2-tiles-plugin ---
[INFO] 51 implicit excludes (use -debug for more details).
[INFO] Exclude: src/main/resources/org/apache/struts2/static/domTT.js
[INFO] Exclude: src/site/resources/tags/**/*.html
[INFO] Exclude: src/main/resources/*LICENSE.txt
[INFO] Exclude: src/test/resources/**/*.txt
[INFO] Exclude: src/main/webapp/**/*.css
[INFO] Exclude: src/main/webapp/**/*.map
[INFO] Exclude: src/main/webapp/**/*.js
[INFO] Exclude: src/main/webapp/**/*.svg
[INFO] Exclude: src/main/webapp/**/*.txt
[INFO] Exclude: src/main/resources/**/sitegraph-usage.txt
[INFO] Exclude: src/main/resources/**/docs-urls.txt
[INFO] Exclude: src/etc/header.txt
[INFO] Exclude: src/main/resources/static/css/**/*.css
[INFO] Exclude: src/main/resources/static/js/**/*.js
[INFO] Exclude: src/main/resources/docs.cfg
[INFO] Exclude: src/main/webapp/fonts/**/*
[INFO] 26 resources included (use -debug for more details)
[INFO] Rat check: Summary of files. Unapproved: 0 unknown: 0 generated: 0 approved: 25 licence.
[INFO]
[INFO] --- maven-jar-plugin:3.0.0:jar (default-jar) @ struts2-tiles-plugin ---
[INFO] Building jar: <https://builds.apache.org/job/Struts-master-JDK7-dependency-check/ws/plugins/tiles/target/struts2-tiles-plugin-2.6-SNAPSHOT.jar>
[INFO]
[INFO] >>> maven-source-plugin:3.0.0:jar (attach-sources) > generate-sources @ struts2-tiles-plugin >>>
[INFO]
[INFO] <<< maven-source-plugin:3.0.0:jar (attach-sources) < generate-sources @ struts2-tiles-plugin <<<
[INFO]
[INFO]
[INFO] --- maven-source-plugin:3.0.0:jar (attach-sources) @ struts2-tiles-plugin ---
[INFO] Building jar: <https://builds.apache.org/job/Struts-master-JDK7-dependency-check/ws/plugins/tiles/target/struts2-tiles-plugin-2.6-SNAPSHOT-sources.jar>
[INFO]
[INFO] --- maven-site-plugin:3.5.1:attach-descriptor (attach-descriptor) @ struts2-tiles-plugin ---
[INFO]
[INFO] --- dependency-check-maven:3.1.1:check (default) @ struts2-tiles-plugin ---
[INFO] Checking for updates
[INFO] Skipping NVD check since last check was within 4 hours.
[INFO] Check for updates complete (182 ms)
[INFO] Analysis Started
[INFO] Finished Archive Analyzer (0 seconds)
[INFO] Finished File Name Analyzer (0 seconds)
[INFO] Finished Jar Analyzer (0 seconds)
[INFO] Finished Central Analyzer (0 seconds)
[INFO] Finished Dependency Merging Analyzer (0 seconds)
[INFO] Finished Version Filter Analyzer (0 seconds)
[INFO] Finished Hint Analyzer (0 seconds)
[INFO] Created CPE Index (0 seconds)
[INFO] Skipping CPE Analysis for npm
[INFO] Finished CPE Analyzer (0 seconds)
[INFO] Finished False Positive Analyzer (0 seconds)
[INFO] Finished Cpe Suppression Analyzer (0 seconds)
[INFO] Finished NVD CVE Analyzer (0 seconds)
[INFO] Finished Vulnerability Suppression Analyzer (0 seconds)
[INFO] Finished Dependency Bundling Analyzer (0 seconds)
[INFO] Analysis Complete (1 seconds)
[INFO]
[INFO] ------------------------------------------------------------------------
[INFO] Building Struts 2 DWR Plugin 2.6-SNAPSHOT
[INFO] ------------------------------------------------------------------------
[INFO]
[INFO] --- maven-remote-resources-plugin:1.5:process (process-resource-bundles) @ struts2-dwr-plugin ---
[INFO]
[INFO] --- maven-resources-plugin:2.7:resources (default-resources) @ struts2-dwr-plugin ---
[INFO] Using 'UTF-8' encoding to copy filtered resources.
[INFO] skip non existing resourceDirectory <https://builds.apache.org/job/Struts-master-JDK7-dependency-check/ws/plugins/dwr/src/main/resources>
[INFO] Copying 3 resources
[INFO]
[INFO] --- maven-compiler-plugin:3.5.1:compile (default-compile) @ struts2-dwr-plugin ---
[INFO] Changes detected - recompiling the module!
[INFO] Compiling 1 source file to <https://builds.apache.org/job/Struts-master-JDK7-dependency-check/ws/plugins/dwr/target/classes>
[INFO] <https://builds.apache.org/job/Struts-master-JDK7-dependency-check/ws/plugins/dwr/src/main/java/org/apache/struts2/validators/DWRValidator.java>: <https://builds.apache.org/job/Struts-master-JDK7-dependency-check/ws/plugins/dwr/src/main/java/org/apache/struts2/validators/DWRValidator.java> uses unchecked or unsafe operations.
[INFO] <https://builds.apache.org/job/Struts-master-JDK7-dependency-check/ws/plugins/dwr/src/main/java/org/apache/struts2/validators/DWRValidator.java>: Recompile with -Xlint:unchecked for details.
[INFO]
[INFO] --- maven-bundle-plugin:2.1.0:manifest (bundle-manifest) @ struts2-dwr-plugin ---
[WARNING] Warning in manifest for org.apache.struts:struts2-dwr-plugin:jar:2.6-SNAPSHOT : Superfluous export-package instructions: [org.apache, org.apache.struts2, org]
[INFO]
[INFO] --- maven-resources-plugin:2.7:testResources (default-testResources) @ struts2-dwr-plugin ---
[INFO] Using 'UTF-8' encoding to copy filtered resources.
[INFO] skip non existing resourceDirectory <https://builds.apache.org/job/Struts-master-JDK7-dependency-check/ws/plugins/dwr/src/test/resources>
[INFO] Copying 3 resources
[INFO]
[INFO] --- maven-compiler-plugin:3.5.1:testCompile (default-testCompile) @ struts2-dwr-plugin ---
[INFO] No sources to compile
[INFO]
[INFO] --- maven-surefire-plugin:2.20.1:test (default-test) @ struts2-dwr-plugin ---
[INFO]
[INFO] --- apache-rat-plugin:0.11:check (default) @ struts2-dwr-plugin ---
[INFO] 51 implicit excludes (use -debug for more details).
[INFO] Exclude: src/main/resources/org/apache/struts2/static/domTT.js
[INFO] Exclude: src/site/resources/tags/**/*.html
[INFO] Exclude: src/main/resources/*LICENSE.txt
[INFO] Exclude: src/test/resources/**/*.txt
[INFO] Exclude: src/main/webapp/**/*.css
[INFO] Exclude: src/main/webapp/**/*.map
[INFO] Exclude: src/main/webapp/**/*.js
[INFO] Exclude: src/main/webapp/**/*.svg
[INFO] Exclude: src/main/webapp/**/*.txt
[INFO] Exclude: src/main/resources/**/sitegraph-usage.txt
[INFO] Exclude: src/main/resources/**/docs-urls.txt
[INFO] Exclude: src/etc/header.txt
[INFO] Exclude: src/main/resources/static/css/**/*.css
[INFO] Exclude: src/main/resources/static/js/**/*.js
[INFO] Exclude: src/main/resources/docs.cfg
[INFO] Exclude: src/main/webapp/fonts/**/*
[INFO] 3 resources included (use -debug for more details)
[INFO] Rat check: Summary of files. Unapproved: 0 unknown: 0 generated: 0 approved: 3 licence.
[INFO]
[INFO] --- maven-jar-plugin:3.0.0:jar (default-jar) @ struts2-dwr-plugin ---
[INFO] Building jar: <https://builds.apache.org/job/Struts-master-JDK7-dependency-check/ws/plugins/dwr/target/struts2-dwr-plugin-2.6-SNAPSHOT.jar>
[INFO]
[INFO] >>> maven-source-plugin:3.0.0:jar (attach-sources) > generate-sources @ struts2-dwr-plugin >>>
[INFO]
[INFO] <<< maven-source-plugin:3.0.0:jar (attach-sources) < generate-sources @ struts2-dwr-plugin <<<
[INFO]
[INFO]
[INFO] --- maven-source-plugin:3.0.0:jar (attach-sources) @ struts2-dwr-plugin ---
[INFO] Building jar: <https://builds.apache.org/job/Struts-master-JDK7-dependency-check/ws/plugins/dwr/target/struts2-dwr-plugin-2.6-SNAPSHOT-sources.jar>
[INFO]
[INFO] --- maven-site-plugin:3.5.1:attach-descriptor (attach-descriptor) @ struts2-dwr-plugin ---
[INFO]
[INFO] --- dependency-check-maven:3.1.1:check (default) @ struts2-dwr-plugin ---
[INFO] Checking for updates
[INFO] Skipping NVD check since last check was within 4 hours.
[INFO] Check for updates complete (216 ms)
[INFO] Analysis Started
[INFO] Finished Archive Analyzer (0 seconds)
[INFO] Finished File Name Analyzer (0 seconds)
[INFO] Finished Jar Analyzer (0 seconds)
[INFO] Finished Central Analyzer (0 seconds)
[INFO] Finished Dependency Merging Analyzer (0 seconds)
[INFO] Finished Version Filter Analyzer (0 seconds)
[INFO] Finished Hint Analyzer (0 seconds)
[INFO] Created CPE Index (0 seconds)
[INFO] Skipping CPE Analysis for npm
[INFO] Finished CPE Analyzer (0 seconds)
[INFO] Finished False Positive Analyzer (0 seconds)
[INFO] Finished Cpe Suppression Analyzer (0 seconds)
[INFO] Finished NVD CVE Analyzer (0 seconds)
[INFO] Finished Vulnerability Suppression Analyzer (0 seconds)
[INFO] Finished Dependency Bundling Analyzer (0 seconds)
[INFO] Analysis Complete (1 seconds)
[WARNING]

One or more dependencies were identified with known vulnerabilities in Struts 2 DWR Plugin:

dwr-1.1.1.jar (uk.ltd.getahead:dwr:1.1.1, cpe:/a:getahead:direct_web_remoting:1.1.1) : CVE-2007-0185, CVE-2006-6916, CVE-2007-0184


See the dependency-check report for more details.


[INFO] ------------------------------------------------------------------------
[INFO] Reactor Summary:
[INFO]
[INFO] Struts 2 Bill of Materials ......................... SUCCESS [  1.587 s]
[INFO] Struts 2 ........................................... SUCCESS [02:25 min]
[INFO] Struts 2 Core ...................................... SUCCESS [01:53 min]
[INFO] Struts Plugins ..................................... SUCCESS [  4.977 s]
[INFO] Struts 2 Configuration Browser Plugin .............. SUCCESS [  4.768 s]
[INFO] Struts 2 Sitemesh Plugin ........................... SUCCESS [  5.005 s]
[INFO] Struts 2 Tiles Plugin .............................. SUCCESS [  6.762 s]
[INFO] Struts 2 DWR Plugin ................................ FAILURE [  4.183 s]
[INFO] Struts 2 Spring Plugin ............................. SKIPPED
[INFO] Struts 2 Convention Plugin ......................... SKIPPED
[INFO] Struts 2 JUnit Plugin .............................. SKIPPED
[INFO] Struts 2 JSON Plugin ............................... SKIPPED
[INFO] Struts 2 Bean Validation Plugin .................... SKIPPED
[INFO] Struts 2 Async Plugin .............................. SKIPPED
[INFO] Struts 2 Webapps ................................... SKIPPED
[INFO] Struts 2 Showcase Webapp ........................... SKIPPED
[INFO] Struts 2 REST Plugin ............................... SKIPPED
[INFO] Struts 2 Rest Showcase Webapp ...................... SKIPPED
[INFO] Struts 2 CDI Plugin ................................ SKIPPED
[INFO] Struts 2 Embedded JSP Plugin ....................... SKIPPED
[INFO] Struts 2 GXP Plugin ................................ SKIPPED
[INFO] Struts 2 Jasper Reports Plugin ..................... SKIPPED
[INFO] Struts 2 Java Templates Plugin ..................... SKIPPED
[INFO] Struts 2 JFreeChart Plugin ......................... SKIPPED
[INFO] Struts 2 OSGi Plugin ............................... SKIPPED
[INFO] Struts 2 OVal Plugin ............................... SKIPPED
[INFO] Struts 2 Pell Multipart Plugin ..................... SKIPPED
[INFO] Struts 2 Plexus Plugin ............................. SKIPPED
[INFO] Struts 2 Portlet Plugin ............................ SKIPPED
[INFO] Struts 2 Portlet Tiles Plugin ...................... SKIPPED
[INFO] DEPRECATED: Struts 2 Sitegraph Plugin .............. SKIPPED
[INFO] Struts 2 TestNG Plugin ............................. SKIPPED
[INFO] Struts OSGi Bundles ................................ SKIPPED
[INFO] Struts 2 OSGi Admin Bundle ......................... SKIPPED
[INFO] Struts 2 OSGi Demo Bundle .......................... SKIPPED
[INFO] Struts 2 Assembly .................................. SKIPPED
[INFO] ------------------------------------------------------------------------
[INFO] BUILD FAILURE
[INFO] ------------------------------------------------------------------------
[INFO] Total time: 04:48 min
[INFO] Finished at: 2018-05-17T22:33:05Z
[INFO] Final Memory: 63M/1821M
[INFO] ------------------------------------------------------------------------
[ERROR] Failed to execute goal org.owasp:dependency-check-maven:3.1.1:check (default) on project struts2-dwr-plugin:
[ERROR]
[ERROR] One or more dependencies were identified with vulnerabilities that have a CVSS score greater than or equal to '7.0':
[ERROR]
[ERROR] dwr-1.1.1.jar: CVE-2006-6916, CVE-2007-0184
[ERROR]
[ERROR] See the dependency-check report for more details.
[ERROR]
[ERROR]
[ERROR] -> [Help 1]
[ERROR]
[ERROR] To see the full stack trace of the errors, re-run Maven with the -e switch.
[ERROR] Re-run Maven using the -X switch to enable full debug logging.
[ERROR]
[ERROR] For more information about the errors and possible solutions, please read the following articles:
[ERROR] [Help 1] http://cwiki.apache.org/confluence/display/MAVEN/MojoFailureException
[ERROR]
[ERROR] After correcting the problems, you can resume the build with the command
[ERROR]   mvn <goals> -rf :struts2-dwr-plugin
Build step 'Execute shell' marked build as failure
[locks-and-latches] Releasing all the locks
[locks-and-latches] All the locks released
Setting MAVEN_3_LATEST__HOME=/home/jenkins/tools/maven/latest3/

---------------------------------------------------------------------
To unsubscribe, e-mail: [hidden email]
For additional commands, e-mail: [hidden email]

Reply | Threaded
Open this post in threaded view
|

Build failed in Jenkins: Struts-master-JDK7-dependency-check #67

Apache Jenkins Server-2
See <https://builds.apache.org/job/Struts-master-JDK7-dependency-check/67/display/redirect?page=changes>

Changes:

[yasserzamani] upgrade Tiles to 3.0.8

------------------------------------------
[...truncated 1.12 MB...]
[INFO] --- maven-compiler-plugin:3.5.1:compile (default-compile) @ struts2-tiles-plugin ---
[INFO] Changes detected - recompiling the module!
[INFO] Compiling 18 source files to <https://builds.apache.org/job/Struts-master-JDK7-dependency-check/ws/plugins/tiles/target/classes>
[INFO]
[INFO] --- maven-bundle-plugin:2.1.0:manifest (bundle-manifest) @ struts2-tiles-plugin ---
[WARNING] Warning in manifest for org.apache.struts:struts2-tiles-plugin:jar:2.6-SNAPSHOT : Superfluous export-package instructions: [org.apache.struts2.views, org.apache, org.apache.struts2, org]
[INFO]
[INFO] --- maven-resources-plugin:2.7:testResources (default-testResources) @ struts2-tiles-plugin ---
[INFO] Using 'UTF-8' encoding to copy filtered resources.
[INFO] skip non existing resourceDirectory <https://builds.apache.org/job/Struts-master-JDK7-dependency-check/ws/plugins/tiles/src/test/resources>
[INFO] Copying 3 resources
[INFO]
[INFO] --- maven-compiler-plugin:3.5.1:testCompile (default-testCompile) @ struts2-tiles-plugin ---
[INFO] Changes detected - recompiling the module!
[INFO] Compiling 4 source files to <https://builds.apache.org/job/Struts-master-JDK7-dependency-check/ws/plugins/tiles/target/test-classes>
[INFO]
[INFO] --- maven-surefire-plugin:2.20.1:test (default-test) @ struts2-tiles-plugin ---
[INFO]
[INFO] -------------------------------------------------------
[INFO]  T E S T S
[INFO] -------------------------------------------------------
[INFO] Running org.apache.struts2.tiles.StrutsTilesAnnotationProcessorTest
[INFO] Tests run: 6, Failures: 0, Errors: 0, Skipped: 0, Time elapsed: 0.104 s - in org.apache.struts2.tiles.StrutsTilesAnnotationProcessorTest
[INFO]
[INFO] Results:
[INFO]
[INFO] Tests run: 6, Failures: 0, Errors: 0, Skipped: 0
[INFO]
[INFO]
[INFO] --- apache-rat-plugin:0.11:check (default) @ struts2-tiles-plugin ---
[INFO] 51 implicit excludes (use -debug for more details).
[INFO] Exclude: src/main/resources/org/apache/struts2/static/domTT.js
[INFO] Exclude: src/site/resources/tags/**/*.html
[INFO] Exclude: src/main/resources/*LICENSE.txt
[INFO] Exclude: src/test/resources/**/*.txt
[INFO] Exclude: src/main/webapp/**/*.css
[INFO] Exclude: src/main/webapp/**/*.map
[INFO] Exclude: src/main/webapp/**/*.js
[INFO] Exclude: src/main/webapp/**/*.svg
[INFO] Exclude: src/main/webapp/**/*.txt
[INFO] Exclude: src/main/resources/**/sitegraph-usage.txt
[INFO] Exclude: src/main/resources/**/docs-urls.txt
[INFO] Exclude: src/etc/header.txt
[INFO] Exclude: src/main/resources/static/css/**/*.css
[INFO] Exclude: src/main/resources/static/js/**/*.js
[INFO] Exclude: src/main/resources/docs.cfg
[INFO] Exclude: src/main/webapp/fonts/**/*
[INFO] 26 resources included (use -debug for more details)
[INFO] Rat check: Summary of files. Unapproved: 0 unknown: 0 generated: 0 approved: 25 licence.
[INFO]
[INFO] --- maven-jar-plugin:3.0.0:jar (default-jar) @ struts2-tiles-plugin ---
[INFO] Building jar: <https://builds.apache.org/job/Struts-master-JDK7-dependency-check/ws/plugins/tiles/target/struts2-tiles-plugin-2.6-SNAPSHOT.jar>
[INFO]
[INFO] >>> maven-source-plugin:3.0.0:jar (attach-sources) > generate-sources @ struts2-tiles-plugin >>>
[INFO]
[INFO] <<< maven-source-plugin:3.0.0:jar (attach-sources) < generate-sources @ struts2-tiles-plugin <<<
[INFO]
[INFO]
[INFO] --- maven-source-plugin:3.0.0:jar (attach-sources) @ struts2-tiles-plugin ---
[INFO] Building jar: <https://builds.apache.org/job/Struts-master-JDK7-dependency-check/ws/plugins/tiles/target/struts2-tiles-plugin-2.6-SNAPSHOT-sources.jar>
[INFO]
[INFO] --- maven-site-plugin:3.5.1:attach-descriptor (attach-descriptor) @ struts2-tiles-plugin ---
[INFO]
[INFO] --- dependency-check-maven:3.1.1:check (default) @ struts2-tiles-plugin ---
[INFO] Checking for updates
[INFO] Skipping NVD check since last check was within 4 hours.
[INFO] Check for updates complete (182 ms)
[INFO] Analysis Started
[INFO] Finished Archive Analyzer (0 seconds)
[INFO] Finished File Name Analyzer (0 seconds)
[INFO] Finished Jar Analyzer (0 seconds)
[INFO] Finished Central Analyzer (0 seconds)
[INFO] Finished Dependency Merging Analyzer (0 seconds)
[INFO] Finished Version Filter Analyzer (0 seconds)
[INFO] Finished Hint Analyzer (0 seconds)
[INFO] Created CPE Index (0 seconds)
[INFO] Skipping CPE Analysis for npm
[INFO] Finished CPE Analyzer (0 seconds)
[INFO] Finished False Positive Analyzer (0 seconds)
[INFO] Finished Cpe Suppression Analyzer (0 seconds)
[INFO] Finished NVD CVE Analyzer (0 seconds)
[INFO] Finished Vulnerability Suppression Analyzer (0 seconds)
[INFO] Finished Dependency Bundling Analyzer (0 seconds)
[INFO] Analysis Complete (1 seconds)
[INFO]
[INFO] ------------------------------------------------------------------------
[INFO] Building Struts 2 DWR Plugin 2.6-SNAPSHOT
[INFO] ------------------------------------------------------------------------
[INFO]
[INFO] --- maven-remote-resources-plugin:1.5:process (process-resource-bundles) @ struts2-dwr-plugin ---
[INFO]
[INFO] --- maven-resources-plugin:2.7:resources (default-resources) @ struts2-dwr-plugin ---
[INFO] Using 'UTF-8' encoding to copy filtered resources.
[INFO] skip non existing resourceDirectory <https://builds.apache.org/job/Struts-master-JDK7-dependency-check/ws/plugins/dwr/src/main/resources>
[INFO] Copying 3 resources
[INFO]
[INFO] --- maven-compiler-plugin:3.5.1:compile (default-compile) @ struts2-dwr-plugin ---
[INFO] Changes detected - recompiling the module!
[INFO] Compiling 1 source file to <https://builds.apache.org/job/Struts-master-JDK7-dependency-check/ws/plugins/dwr/target/classes>
[INFO] <https://builds.apache.org/job/Struts-master-JDK7-dependency-check/ws/plugins/dwr/src/main/java/org/apache/struts2/validators/DWRValidator.java>: <https://builds.apache.org/job/Struts-master-JDK7-dependency-check/ws/plugins/dwr/src/main/java/org/apache/struts2/validators/DWRValidator.java> uses unchecked or unsafe operations.
[INFO] <https://builds.apache.org/job/Struts-master-JDK7-dependency-check/ws/plugins/dwr/src/main/java/org/apache/struts2/validators/DWRValidator.java>: Recompile with -Xlint:unchecked for details.
[INFO]
[INFO] --- maven-bundle-plugin:2.1.0:manifest (bundle-manifest) @ struts2-dwr-plugin ---
[WARNING] Warning in manifest for org.apache.struts:struts2-dwr-plugin:jar:2.6-SNAPSHOT : Superfluous export-package instructions: [org.apache, org.apache.struts2, org]
[INFO]
[INFO] --- maven-resources-plugin:2.7:testResources (default-testResources) @ struts2-dwr-plugin ---
[INFO] Using 'UTF-8' encoding to copy filtered resources.
[INFO] skip non existing resourceDirectory <https://builds.apache.org/job/Struts-master-JDK7-dependency-check/ws/plugins/dwr/src/test/resources>
[INFO] Copying 3 resources
[INFO]
[INFO] --- maven-compiler-plugin:3.5.1:testCompile (default-testCompile) @ struts2-dwr-plugin ---
[INFO] No sources to compile
[INFO]
[INFO] --- maven-surefire-plugin:2.20.1:test (default-test) @ struts2-dwr-plugin ---
[INFO]
[INFO] --- apache-rat-plugin:0.11:check (default) @ struts2-dwr-plugin ---
[INFO] 51 implicit excludes (use -debug for more details).
[INFO] Exclude: src/main/resources/org/apache/struts2/static/domTT.js
[INFO] Exclude: src/site/resources/tags/**/*.html
[INFO] Exclude: src/main/resources/*LICENSE.txt
[INFO] Exclude: src/test/resources/**/*.txt
[INFO] Exclude: src/main/webapp/**/*.css
[INFO] Exclude: src/main/webapp/**/*.map
[INFO] Exclude: src/main/webapp/**/*.js
[INFO] Exclude: src/main/webapp/**/*.svg
[INFO] Exclude: src/main/webapp/**/*.txt
[INFO] Exclude: src/main/resources/**/sitegraph-usage.txt
[INFO] Exclude: src/main/resources/**/docs-urls.txt
[INFO] Exclude: src/etc/header.txt
[INFO] Exclude: src/main/resources/static/css/**/*.css
[INFO] Exclude: src/main/resources/static/js/**/*.js
[INFO] Exclude: src/main/resources/docs.cfg
[INFO] Exclude: src/main/webapp/fonts/**/*
[INFO] 3 resources included (use -debug for more details)
[INFO] Rat check: Summary of files. Unapproved: 0 unknown: 0 generated: 0 approved: 3 licence.
[INFO]
[INFO] --- maven-jar-plugin:3.0.0:jar (default-jar) @ struts2-dwr-plugin ---
[INFO] Building jar: <https://builds.apache.org/job/Struts-master-JDK7-dependency-check/ws/plugins/dwr/target/struts2-dwr-plugin-2.6-SNAPSHOT.jar>
[INFO]
[INFO] >>> maven-source-plugin:3.0.0:jar (attach-sources) > generate-sources @ struts2-dwr-plugin >>>
[INFO]
[INFO] <<< maven-source-plugin:3.0.0:jar (attach-sources) < generate-sources @ struts2-dwr-plugin <<<
[INFO]
[INFO]
[INFO] --- maven-source-plugin:3.0.0:jar (attach-sources) @ struts2-dwr-plugin ---
[INFO] Building jar: <https://builds.apache.org/job/Struts-master-JDK7-dependency-check/ws/plugins/dwr/target/struts2-dwr-plugin-2.6-SNAPSHOT-sources.jar>
[INFO]
[INFO] --- maven-site-plugin:3.5.1:attach-descriptor (attach-descriptor) @ struts2-dwr-plugin ---
[INFO]
[INFO] --- dependency-check-maven:3.1.1:check (default) @ struts2-dwr-plugin ---
[INFO] Checking for updates
[INFO] Skipping NVD check since last check was within 4 hours.
[INFO] Check for updates complete (182 ms)
[INFO] Analysis Started
[INFO] Finished Archive Analyzer (0 seconds)
[INFO] Finished File Name Analyzer (0 seconds)
[INFO] Finished Jar Analyzer (0 seconds)
[INFO] Finished Central Analyzer (0 seconds)
[INFO] Finished Dependency Merging Analyzer (0 seconds)
[INFO] Finished Version Filter Analyzer (0 seconds)
[INFO] Finished Hint Analyzer (0 seconds)
[INFO] Created CPE Index (0 seconds)
[INFO] Skipping CPE Analysis for npm
[INFO] Finished CPE Analyzer (0 seconds)
[INFO] Finished False Positive Analyzer (0 seconds)
[INFO] Finished Cpe Suppression Analyzer (0 seconds)
[INFO] Finished NVD CVE Analyzer (0 seconds)
[INFO] Finished Vulnerability Suppression Analyzer (0 seconds)
[INFO] Finished Dependency Bundling Analyzer (0 seconds)
[INFO] Analysis Complete (1 seconds)
[WARNING]

One or more dependencies were identified with known vulnerabilities in Struts 2 DWR Plugin:

dwr-1.1.1.jar (uk.ltd.getahead:dwr:1.1.1, cpe:/a:getahead:direct_web_remoting:1.1.1) : CVE-2007-0185, CVE-2006-6916, CVE-2007-0184


See the dependency-check report for more details.


[INFO] ------------------------------------------------------------------------
[INFO] Reactor Summary:
[INFO]
[INFO] Struts 2 Bill of Materials ......................... SUCCESS [  1.691 s]
[INFO] Struts 2 ........................................... SUCCESS [02:16 min]
[INFO] Struts 2 Core ...................................... SUCCESS [01:45 min]
[INFO] Struts Plugins ..................................... SUCCESS [  4.140 s]
[INFO] Struts 2 Configuration Browser Plugin .............. SUCCESS [  4.277 s]
[INFO] Struts 2 Sitemesh Plugin ........................... SUCCESS [  5.041 s]
[INFO] Struts 2 Tiles Plugin .............................. SUCCESS [  6.816 s]
[INFO] Struts 2 DWR Plugin ................................ FAILURE [  4.021 s]
[INFO] Struts 2 Spring Plugin ............................. SKIPPED
[INFO] Struts 2 Convention Plugin ......................... SKIPPED
[INFO] Struts 2 JUnit Plugin .............................. SKIPPED
[INFO] Struts 2 JSON Plugin ............................... SKIPPED
[INFO] Struts 2 Bean Validation Plugin .................... SKIPPED
[INFO] Struts 2 Async Plugin .............................. SKIPPED
[INFO] Struts 2 Webapps ................................... SKIPPED
[INFO] Struts 2 Showcase Webapp ........................... SKIPPED
[INFO] Struts 2 REST Plugin ............................... SKIPPED
[INFO] Struts 2 Rest Showcase Webapp ...................... SKIPPED
[INFO] Struts 2 CDI Plugin ................................ SKIPPED
[INFO] Struts 2 Embedded JSP Plugin ....................... SKIPPED
[INFO] Struts 2 GXP Plugin ................................ SKIPPED
[INFO] Struts 2 Jasper Reports Plugin ..................... SKIPPED
[INFO] Struts 2 Java Templates Plugin ..................... SKIPPED
[INFO] Struts 2 JFreeChart Plugin ......................... SKIPPED
[INFO] Struts 2 OSGi Plugin ............................... SKIPPED
[INFO] Struts 2 OVal Plugin ............................... SKIPPED
[INFO] Struts 2 Pell Multipart Plugin ..................... SKIPPED
[INFO] Struts 2 Plexus Plugin ............................. SKIPPED
[INFO] Struts 2 Portlet Plugin ............................ SKIPPED
[INFO] Struts 2 Portlet Tiles Plugin ...................... SKIPPED
[INFO] DEPRECATED: Struts 2 Sitegraph Plugin .............. SKIPPED
[INFO] Struts 2 TestNG Plugin ............................. SKIPPED
[INFO] Struts OSGi Bundles ................................ SKIPPED
[INFO] Struts 2 OSGi Admin Bundle ......................... SKIPPED
[INFO] Struts 2 OSGi Demo Bundle .......................... SKIPPED
[INFO] Struts 2 Assembly .................................. SKIPPED
[INFO] ------------------------------------------------------------------------
[INFO] BUILD FAILURE
[INFO] ------------------------------------------------------------------------
[INFO] Total time: 04:30 min
[INFO] Finished at: 2018-05-20T22:32:45Z
[INFO] Final Memory: 79M/1903M
[INFO] ------------------------------------------------------------------------
[ERROR] Failed to execute goal org.owasp:dependency-check-maven:3.1.1:check (default) on project struts2-dwr-plugin:
[ERROR]
[ERROR] One or more dependencies were identified with vulnerabilities that have a CVSS score greater than or equal to '7.0':
[ERROR]
[ERROR] dwr-1.1.1.jar: CVE-2006-6916, CVE-2007-0184
[ERROR]
[ERROR] See the dependency-check report for more details.
[ERROR]
[ERROR]
[ERROR] -> [Help 1]
[ERROR]
[ERROR] To see the full stack trace of the errors, re-run Maven with the -e switch.
[ERROR] Re-run Maven using the -X switch to enable full debug logging.
[ERROR]
[ERROR] For more information about the errors and possible solutions, please read the following articles:
[ERROR] [Help 1] http://cwiki.apache.org/confluence/display/MAVEN/MojoFailureException
[ERROR]
[ERROR] After correcting the problems, you can resume the build with the command
[ERROR]   mvn <goals> -rf :struts2-dwr-plugin
Build step 'Execute shell' marked build as failure
[locks-and-latches] Releasing all the locks
[locks-and-latches] All the locks released
Setting MAVEN_3_LATEST__HOME=/home/jenkins/tools/maven/latest3/

---------------------------------------------------------------------
To unsubscribe, e-mail: [hidden email]
For additional commands, e-mail: [hidden email]

Reply | Threaded
Open this post in threaded view
|

Build failed in Jenkins: Struts-master-JDK7-dependency-check #68

Apache Jenkins Server-2
See <https://builds.apache.org/job/Struts-master-JDK7-dependency-check/68/display/redirect?page=changes>

Changes:

[yasserzamani] honor .properties file before the generic parametrics

[stefaan.dutry] drop searchValueStack attribute from the s:text tag

[stefaan.dutry] drop deprecated logging layer

[stefaan.dutry] remove TimerInterceptor

[stefaan.dutry] remove ObjectProfiler

[stefaan.dutry] remove UtilTimerStack

[stefaan.dutry] fix RestActionInvocation

[stefaan.dutry] remove ProfilingTimerBean

[stefaan.dutry] further clean up after rmoving profiling layer

[stefaan.dutry] update commons-beanutils dependency to version 1.9.3

------------------------------------------
[...truncated 1.28 MB...]
[INFO] --- maven-compiler-plugin:3.5.1:compile (default-compile) @ struts2-tiles-plugin ---
[INFO] Changes detected - recompiling the module!
[INFO] Compiling 18 source files to <https://builds.apache.org/job/Struts-master-JDK7-dependency-check/ws/plugins/tiles/target/classes>
[INFO]
[INFO] --- maven-bundle-plugin:2.1.0:manifest (bundle-manifest) @ struts2-tiles-plugin ---
[WARNING] Warning in manifest for org.apache.struts:struts2-tiles-plugin:jar:2.6-SNAPSHOT : Superfluous export-package instructions: [org.apache.struts2.views, org.apache, org.apache.struts2, org]
[INFO]
[INFO] --- maven-resources-plugin:2.7:testResources (default-testResources) @ struts2-tiles-plugin ---
[INFO] Using 'UTF-8' encoding to copy filtered resources.
[INFO] skip non existing resourceDirectory <https://builds.apache.org/job/Struts-master-JDK7-dependency-check/ws/plugins/tiles/src/test/resources>
[INFO] Copying 3 resources
[INFO]
[INFO] --- maven-compiler-plugin:3.5.1:testCompile (default-testCompile) @ struts2-tiles-plugin ---
[INFO] Changes detected - recompiling the module!
[INFO] Compiling 4 source files to <https://builds.apache.org/job/Struts-master-JDK7-dependency-check/ws/plugins/tiles/target/test-classes>
[INFO]
[INFO] --- maven-surefire-plugin:2.20.1:test (default-test) @ struts2-tiles-plugin ---
[INFO]
[INFO] -------------------------------------------------------
[INFO]  T E S T S
[INFO] -------------------------------------------------------
[INFO] Running org.apache.struts2.tiles.StrutsTilesAnnotationProcessorTest
[INFO] Tests run: 6, Failures: 0, Errors: 0, Skipped: 0, Time elapsed: 0.182 s - in org.apache.struts2.tiles.StrutsTilesAnnotationProcessorTest
[INFO]
[INFO] Results:
[INFO]
[INFO] Tests run: 6, Failures: 0, Errors: 0, Skipped: 0
[INFO]
[INFO]
[INFO] --- apache-rat-plugin:0.11:check (default) @ struts2-tiles-plugin ---
[INFO] 51 implicit excludes (use -debug for more details).
[INFO] Exclude: src/main/resources/org/apache/struts2/static/domTT.js
[INFO] Exclude: src/site/resources/tags/**/*.html
[INFO] Exclude: src/main/resources/*LICENSE.txt
[INFO] Exclude: src/test/resources/**/*.txt
[INFO] Exclude: src/main/webapp/**/*.css
[INFO] Exclude: src/main/webapp/**/*.map
[INFO] Exclude: src/main/webapp/**/*.js
[INFO] Exclude: src/main/webapp/**/*.svg
[INFO] Exclude: src/main/webapp/**/*.txt
[INFO] Exclude: src/main/resources/**/sitegraph-usage.txt
[INFO] Exclude: src/main/resources/**/docs-urls.txt
[INFO] Exclude: src/etc/header.txt
[INFO] Exclude: src/main/resources/static/css/**/*.css
[INFO] Exclude: src/main/resources/static/js/**/*.js
[INFO] Exclude: src/main/resources/docs.cfg
[INFO] Exclude: src/main/webapp/fonts/**/*
[INFO] 26 resources included (use -debug for more details)
[INFO] Rat check: Summary of files. Unapproved: 0 unknown: 0 generated: 0 approved: 25 licence.
[INFO]
[INFO] --- maven-jar-plugin:3.0.0:jar (default-jar) @ struts2-tiles-plugin ---
[INFO] Building jar: <https://builds.apache.org/job/Struts-master-JDK7-dependency-check/ws/plugins/tiles/target/struts2-tiles-plugin-2.6-SNAPSHOT.jar>
[INFO]
[INFO] >>> maven-source-plugin:3.0.0:jar (attach-sources) > generate-sources @ struts2-tiles-plugin >>>
[INFO]
[INFO] <<< maven-source-plugin:3.0.0:jar (attach-sources) < generate-sources @ struts2-tiles-plugin <<<
[INFO]
[INFO]
[INFO] --- maven-source-plugin:3.0.0:jar (attach-sources) @ struts2-tiles-plugin ---
[INFO] Building jar: <https://builds.apache.org/job/Struts-master-JDK7-dependency-check/ws/plugins/tiles/target/struts2-tiles-plugin-2.6-SNAPSHOT-sources.jar>
[INFO]
[INFO] --- maven-site-plugin:3.5.1:attach-descriptor (attach-descriptor) @ struts2-tiles-plugin ---
[INFO]
[INFO] --- dependency-check-maven:3.1.1:check (default) @ struts2-tiles-plugin ---
[INFO] Checking for updates
[INFO] Skipping NVD check since last check was within 4 hours.
[INFO] Check for updates complete (189 ms)
[INFO] Analysis Started
[INFO] Finished Archive Analyzer (0 seconds)
[INFO] Finished File Name Analyzer (0 seconds)
[INFO] Finished Jar Analyzer (0 seconds)
[INFO] Finished Central Analyzer (0 seconds)
[INFO] Finished Dependency Merging Analyzer (0 seconds)
[INFO] Finished Version Filter Analyzer (0 seconds)
[INFO] Finished Hint Analyzer (0 seconds)
[INFO] Created CPE Index (0 seconds)
[INFO] Skipping CPE Analysis for npm
[INFO] Finished CPE Analyzer (1 seconds)
[INFO] Finished False Positive Analyzer (0 seconds)
[INFO] Finished Cpe Suppression Analyzer (0 seconds)
[INFO] Finished NVD CVE Analyzer (0 seconds)
[INFO] Finished Vulnerability Suppression Analyzer (0 seconds)
[INFO] Finished Dependency Bundling Analyzer (0 seconds)
[INFO] Analysis Complete (2 seconds)
[INFO]
[INFO] ------------------------------------------------------------------------
[INFO] Building Struts 2 DWR Plugin 2.6-SNAPSHOT
[INFO] ------------------------------------------------------------------------
[INFO]
[INFO] --- maven-remote-resources-plugin:1.5:process (process-resource-bundles) @ struts2-dwr-plugin ---
[INFO]
[INFO] --- maven-resources-plugin:2.7:resources (default-resources) @ struts2-dwr-plugin ---
[INFO] Using 'UTF-8' encoding to copy filtered resources.
[INFO] skip non existing resourceDirectory <https://builds.apache.org/job/Struts-master-JDK7-dependency-check/ws/plugins/dwr/src/main/resources>
[INFO] Copying 3 resources
[INFO]
[INFO] --- maven-compiler-plugin:3.5.1:compile (default-compile) @ struts2-dwr-plugin ---
[INFO] Changes detected - recompiling the module!
[INFO] Compiling 1 source file to <https://builds.apache.org/job/Struts-master-JDK7-dependency-check/ws/plugins/dwr/target/classes>
[INFO] <https://builds.apache.org/job/Struts-master-JDK7-dependency-check/ws/plugins/dwr/src/main/java/org/apache/struts2/validators/DWRValidator.java>: <https://builds.apache.org/job/Struts-master-JDK7-dependency-check/ws/plugins/dwr/src/main/java/org/apache/struts2/validators/DWRValidator.java> uses unchecked or unsafe operations.
[INFO] <https://builds.apache.org/job/Struts-master-JDK7-dependency-check/ws/plugins/dwr/src/main/java/org/apache/struts2/validators/DWRValidator.java>: Recompile with -Xlint:unchecked for details.
[INFO]
[INFO] --- maven-bundle-plugin:2.1.0:manifest (bundle-manifest) @ struts2-dwr-plugin ---
[WARNING] Warning in manifest for org.apache.struts:struts2-dwr-plugin:jar:2.6-SNAPSHOT : Superfluous export-package instructions: [org.apache, org.apache.struts2, org]
[INFO]
[INFO] --- maven-resources-plugin:2.7:testResources (default-testResources) @ struts2-dwr-plugin ---
[INFO] Using 'UTF-8' encoding to copy filtered resources.
[INFO] skip non existing resourceDirectory <https://builds.apache.org/job/Struts-master-JDK7-dependency-check/ws/plugins/dwr/src/test/resources>
[INFO] Copying 3 resources
[INFO]
[INFO] --- maven-compiler-plugin:3.5.1:testCompile (default-testCompile) @ struts2-dwr-plugin ---
[INFO] No sources to compile
[INFO]
[INFO] --- maven-surefire-plugin:2.20.1:test (default-test) @ struts2-dwr-plugin ---
[INFO]
[INFO] --- apache-rat-plugin:0.11:check (default) @ struts2-dwr-plugin ---
[INFO] 51 implicit excludes (use -debug for more details).
[INFO] Exclude: src/main/resources/org/apache/struts2/static/domTT.js
[INFO] Exclude: src/site/resources/tags/**/*.html
[INFO] Exclude: src/main/resources/*LICENSE.txt
[INFO] Exclude: src/test/resources/**/*.txt
[INFO] Exclude: src/main/webapp/**/*.css
[INFO] Exclude: src/main/webapp/**/*.map
[INFO] Exclude: src/main/webapp/**/*.js
[INFO] Exclude: src/main/webapp/**/*.svg
[INFO] Exclude: src/main/webapp/**/*.txt
[INFO] Exclude: src/main/resources/**/sitegraph-usage.txt
[INFO] Exclude: src/main/resources/**/docs-urls.txt
[INFO] Exclude: src/etc/header.txt
[INFO] Exclude: src/main/resources/static/css/**/*.css
[INFO] Exclude: src/main/resources/static/js/**/*.js
[INFO] Exclude: src/main/resources/docs.cfg
[INFO] Exclude: src/main/webapp/fonts/**/*
[INFO] 3 resources included (use -debug for more details)
[INFO] Rat check: Summary of files. Unapproved: 0 unknown: 0 generated: 0 approved: 3 licence.
[INFO]
[INFO] --- maven-jar-plugin:3.0.0:jar (default-jar) @ struts2-dwr-plugin ---
[INFO] Building jar: <https://builds.apache.org/job/Struts-master-JDK7-dependency-check/ws/plugins/dwr/target/struts2-dwr-plugin-2.6-SNAPSHOT.jar>
[INFO]
[INFO] >>> maven-source-plugin:3.0.0:jar (attach-sources) > generate-sources @ struts2-dwr-plugin >>>
[INFO]
[INFO] <<< maven-source-plugin:3.0.0:jar (attach-sources) < generate-sources @ struts2-dwr-plugin <<<
[INFO]
[INFO]
[INFO] --- maven-source-plugin:3.0.0:jar (attach-sources) @ struts2-dwr-plugin ---
[INFO] Building jar: <https://builds.apache.org/job/Struts-master-JDK7-dependency-check/ws/plugins/dwr/target/struts2-dwr-plugin-2.6-SNAPSHOT-sources.jar>
[INFO]
[INFO] --- maven-site-plugin:3.5.1:attach-descriptor (attach-descriptor) @ struts2-dwr-plugin ---
[INFO]
[INFO] --- dependency-check-maven:3.1.1:check (default) @ struts2-dwr-plugin ---
[INFO] Checking for updates
[INFO] Skipping NVD check since last check was within 4 hours.
[INFO] Check for updates complete (165 ms)
[INFO] Analysis Started
[INFO] Finished Archive Analyzer (0 seconds)
[INFO] Finished File Name Analyzer (0 seconds)
[INFO] Finished Jar Analyzer (0 seconds)
[INFO] Finished Central Analyzer (0 seconds)
[INFO] Finished Dependency Merging Analyzer (0 seconds)
[INFO] Finished Version Filter Analyzer (0 seconds)
[INFO] Finished Hint Analyzer (0 seconds)
[INFO] Created CPE Index (0 seconds)
[INFO] Skipping CPE Analysis for npm
[INFO] Finished CPE Analyzer (1 seconds)
[INFO] Finished False Positive Analyzer (0 seconds)
[INFO] Finished Cpe Suppression Analyzer (0 seconds)
[INFO] Finished NVD CVE Analyzer (0 seconds)
[INFO] Finished Vulnerability Suppression Analyzer (0 seconds)
[INFO] Finished Dependency Bundling Analyzer (0 seconds)
[INFO] Analysis Complete (1 seconds)
[WARNING]

One or more dependencies were identified with known vulnerabilities in Struts 2 DWR Plugin:

dwr-1.1.1.jar (uk.ltd.getahead:dwr:1.1.1, cpe:/a:getahead:direct_web_remoting:1.1.1) : CVE-2007-0185, CVE-2006-6916, CVE-2007-0184


See the dependency-check report for more details.


[INFO] ------------------------------------------------------------------------
[INFO] Reactor Summary:
[INFO]
[INFO] Struts 2 Bill of Materials ......................... SUCCESS [  2.000 s]
[INFO] Struts 2 ........................................... SUCCESS [38:28 min]
[INFO] Struts 2 Core ...................................... SUCCESS [02:01 min]
[INFO] Struts Plugins ..................................... SUCCESS [  5.416 s]
[INFO] Struts 2 Configuration Browser Plugin .............. SUCCESS [  5.552 s]
[INFO] Struts 2 Sitemesh Plugin ........................... SUCCESS [  5.880 s]
[INFO] Struts 2 Tiles Plugin .............................. SUCCESS [  7.496 s]
[INFO] Struts 2 DWR Plugin ................................ FAILURE [  4.697 s]
[INFO] Struts 2 Spring Plugin ............................. SKIPPED
[INFO] Struts 2 Convention Plugin ......................... SKIPPED
[INFO] Struts 2 JUnit Plugin .............................. SKIPPED
[INFO] Struts 2 JSON Plugin ............................... SKIPPED
[INFO] Struts 2 Bean Validation Plugin .................... SKIPPED
[INFO] Struts 2 Async Plugin .............................. SKIPPED
[INFO] Struts 2 Webapps ................................... SKIPPED
[INFO] Struts 2 Showcase Webapp ........................... SKIPPED
[INFO] Struts 2 REST Plugin ............................... SKIPPED
[INFO] Struts 2 Rest Showcase Webapp ...................... SKIPPED
[INFO] Struts 2 CDI Plugin ................................ SKIPPED
[INFO] Struts 2 Embedded JSP Plugin ....................... SKIPPED
[INFO] Struts 2 GXP Plugin ................................ SKIPPED
[INFO] Struts 2 Jasper Reports Plugin ..................... SKIPPED
[INFO] Struts 2 Java Templates Plugin ..................... SKIPPED
[INFO] Struts 2 JFreeChart Plugin ......................... SKIPPED
[INFO] Struts 2 OSGi Plugin ............................... SKIPPED
[INFO] Struts 2 OVal Plugin ............................... SKIPPED
[INFO] Struts 2 Pell Multipart Plugin ..................... SKIPPED
[INFO] Struts 2 Plexus Plugin ............................. SKIPPED
[INFO] Struts 2 Portlet Plugin ............................ SKIPPED
[INFO] Struts 2 Portlet Tiles Plugin ...................... SKIPPED
[INFO] DEPRECATED: Struts 2 Sitegraph Plugin .............. SKIPPED
[INFO] Struts 2 TestNG Plugin ............................. SKIPPED
[INFO] Struts OSGi Bundles ................................ SKIPPED
[INFO] Struts 2 OSGi Admin Bundle ......................... SKIPPED
[INFO] Struts 2 OSGi Demo Bundle .......................... SKIPPED
[INFO] Struts 2 Assembly .................................. SKIPPED
[INFO] ------------------------------------------------------------------------
[INFO] BUILD FAILURE
[INFO] ------------------------------------------------------------------------
[INFO] Total time: 41:03 min
[INFO] Finished at: 2018-05-24T23:28:40Z
[INFO] Final Memory: 64M/1907M
[INFO] ------------------------------------------------------------------------
[ERROR] Failed to execute goal org.owasp:dependency-check-maven:3.1.1:check (default) on project struts2-dwr-plugin:
[ERROR]
[ERROR] One or more dependencies were identified with vulnerabilities that have a CVSS score greater than or equal to '7.0':
[ERROR]
[ERROR] dwr-1.1.1.jar: CVE-2006-6916, CVE-2007-0184
[ERROR]
[ERROR] See the dependency-check report for more details.
[ERROR]
[ERROR]
[ERROR] -> [Help 1]
[ERROR]
[ERROR] To see the full stack trace of the errors, re-run Maven with the -e switch.
[ERROR] Re-run Maven using the -X switch to enable full debug logging.
[ERROR]
[ERROR] For more information about the errors and possible solutions, please read the following articles:
[ERROR] [Help 1] http://cwiki.apache.org/confluence/display/MAVEN/MojoFailureException
[ERROR]
[ERROR] After correcting the problems, you can resume the build with the command
[ERROR]   mvn <goals> -rf :struts2-dwr-plugin
Build step 'Execute shell' marked build as failure
[locks-and-latches] Releasing all the locks
[locks-and-latches] All the locks released
Setting MAVEN_3_LATEST__HOME=/home/jenkins/tools/maven/latest3/

---------------------------------------------------------------------
To unsubscribe, e-mail: [hidden email]
For additional commands, e-mail: [hidden email]

12