Build failed in Jenkins: Struts-master-JDK7 #78

classic Classic list List threaded Threaded
2 messages Options
Reply | Threaded
Open this post in threaded view
|

Build failed in Jenkins: Struts-master-JDK7 #78

Apache Jenkins Server-2
See <https://builds.apache.org/job/Struts-master-JDK7/78/display/redirect?page=changes>

Changes:

[stefaan.dutry] change tabs into spaces (formatting)

[stefaan.dutry] add missing @Override annotations

[stefaan.dutry] add curly brackets (formatting)

[stefaan.dutry] change tabs into spaces (formatting)

[stefaan.dutry] change tabs into spaces (formatting)

[stefaan.dutry] add curly brackets (formatting)

[stefaan.dutry] add missing @Override annotation

[stefaan.dutry] add test for mergeTemplate method

[stefaan.dutry] add test for buildTemplateName method

[stefaan.dutry] add tests for getTemplateDir method

[stefaan.dutry] add test for setting acceskey

[stefaan.dutry] add test for parameter with name "value"

[stefaan.dutry] remove old subversion comments

------------------------------------------
[...truncated 485.55 KB...]
Generating <https://builds.apache.org/job/Struts-master-JDK7/ws/core/target/apidocs/org/apache/struts2/components/class-use/DoubleSelect.html...>
Generating <https://builds.apache.org/job/Struts-master-JDK7/ws/core/target/apidocs/org/apache/struts2/components/class-use/Push.html...>
Generating <https://builds.apache.org/job/Struts-master-JDK7/ws/core/target/apidocs/org/apache/struts2/components/class-use/Checkbox.html...>
Generating <https://builds.apache.org/job/Struts-master-JDK7/ws/core/target/apidocs/org/apache/struts2/components/class-use/FormButton.html...>
Generating <https://builds.apache.org/job/Struts-master-JDK7/ws/core/target/apidocs/org/apache/struts2/components/class-use/Bean.html...>
Generating <https://builds.apache.org/job/Struts-master-JDK7/ws/core/target/apidocs/org/apache/struts2/components/class-use/I18n.html...>
Generating <https://builds.apache.org/job/Struts-master-JDK7/ws/core/target/apidocs/org/apache/struts2/components/class-use/AppendIterator.html...>
Generating <https://builds.apache.org/job/Struts-master-JDK7/ws/core/target/apidocs/org/apache/struts2/components/class-use/UrlProvider.html...>
Generating <https://builds.apache.org/job/Struts-master-JDK7/ws/core/target/apidocs/org/apache/struts2/components/class-use/Label.html...>
Generating <https://builds.apache.org/job/Struts-master-JDK7/ws/core/target/apidocs/org/apache/struts2/components/class-use/Select.html...>
Generating <https://builds.apache.org/job/Struts-master-JDK7/ws/core/target/apidocs/org/apache/struts2/components/class-use/Anchor.html...>
Generating <https://builds.apache.org/job/Struts-master-JDK7/ws/core/target/apidocs/org/apache/struts2/components/class-use/Component.html...>
Generating <https://builds.apache.org/job/Struts-master-JDK7/ws/core/target/apidocs/org/apache/struts2/components/template/class-use/Template.html...>
Generating <https://builds.apache.org/job/Struts-master-JDK7/ws/core/target/apidocs/org/apache/struts2/components/template/class-use/TemplateEngineManager.html...>
Generating <https://builds.apache.org/job/Struts-master-JDK7/ws/core/target/apidocs/org/apache/struts2/components/template/class-use/TemplateRenderingContext.html...>
Generating <https://builds.apache.org/job/Struts-master-JDK7/ws/core/target/apidocs/org/apache/struts2/components/template/class-use/VelocityTemplateEngine.html...>
Generating <https://builds.apache.org/job/Struts-master-JDK7/ws/core/target/apidocs/org/apache/struts2/components/template/class-use/FreemarkerTemplateEngine.html...>
Generating <https://builds.apache.org/job/Struts-master-JDK7/ws/core/target/apidocs/org/apache/struts2/components/template/class-use/BaseTemplateEngine.html...>
Generating <https://builds.apache.org/job/Struts-master-JDK7/ws/core/target/apidocs/org/apache/struts2/components/template/class-use/JspTemplateEngine.html...>
Generating <https://builds.apache.org/job/Struts-master-JDK7/ws/core/target/apidocs/org/apache/struts2/components/template/class-use/TemplateEngine.html...>
Generating <https://builds.apache.org/job/Struts-master-JDK7/ws/core/target/apidocs/com/opensymphony/xwork2/package-use.html...>
Generating <https://builds.apache.org/job/Struts-master-JDK7/ws/core/target/apidocs/com/opensymphony/xwork2/config/package-use.html...>
Generating <https://builds.apache.org/job/Struts-master-JDK7/ws/core/target/apidocs/com/opensymphony/xwork2/config/entities/package-use.html...>
Generating <https://builds.apache.org/job/Struts-master-JDK7/ws/core/target/apidocs/com/opensymphony/xwork2/config/impl/package-use.html...>
Generating <https://builds.apache.org/job/Struts-master-JDK7/ws/core/target/apidocs/com/opensymphony/xwork2/config/providers/package-use.html...>
Generating <https://builds.apache.org/job/Struts-master-JDK7/ws/core/target/apidocs/com/opensymphony/xwork2/conversion/package-use.html...>
Generating <https://builds.apache.org/job/Struts-master-JDK7/ws/core/target/apidocs/com/opensymphony/xwork2/conversion/annotations/package-use.html...>
Generating <https://builds.apache.org/job/Struts-master-JDK7/ws/core/target/apidocs/com/opensymphony/xwork2/conversion/impl/package-use.html...>
Generating <https://builds.apache.org/job/Struts-master-JDK7/ws/core/target/apidocs/com/opensymphony/xwork2/conversion/metadata/package-use.html...>
Generating <https://builds.apache.org/job/Struts-master-JDK7/ws/core/target/apidocs/com/opensymphony/xwork2/factory/package-use.html...>
Generating <https://builds.apache.org/job/Struts-master-JDK7/ws/core/target/apidocs/com/opensymphony/xwork2/inject/package-use.html...>
Generating <https://builds.apache.org/job/Struts-master-JDK7/ws/core/target/apidocs/com/opensymphony/xwork2/inject/util/package-use.html...>
Generating <https://builds.apache.org/job/Struts-master-JDK7/ws/core/target/apidocs/com/opensymphony/xwork2/interceptor/package-use.html...>
Generating <https://builds.apache.org/job/Struts-master-JDK7/ws/core/target/apidocs/com/opensymphony/xwork2/interceptor/annotations/package-use.html...>
Generating <https://builds.apache.org/job/Struts-master-JDK7/ws/core/target/apidocs/com/opensymphony/xwork2/mock/package-use.html...>
Generating <https://builds.apache.org/job/Struts-master-JDK7/ws/core/target/apidocs/com/opensymphony/xwork2/ognl/package-use.html...>
Generating <https://builds.apache.org/job/Struts-master-JDK7/ws/core/target/apidocs/com/opensymphony/xwork2/ognl/accessor/package-use.html...>
Generating <https://builds.apache.org/job/Struts-master-JDK7/ws/core/target/apidocs/com/opensymphony/xwork2/result/package-use.html...>
Generating <https://builds.apache.org/job/Struts-master-JDK7/ws/core/target/apidocs/com/opensymphony/xwork2/security/package-use.html...>
Generating <https://builds.apache.org/job/Struts-master-JDK7/ws/core/target/apidocs/com/opensymphony/xwork2/spring/package-use.html...>
Generating <https://builds.apache.org/job/Struts-master-JDK7/ws/core/target/apidocs/com/opensymphony/xwork2/spring/interceptor/package-use.html...>
Generating <https://builds.apache.org/job/Struts-master-JDK7/ws/core/target/apidocs/com/opensymphony/xwork2/test/package-use.html...>
Generating <https://builds.apache.org/job/Struts-master-JDK7/ws/core/target/apidocs/com/opensymphony/xwork2/util/package-use.html...>
Generating <https://builds.apache.org/job/Struts-master-JDK7/ws/core/target/apidocs/com/opensymphony/xwork2/util/classloader/package-use.html...>
Generating <https://builds.apache.org/job/Struts-master-JDK7/ws/core/target/apidocs/com/opensymphony/xwork2/util/finder/package-use.html...>
Generating <https://builds.apache.org/job/Struts-master-JDK7/ws/core/target/apidocs/com/opensymphony/xwork2/util/fs/package-use.html...>
Generating <https://builds.apache.org/job/Struts-master-JDK7/ws/core/target/apidocs/com/opensymphony/xwork2/util/location/package-use.html...>
Generating <https://builds.apache.org/job/Struts-master-JDK7/ws/core/target/apidocs/com/opensymphony/xwork2/util/logging/package-use.html...>
Generating <https://builds.apache.org/job/Struts-master-JDK7/ws/core/target/apidocs/com/opensymphony/xwork2/util/logging/commons/package-use.html...>
Generating <https://builds.apache.org/job/Struts-master-JDK7/ws/core/target/apidocs/com/opensymphony/xwork2/util/logging/jdk/package-use.html...>
Generating <https://builds.apache.org/job/Struts-master-JDK7/ws/core/target/apidocs/com/opensymphony/xwork2/util/logging/log4j2/package-use.html...>
Generating <https://builds.apache.org/job/Struts-master-JDK7/ws/core/target/apidocs/com/opensymphony/xwork2/util/logging/slf4j/package-use.html...>
Generating <https://builds.apache.org/job/Struts-master-JDK7/ws/core/target/apidocs/com/opensymphony/xwork2/util/profiling/package-use.html...>
Generating <https://builds.apache.org/job/Struts-master-JDK7/ws/core/target/apidocs/com/opensymphony/xwork2/util/reflection/package-use.html...>
Generating <https://builds.apache.org/job/Struts-master-JDK7/ws/core/target/apidocs/com/opensymphony/xwork2/validator/package-use.html...>
Generating <https://builds.apache.org/job/Struts-master-JDK7/ws/core/target/apidocs/com/opensymphony/xwork2/validator/annotations/package-use.html...>
Generating <https://builds.apache.org/job/Struts-master-JDK7/ws/core/target/apidocs/com/opensymphony/xwork2/validator/validators/package-use.html...>
Generating <https://builds.apache.org/job/Struts-master-JDK7/ws/core/target/apidocs/org/apache/struts2/package-use.html...>
Generating <https://builds.apache.org/job/Struts-master-JDK7/ws/core/target/apidocs/org/apache/struts2/components/package-use.html...>
Generating <https://builds.apache.org/job/Struts-master-JDK7/ws/core/target/apidocs/org/apache/struts2/components/template/package-use.html...>
Generating <https://builds.apache.org/job/Struts-master-JDK7/ws/core/target/apidocs/org/apache/struts2/config/package-use.html...>
Generating <https://builds.apache.org/job/Struts-master-JDK7/ws/core/target/apidocs/org/apache/struts2/conversion/package-use.html...>
Generating <https://builds.apache.org/job/Struts-master-JDK7/ws/core/target/apidocs/org/apache/struts2/dispatcher/package-use.html...>
Generating <https://builds.apache.org/job/Struts-master-JDK7/ws/core/target/apidocs/org/apache/struts2/dispatcher/filter/package-use.html...>
Generating <https://builds.apache.org/job/Struts-master-JDK7/ws/core/target/apidocs/org/apache/struts2/dispatcher/listener/package-use.html...>
Generating <https://builds.apache.org/job/Struts-master-JDK7/ws/core/target/apidocs/org/apache/struts2/dispatcher/mapper/package-use.html...>
Generating <https://builds.apache.org/job/Struts-master-JDK7/ws/core/target/apidocs/org/apache/struts2/dispatcher/multipart/package-use.html...>
Generating <https://builds.apache.org/job/Struts-master-JDK7/ws/core/target/apidocs/org/apache/struts2/dispatcher/servlet/package-use.html...>
Generating <https://builds.apache.org/job/Struts-master-JDK7/ws/core/target/apidocs/org/apache/struts2/factory/package-use.html...>
Generating <https://builds.apache.org/job/Struts-master-JDK7/ws/core/target/apidocs/org/apache/struts2/interceptor/package-use.html...>
Generating <https://builds.apache.org/job/Struts-master-JDK7/ws/core/target/apidocs/org/apache/struts2/interceptor/debugging/package-use.html...>
Generating <https://builds.apache.org/job/Struts-master-JDK7/ws/core/target/apidocs/org/apache/struts2/interceptor/servlet/package-use.html...>
Generating <https://builds.apache.org/job/Struts-master-JDK7/ws/core/target/apidocs/org/apache/struts2/interceptor/validation/package-use.html...>
Generating <https://builds.apache.org/job/Struts-master-JDK7/ws/core/target/apidocs/org/apache/struts2/result/package-use.html...>
Generating <https://builds.apache.org/job/Struts-master-JDK7/ws/core/target/apidocs/org/apache/struts2/util/package-use.html...>
Generating <https://builds.apache.org/job/Struts-master-JDK7/ws/core/target/apidocs/org/apache/struts2/util/fs/package-use.html...>
Generating <https://builds.apache.org/job/Struts-master-JDK7/ws/core/target/apidocs/org/apache/struts2/util/tomcat/buf/package-use.html...>
Generating <https://builds.apache.org/job/Struts-master-JDK7/ws/core/target/apidocs/org/apache/struts2/views/package-use.html...>
Generating <https://builds.apache.org/job/Struts-master-JDK7/ws/core/target/apidocs/org/apache/struts2/views/annotations/package-use.html...>
Generating <https://builds.apache.org/job/Struts-master-JDK7/ws/core/target/apidocs/org/apache/struts2/views/freemarker/package-use.html...>
Generating <https://builds.apache.org/job/Struts-master-JDK7/ws/core/target/apidocs/org/apache/struts2/views/freemarker/tags/package-use.html...>
Generating <https://builds.apache.org/job/Struts-master-JDK7/ws/core/target/apidocs/org/apache/struts2/views/jsp/package-use.html...>
Generating <https://builds.apache.org/job/Struts-master-JDK7/ws/core/target/apidocs/org/apache/struts2/views/jsp/iterator/package-use.html...>
Generating <https://builds.apache.org/job/Struts-master-JDK7/ws/core/target/apidocs/org/apache/struts2/views/jsp/ui/package-use.html...>
Generating <https://builds.apache.org/job/Struts-master-JDK7/ws/core/target/apidocs/org/apache/struts2/views/util/package-use.html...>
Generating <https://builds.apache.org/job/Struts-master-JDK7/ws/core/target/apidocs/org/apache/struts2/views/velocity/package-use.html...>
Generating <https://builds.apache.org/job/Struts-master-JDK7/ws/core/target/apidocs/org/apache/struts2/views/velocity/components/package-use.html...>
Generating <https://builds.apache.org/job/Struts-master-JDK7/ws/core/target/apidocs/org/apache/struts2/views/xslt/package-use.html...>
Building index for all the packages and classes...
Generating <https://builds.apache.org/job/Struts-master-JDK7/ws/core/target/apidocs/overview-tree.html...>
Generating <https://builds.apache.org/job/Struts-master-JDK7/ws/core/target/apidocs/index-all.html...>
Generating <https://builds.apache.org/job/Struts-master-JDK7/ws/core/target/apidocs/deprecated-list.html...>
Building index for all classes...
Generating <https://builds.apache.org/job/Struts-master-JDK7/ws/core/target/apidocs/allclasses-frame.html...>
Generating <https://builds.apache.org/job/Struts-master-JDK7/ws/core/target/apidocs/allclasses-noframe.html...>
Generating <https://builds.apache.org/job/Struts-master-JDK7/ws/core/target/apidocs/index.html...>
Generating <https://builds.apache.org/job/Struts-master-JDK7/ws/core/target/apidocs/overview-summary.html...>
Generating <https://builds.apache.org/job/Struts-master-JDK7/ws/core/target/apidocs/help-doc.html...>
[INFO] Building jar: <https://builds.apache.org/job/Struts-master-JDK7/ws/core/target/struts2-core-2.6-SNAPSHOT-javadoc.jar>
[INFO]
[INFO] --- maven-remote-resources-plugin:1.5:process (process-resource-bundles) @ struts2-core ---
[INFO]
[INFO] --- maven-resources-plugin:2.7:resources (default-resources) @ struts2-core ---
[INFO] Using 'UTF-8' encoding to copy filtered resources.
[INFO] Copying 198 resources
[INFO] Copying 3 resources
[INFO]
[INFO] --- maven-compiler-plugin:3.5.1:compile (default-compile) @ struts2-core ---
[INFO] Changes detected - recompiling the module!
[INFO] Compiling 763 source files to <https://builds.apache.org/job/Struts-master-JDK7/ws/core/target/classes>
[INFO] <https://builds.apache.org/job/Struts-master-JDK7/ws/core/src/main/java/com/opensymphony/xwork2/DefaultActionProxy.java>: Some input files use or override a deprecated API.
[INFO] <https://builds.apache.org/job/Struts-master-JDK7/ws/core/src/main/java/com/opensymphony/xwork2/DefaultActionProxy.java>: Recompile with -Xlint:deprecation for details.
[INFO] <https://builds.apache.org/job/Struts-master-JDK7/ws/core/src/main/java/org/apache/struts2/views/freemarker/tags/TagModel.java>: Some input files use unchecked or unsafe operations.
[INFO] <https://builds.apache.org/job/Struts-master-JDK7/ws/core/src/main/java/org/apache/struts2/views/freemarker/tags/TagModel.java>: Recompile with -Xlint:unchecked for details.
[INFO]
[INFO] --- jshint-maven-plugin:1.6.0:lint (default) @ struts2-core ---
Downloading from central: https://repo.maven.apache.org/maven2/org/apache/maven/maven-plugin-api/3.2.3/maven-plugin-api-3.2.3.pom
Progress (1): 2.2/3.0 kBProgress (1): 3.0 kB                        Downloaded from central: https://repo.maven.apache.org/maven2/org/apache/maven/maven-plugin-api/3.2.3/maven-plugin-api-3.2.3.pom (3.0 kB at 178 kB/s)
Downloading from central: https://repo.maven.apache.org/maven2/org/apache/maven/maven/3.2.3/maven-3.2.3.pom
Progress (1): 2.1/23 kBProgress (1): 4.9/23 kBProgress (1): 7.7/23 kBProgress (1): 10/23 kB Progress (1): 13/23 kBProgress (1): 16/23 kBProgress (1): 19/23 kBProgress (1): 21/23 kBProgress (1): 23 kB                      Downloaded from central: https://repo.maven.apache.org/maven2/org/apache/maven/maven/3.2.3/maven-3.2.3.pom (23 kB at 1.3 MB/s)
Downloading from central: https://repo.maven.apache.org/maven2/org/apache/maven/maven-model/3.2.3/maven-model-3.2.3.pom
Progress (1): 2.2/4.1 kBProgress (1): 4.1 kB                        Downloaded from central: https://repo.maven.apache.org/maven2/org/apache/maven/maven-model/3.2.3/maven-model-3.2.3.pom (4.1 kB at 296 kB/s)
Downloading from central: https://repo.maven.apache.org/maven2/org/apache/maven/maven-artifact/3.2.3/maven-artifact-3.2.3.pom
Progress (1): 2.0 kB                    Downloaded from central: https://repo.maven.apache.org/maven2/org/apache/maven/maven-artifact/3.2.3/maven-artifact-3.2.3.pom (2.0 kB at 123 kB/s)
Downloading from central: https://repo.maven.apache.org/maven2/org/apache/maven/maven-plugin-api/3.2.3/maven-plugin-api-3.2.3.jar
Downloading from central: https://repo.maven.apache.org/maven2/org/apache/maven/maven-model/3.2.3/maven-model-3.2.3.jar
Downloading from central: https://repo.maven.apache.org/maven2/org/apache/maven/maven-artifact/3.2.3/maven-artifact-3.2.3.jar
Progress (1): 2.1/46 kBProgress (1): 4.9/46 kBProgress (1): 7.7/46 kBProgress (1): 10/46 kB Progress (1): 13/46 kBProgress (2): 13/46 kB | 2.1/160 kBProgress (2): 16/46 kB | 2.1/160 kBProgress (2): 16/46 kB | 4.9/160 kBProgress (2): 19/46 kB | 4.9/160 kBProgress (2): 19/46 kB | 7.6/160 kBProgress (2): 21/46 kB | 7.6/160 kBProgress (3): 21/46 kB | 7.6/160 kB | 2.1/54 kBProgress (3): 21/46 kB | 10/160 kB | 2.1/54 kB Progress (3): 24/46 kB | 10/160 kB | 2.1/54 kBProgress (3): 24/46 kB | 10/160 kB | 4.9/54 kBProgress (3): 24/46 kB | 13/160 kB | 4.9/54 kBProgress (3): 27/46 kB | 13/160 kB | 4.9/54 kBProgress (3): 27/46 kB | 13/160 kB | 7.7/54 kBProgress (3): 27/46 kB | 16/160 kB | 7.7/54 kBProgress (3): 27/46 kB | 16/160 kB | 10/54 kB Progress (3): 30/46 kB | 16/160 kB | 10/54 kBProgress (3): 30/46 kB | 19/160 kB | 10/54 kBProgress (3): 30/46 kB | 19/160 kB | 13/54 kBProgress (3): 32/46 kB | 19/160 kB | 13/54 kBProgress (3): 32/46 kB | 21/160 kB | 13/54 kBProgress (3): 32/46 kB | 21/160 kB | 16/54 kBProgress (3): 36/46 kB | 21/160 kB | 16/54 kBProgress (3): 36/46 kB | 24/160 kB | 16/54 kBProgress (3): 36/46 kB | 24/160 kB | 19/54 kBProgress (3): 40/46 kB | 24/160 kB | 19/54 kBProgress (3): 40/46 kB | 27/160 kB | 19/54 kBProgress (3): 40/46 kB | 27/160 kB | 21/54 kBProgress (3): 44/46 kB | 27/160 kB | 21/54 kBProgress (3): 44/46 kB | 30/160 kB | 21/54 kBProgress (3): 46 kB | 30/160 kB | 21/54 kB   Progress (3): 46 kB | 30/160 kB | 24/54 kBProgress (3): 46 kB | 32/160 kB | 24/54 kBProgress (3): 46 kB | 32/160 kB | 27/54 kBProgress (3): 46 kB | 32/160 kB | 30/54 kBProgress (3): 46 kB | 32/160 kB | 32/54 kBProgress (3): 46 kB | 36/160 kB | 32/54 kBProgress (3): 46 kB | 40/160 kB | 32/54 kBProgress (3): 46 kB | 40/160 kB | 36/54 kBProgress (3): 46 kB | 44/160 kB | 36/54 kBProgress (3): 46 kB | 44/160 kB | 40/54 kBProgress (3): 46 kB | 49/160 kB | 40/54 kBProgress (3): 46 kB | 49/160 kB | 44/54 kBProgress (3): 46 kB | 49/160 kB | 49/54 kBProgress (3): 46 kB | 49/160 kB | 53/54 kBProgress (3): 46 kB | 53/160 kB | 53/54 kBProgress (3): 46 kB | 53/160 kB | 54 kB   Progress (3): 46 kB | 57/160 kB | 54 kBProgress (3): 46 kB | 61/160 kB | 54 kBProgress (3): 46 kB | 65/160 kB | 54 kBProgress (3): 46 kB | 69/160 kB | 54 kBProgress (3): 46 kB | 73/160 kB | 54 kBProgress (3): 46 kB | 77/160 kB | 54 kBProgress (3): 46 kB | 81/160 kB | 54 kBProgress (3): 46 kB | 85/160 kB | 54 kBProgress (3): 46 kB | 89/160 kB | 54 kBProgress (3): 46 kB | 94/160 kB | 54 kB                                       Downloaded from central: https://repo.maven.apache.org/maven2/org/apache/maven/maven-plugin-api/3.2.3/maven-plugin-api-3.2.3.jar (46 kB at 1.8 MB/s)
Progress (2): 98/160 kB | 54 kBProgress (2): 102/160 kB | 54 kBProgress (2): 106/160 kB | 54 kBProgress (2): 110/160 kB | 54 kBProgress (2): 114/160 kB | 54 kBProgress (2): 118/160 kB | 54 kB                                Downloaded from central: https://repo.maven.apache.org/maven2/org/apache/maven/maven-artifact/3.2.3/maven-artifact-3.2.3.jar (54 kB at 2.0 MB/s)
Progress (1): 122/160 kBProgress (1): 126/160 kBProgress (1): 130/160 kBProgress (1): 135/160 kBProgress (1): 139/160 kBProgress (1): 143/160 kBProgress (1): 147/160 kBProgress (1): 151/160 kBProgress (1): 155/160 kBProgress (1): 159/160 kBProgress (1): 160 kB                        Downloaded from central: https://repo.maven.apache.org/maven2/org/apache/maven/maven-model/3.2.3/maven-model-3.2.3.jar (160 kB at 4.2 MB/s)
[INFO] using jshint version 2.5.6
[INFO] Using configuration file: <https://builds.apache.org/job/Struts-master-JDK7/ws/core/src/main/resources/jshint.conf.js>
[WARNING] Excluding <https://builds.apache.org/job/Struts-master-JDK7/ws/core/src/main/resources/org/apache/struts2/static/domTT.js>
[INFO]   <https://builds.apache.org/job/Struts-master-JDK7/ws/core/src/main/resources/jshint.conf.js>
[INFO]   <https://builds.apache.org/job/Struts-master-JDK7/ws/core/src/main/resources/template/css_xhtml/validation.js>
[INFO]   <https://builds.apache.org/job/Struts-master-JDK7/ws/core/src/main/resources/template/xhtml/validation.js>
[INFO]   <https://builds.apache.org/job/Struts-master-JDK7/ws/core/src/main/resources/org/apache/struts2/interceptor/debugging/webconsole.js>
[INFO]   <https://builds.apache.org/job/Struts-master-JDK7/ws/core/src/main/resources/org/apache/struts2/static/optiontransferselect.js>
[INFO]   <https://builds.apache.org/job/Struts-master-JDK7/ws/core/src/main/resources/org/apache/struts2/static/inputtransferselect.js>
[INFO]   <https://builds.apache.org/job/Struts-master-JDK7/ws/core/src/main/resources/org/apache/struts2/static/utils.js>
[INFO]
[INFO] --- maven-compiler-plugin:3.5.1:compile (default) @ struts2-core ---
[INFO] Changes detected - recompiling the module!
[INFO] Compiling 763 source files to <https://builds.apache.org/job/Struts-master-JDK7/ws/core/target/classes>
[INFO] <https://builds.apache.org/job/Struts-master-JDK7/ws/core/src/main/java/com/opensymphony/xwork2/DefaultActionProxy.java>: Some input files use or override a deprecated API.
[INFO] <https://builds.apache.org/job/Struts-master-JDK7/ws/core/src/main/java/com/opensymphony/xwork2/DefaultActionProxy.java>: Recompile with -Xlint:deprecation for details.
[INFO] <https://builds.apache.org/job/Struts-master-JDK7/ws/core/src/main/java/org/apache/struts2/views/freemarker/tags/TagModel.java>: Some input files use unchecked or unsafe operations.
[INFO] <https://builds.apache.org/job/Struts-master-JDK7/ws/core/src/main/java/org/apache/struts2/views/freemarker/tags/TagModel.java>: Recompile with -Xlint:unchecked for details.
[INFO]
[INFO] --- maven-bundle-plugin:2.1.0:manifest (bundle-manifest) @ struts2-core ---
[WARNING] Warning in manifest for org.apache.struts:struts2-core:jar:2.6-SNAPSHOT : Superfluous export-package instructions: [com, template.archive, org.apache, template, com.opensymphony, org.apache.struts2.util.tomcat, org]
[INFO]
[INFO] --- maven-resources-plugin:2.7:testResources (default-testResources) @ struts2-core ---
[INFO] Using 'UTF-8' encoding to copy filtered resources.
[INFO] Copying 340 resources
[INFO] Copying 3 resources
[INFO]
[INFO] --- maven-compiler-plugin:3.5.1:testCompile (default-testCompile) @ struts2-core ---
[INFO] Changes detected - recompiling the module!
[INFO] Compiling 406 source files to <https://builds.apache.org/job/Struts-master-JDK7/ws/core/target/test-classes>
[INFO] <https://builds.apache.org/job/Struts-master-JDK7/ws/core/src/test/java/org/apache/struts2/StrutsInternalTestCase.java>: Some input files use or override a deprecated API.
[INFO] <https://builds.apache.org/job/Struts-master-JDK7/ws/core/src/test/java/org/apache/struts2/StrutsInternalTestCase.java>: Recompile with -Xlint:deprecation for details.
[INFO] <https://builds.apache.org/job/Struts-master-JDK7/ws/core/src/test/java/org/apache/struts2/components/UIBeanTest.java>: Some input files use unchecked or unsafe operations.
[INFO] <https://builds.apache.org/job/Struts-master-JDK7/ws/core/src/test/java/org/apache/struts2/components/UIBeanTest.java>: Recompile with -Xlint:unchecked for details.
[INFO]
[INFO] --- maven-surefire-plugin:2.6:test (default-test) @ struts2-core ---
Downloading from central: https://repo.maven.apache.org/maven2/org/apache/maven/surefire/surefire-booter/2.6/surefire-booter-2.6.pom
Progress (1): 2.0 kB                    Downloaded from central: https://repo.maven.apache.org/maven2/org/apache/maven/surefire/surefire-booter/2.6/surefire-booter-2.6.pom (2.0 kB at 105 kB/s)
Downloading from central: https://repo.maven.apache.org/maven2/org/apache/maven/surefire/surefire-api/2.6/surefire-api-2.6.pom
Progress (1): 2.1 kB                    Downloaded from central: https://repo.maven.apache.org/maven2/org/apache/maven/surefire/surefire-api/2.6/surefire-api-2.6.pom (2.1 kB at 139 kB/s)
Downloading from central: https://repo.maven.apache.org/maven2/org/apache/maven/surefire/maven-surefire-common/2.6/maven-surefire-common-2.6.pom
Progress (1): 2.2/3.7 kBProgress (1): 3.7 kB                        Downloaded from central: https://repo.maven.apache.org/maven2/org/apache/maven/surefire/maven-surefire-common/2.6/maven-surefire-common-2.6.pom (3.7 kB at 248 kB/s)
Downloading from central: https://repo.maven.apache.org/maven2/org/apache/maven/surefire/surefire-booter/2.6/surefire-booter-2.6.jar
Downloading from central: https://repo.maven.apache.org/maven2/org/apache/maven/surefire/surefire-api/2.6/surefire-api-2.6.jar
Downloading from central: https://repo.maven.apache.org/maven2/org/apache/maven/surefire/maven-surefire-common/2.6/maven-surefire-common-2.6.jar
Progress (1): 2.2/277 kBProgress (1): 4.9/277 kBProgress (1): 6.3/277 kBProgress (1): 9.0/277 kBProgress (1): 10/277 kB Progress (1): 13/277 kBProgress (2): 13/277 kB | 0.1/531 kBProgress (2): 14/277 kB | 0.1/531 kBProgress (2): 14/277 kB | 2.8/531 kBProgress (2): 17/277 kB | 2.8/531 kBProgress (2): 17/277 kB | 4.2/531 kBProgress (2): 19/277 kB | 4.2/531 kBProgress (2): 19/277 kB | 6.9/531 kBProgress (3): 19/277 kB | 6.9/531 kB | 2.1/22 kBProgress (3): 19/277 kB | 8.3/531 kB | 2.1/22 kBProgress (3): 21/277 kB | 8.3/531 kB | 2.1/22 kBProgress (3): 21/277 kB | 8.3/531 kB | 4.9/22 kBProgress (3): 21/277 kB | 11/531 kB | 4.9/22 kB Progress (3): 23/277 kB | 11/531 kB | 4.9/22 kBProgress (3): 23/277 kB | 12/531 kB | 4.9/22 kBProgress (3): 23/277 kB | 12/531 kB | 7.7/22 kBProgress (3): 25/277 kB | 12/531 kB | 7.7/22 kBProgress (3): 25/277 kB | 15/531 kB | 7.7/22 kBProgress (3): 27/277 kB | 15/531 kB | 7.7/22 kBProgress (3): 27/277 kB | 15/531 kB | 10/22 kB Progress (3): 27/277 kB | 16/531 kB | 10/22 kBProgress (3): 30/277 kB | 16/531 kB | 10/22 kBProgress (3): 30/277 kB | 16/531 kB | 13/22 kBProgress (3): 30/277 kB | 19/531 kB | 13/22 kBProgress (3): 31/277 kB | 19/531 kB | 13/22 kBProgress (3): 31/277 kB | 21/531 kB | 13/22 kBProgress (3): 31/277 kB | 21/531 kB | 16/22 kBProgress (3): 34/277 kB | 21/531 kB | 16/22 kBProgress (3): 34/277 kB | 21/531 kB | 19/22 kBProgress (3): 34/277 kB | 23/531 kB | 19/22 kBProgress (3): 35/277 kB | 23/531 kB | 19/22 kBProgress (3): 35/277 kB | 25/531 kB | 19/22 kBProgress (3): 35/277 kB | 25/531 kB | 21/22 kBProgress (3): 38/277 kB | 25/531 kB | 21/22 kBProgress (3): 38/277 kB | 25/531 kB | 22 kB   Progress (3): 38/277 kB | 27/531 kB | 22 kBProgress (3): 39/277 kB | 27/531 kB | 22 kBProgress (3): 39/277 kB | 29/531 kB | 22 kBProgress (3): 42/277 kB | 29/531 kB | 22 kBProgress (3): 42/277 kB | 31/531 kB | 22 kBProgress (3): 43/277 kB | 31/531 kB | 22 kBProgress (3): 43/277 kB | 33/531 kB | 22 kBProgress (3): 46/277 kB | 33/531 kB | 22 kBProgress (3): 46/277 kB | 36/531 kB | 22 kBProgress (3): 47/277 kB | 36/531 kB | 22 kBProgress (3): 47/277 kB | 37/531 kB | 22 kBProgress (3): 50/277 kB | 37/531 kB | 22 kBProgress (3): 50/277 kB | 40/531 kB | 22 kBProgress (3): 51/277 kB | 40/531 kB | 22 kBProgress (3): 51/277 kB | 41/531 kB | 22 kBProgress (3): 54/277 kB | 41/531 kB | 22 kBProgress (3): 54/277 kB | 44/531 kB | 22 kBProgress (3): 55/277 kB | 44/531 kB | 22 kBProgress (3): 55/277 kB | 45/531 kB | 22 kBProgress (3): 58/277 kB | 45/531 kB | 22 kBProgress (3): 58/277 kB | 48/531 kB | 22 kBProgress (3): 60/277 kB | 48/531 kB | 22 kBProgress (3): 60/277 kB | 49/531 kB | 22 kBProgress (3): 62/277 kB | 49/531 kB | 22 kBProgress (3): 62/277 kB | 52/531 kB | 22 kBProgress (3): 64/277 kB | 52/531 kB | 22 kBProgress (3): 64/277 kB | 53/531 kB | 22 kBProgress (3): 66/277 kB | 53/531 kB | 22 kBProgress (3): 66/277 kB | 56/531 kB | 22 kBProgress (3): 68/277 kB | 56/531 kB | 22 kBProgress (3): 68/277 kB | 57/531 kB | 22 kBProgress (3): 70/277 kB | 57/531 kB | 22 kBProgress (3): 70/277 kB | 60/531 kB | 22 kBProgress (3): 72/277 kB | 60/531 kB | 22 kBProgress (3): 72/277 kB | 62/531 kB | 22 kBProgress (3): 75/277 kB | 62/531 kB | 22 kBProgress (3): 75/277 kB | 64/531 kB | 22 kBProgress (3): 76/277 kB | 64/531 kB | 22 kBProgress (3): 76/277 kB | 66/531 kB | 22 kBProgress (3): 79/277 kB | 66/531 kB | 22 kBProgress (3): 79/277 kB | 68/531 kB | 22 kBProgress (3): 80/277 kB | 68/531 kB | 22 kBProgress (3): 80/277 kB | 70/531 kB | 22 kBProgress (3): 83/277 kB | 70/531 kB | 22 kBProgress (3): 83/277 kB | 72/531 kB | 22 kBProgress (3): 84/277 kB | 72/531 kB | 22 kBProgress (3): 84/277 kB | 74/531 kB | 22 kBProgress (3): 87/277 kB | 74/531 kB | 22 kB                                           Downloaded from central: https://repo.maven.apache.org/maven2/org/apache/maven/surefire/maven-surefire-common/2.6/maven-surefire-common-2.6.jar (22 kB at 1.1 MB/s)
Progress (2): 87/277 kB | 77/531 kBProgress (2): 88/277 kB | 77/531 kBProgress (2): 88/277 kB | 78/531 kBProgress (2): 91/277 kB | 78/531 kBProgress (2): 91/277 kB | 81/531 kBProgress (2): 92/277 kB | 81/531 kBProgress (2): 92/277 kB | 82/531 kBProgress (2): 95/277 kB | 82/531 kBProgress (2): 95/277 kB | 85/531 kBProgress (2): 96/277 kB | 85/531 kBProgress (2): 96/277 kB | 86/531 kBProgress (2): 99/277 kB | 86/531 kBProgress (2): 99/277 kB | 89/531 kBProgress (2): 100/277 kB | 89/531 kBProgress (2): 100/277 kB | 90/531 kBProgress (2): 103/277 kB | 90/531 kBProgress (2): 103/277 kB | 93/531 kBProgress (2): 105/277 kB | 93/531 kBProgress (2): 105/277 kB | 94/531 kBProgress (2): 107/277 kB | 94/531 kBProgress (2): 107/277 kB | 97/531 kBProgress (2): 109/277 kB | 97/531 kBProgress (2): 109/277 kB | 98/531 kBProgress (2): 111/277 kB | 98/531 kBProgress (2): 111/277 kB | 101/531 kBProgress (2): 113/277 kB | 101/531 kBProgress (2): 113/277 kB | 102/531 kBProgress (2): 116/277 kB | 102/531 kBProgress (2): 116/277 kB | 105/531 kBProgress (2): 117/277 kB | 105/531 kBProgress (2): 117/277 kB | 107/531 kBProgress (2): 120/277 kB | 107/531 kBProgress (2): 120/277 kB | 109/531 kBProgress (2): 121/277 kB | 109/531 kBProgress (2): 121/277 kB | 111/531 kBProgress (2): 124/277 kB | 111/531 kBProgress (2): 124/277 kB | 113/531 kBProgress (2): 125/277 kB | 113/531 kBProgress (2): 125/277 kB | 115/531 kBProgress (2): 128/277 kB | 115/531 kBProgress (2): 128/277 kB | 118/531 kBProgress (2): 129/277 kB | 118/531 kBProgress (2): 129/277 kB | 119/531 kBProgress (2): 132/277 kB | 119/531 kBProgress (2): 132/277 kB | 122/531 kBProgress (2): 133/277 kB | 122/531 kBProgress (2): 133/277 kB | 123/531 kBProgress (2): 136/277 kB | 123/531 kBProgress (2): 136/277 kB | 126/531 kBProgress (2): 137/277 kB | 126/531 kBProgress (2): 137/277 kB | 127/531 kBProgress (2): 140/277 kB | 127/531 kBProgress (2): 140/277 kB | 130/531 kBProgress (2): 141/277 kB | 130/531 kBProgress (2): 141/277 kB | 131/531 kBProgress (2): 144/277 kB | 131/531 kBProgress (2): 144/277 kB | 134/531 kBProgress (2): 146/277 kB | 134/531 kBProgress (2): 146/277 kB | 135/531 kBProgress (2): 148/277 kB | 135/531 kBProgress (2): 148/277 kB | 138/531 kBProgress (2): 150/277 kB | 138/531 kBProgress (2): 150/277 kB | 139/531 kBProgress (2): 152/277 kB | 139/531 kBProgress (2): 152/277 kB | 142/531 kBProgress (2): 154/277 kB | 142/531 kBProgress (2): 154/277 kB | 143/531 kBProgress (2): 156/277 kB | 143/531 kBProgress (2): 156/277 kB | 146/531 kBProgress (2): 158/277 kB | 146/531 kBProgress (2): 158/277 kB | 148/531 kBProgress (2): 161/277 kB | 148/531 kBProgress (2): 161/277 kB | 150/531 kBProgress (2): 162/277 kB | 150/531 kBProgress (2): 162/277 kB | 152/531 kBProgress (2): 165/277 kB | 152/531 kBProgress (2): 165/277 kB | 154/531 kBProgress (2): 166/277 kB | 154/531 kBProgress (2): 166/277 kB | 156/531 kBProgress (2): 169/277 kB | 156/531 kBProgress (2): 169/277 kB | 158/531 kBProgress (2): 170/277 kB | 158/531 kBProgress (2): 170/277 kB | 160/531 kBProgress (2): 173/277 kB | 160/531 kBProgress (2): 173/277 kB | 163/531 kBProgress (2): 174/277 kB | 163/531 kBProgress (2): 174/277 kB | 164/531 kBProgress (2): 177/277 kB | 164/531 kBProgress (2): 177/277 kB | 167/531 kBProgress (2): 178/277 kB | 167/531 kBProgress (2): 178/277 kB | 168/531 kBProgress (2): 181/277 kB | 168/531 kBProgress (2): 181/277 kB | 171/531 kBProgress (2): 182/277 kB | 171/531 kBProgress (2): 182/277 kB | 172/531 kBProgress (2): 185/277 kB | 172/531 kBProgress (2): 185/277 kB | 175/531 kBProgress (2): 186/277 kB | 175/531 kBProgress (2): 186/277 kB | 176/531 kBProgress (2): 189/277 kB | 176/531 kBProgress (2): 189/277 kB | 179/531 kBProgress (2): 191/277 kB | 179/531 kBProgress (2): 191/277 kB | 180/531 kBProgress (2): 193/277 kB | 180/531 kBProgress (2): 193/277 kB | 183/531 kBProgress (2): 195/277 kB | 183/531 kBProgress (2): 195/277 kB | 184/531 kBProgress (2): 197/277 kB | 184/531 kBProgress (2): 197/277 kB | 187/531 kBProgress (2): 199/277 kB | 187/531 kBProgress (2): 199/277 kB | 188/531 kBProgress (2): 202/277 kB | 188/531 kBProgress (2): 202/277 kB | 191/531 kBProgress (2): 203/277 kB | 191/531 kBProgress (2): 203/277 kB | 193/531 kBProgress (2): 206/277 kB | 193/531 kBProgress (2): 206/277 kB | 195/531 kBProgress (2): 207/277 kB | 195/531 kBProgress (2): 207/277 kB | 197/531 kBProgress (2): 210/277 kB | 197/531 kBProgress (2): 210/277 kB | 199/531 kBProgress (2): 211/277 kB | 199/531 kBProgress (2): 211/277 kB | 201/531 kBProgress (2): 214/277 kB | 201/531 kBProgress (2): 214/277 kB | 204/531 kBProgress (2): 215/277 kB | 204/531 kBProgress (2): 215/277 kB | 205/531 kBProgress (2): 218/277 kB | 205/531 kBProgress (2): 218/277 kB | 208/531 kBProgress (2): 219/277 kB | 208/531 kBProgress (2): 219/277 kB | 209/531 kBProgress (2): 222/277 kB | 209/531 kBProgress (2): 222/277 kB | 212/531 kBProgress (2): 223/277 kB | 212/531 kBProgress (2): 223/277 kB | 213/531 kBProgress (2): 226/277 kB | 213/531 kBProgress (2): 226/277 kB | 216/531 kBProgress (2): 227/277 kB | 216/531 kBProgress (2): 227/277 kB | 217/531 kBProgress (2): 230/277 kB | 217/531 kBProgress (2): 230/277 kB | 220/531 kBProgress (2): 233/277 kB | 220/531 kBProgress (2): 233/277 kB | 221/531 kBProgress (2): 236/277 kB | 221/531 kBProgress (2): 236/277 kB | 224/531 kBProgress (2): 238/277 kB | 224/531 kBProgress (2): 238/277 kB | 225/531 kBProgress (2): 241/277 kB | 225/531 kBProgress (2): 241/277 kB | 228/531 kBProgress (2): 244/277 kB | 228/531 kBProgress (2): 244/277 kB | 229/531 kBProgress (2): 247/277 kB | 229/531 kBProgress (2): 247/277 kB | 232/531 kBProgress (2): 249/277 kB | 232/531 kBProgress (2): 249/277 kB | 234/531 kBProgress (2): 252/277 kB | 234/531 kBProgress (2): 252/277 kB | 236/531 kBProgress (2): 255/277 kB | 236/531 kBProgress (2): 255/277 kB | 238/531 kBProgress (2): 258/277 kB | 238/531 kBProgress (2): 258/277 kB | 240/531 kBProgress (2): 260/277 kB | 240/531 kBProgress (2): 260/277 kB | 242/531 kBProgress (2): 263/277 kB | 242/531 kBProgress (2): 263/277 kB | 244/531 kBProgress (2): 266/277 kB | 244/531 kBProgress (2): 266/277 kB | 246/531 kBProgress (2): 268/277 kB | 246/531 kBProgress (2): 268/277 kB | 249/531 kBProgress (2): 271/277 kB | 249/531 kBProgress (2): 271/277 kB | 251/531 kBProgress (2): 274/277 kB | 251/531 kBProgress (2): 274/277 kB | 254/531 kBProgress (2): 277/277 kB | 254/531 kBProgress (2): 277/277 kB | 257/531 kBProgress (2): 277 kB | 257/531 kB    Progress (2): 277 kB | 260/531 kBProgress (2): 277 kB | 262/531 kBProgress (2): 277 kB | 265/531 kBProgress (2): 277 kB | 268/531 kBProgress (2): 277 kB | 270/531 kBProgress (2): 277 kB | 273/531 kBProgress (2): 277 kB | 276/531 kBProgress (2): 277 kB | 279/531 kBProgress (2): 277 kB | 281/531 kBProgress (2): 277 kB | 284/531 kBProgress (2): 277 kB | 287/531 kBProgress (2): 277 kB | 290/531 kBProgress (2): 277 kB | 292/531 kBProgress (2): 277 kB | 295/531 kBProgress (2): 277 kB | 298/531 kBProgress (2): 277 kB | 302/531 kBProgress (2): 277 kB | 306/531 kBProgress (2): 277 kB | 310/531 kBProgress (2): 277 kB | 314/531 kBProgress (2): 277 kB | 318/531 kBProgress (2): 277 kB | 322/531 kBProgress (2): 277 kB | 326/531 kBProgress (2): 277 kB | 331/531 kBProgress (2): 277 kB | 335/531 kBProgress (2): 277 kB | 339/531 kBProgress (2): 277 kB | 343/531 kBProgress (2): 277 kB | 347/531 kBProgress (2): 277 kB | 351/531 kBProgress (2): 277 kB | 355/531 kBProgress (2): 277 kB | 359/531 kB                                 Downloaded from central: https://repo.maven.apache.org/maven2/org/apache/maven/surefire/surefire-booter/2.6/surefire-booter-2.6.jar (277 kB at 5.3 MB/s)
Progress (1): 363/531 kBProgress (1): 367/531 kBProgress (1): 371/531 kBProgress (1): 376/531 kBProgress (1): 380/531 kBProgress (1): 384/531 kBProgress (1): 388/531 kBProgress (1): 392/531 kBProgress (1): 396/531 kBProgress (1): 400/531 kBProgress (1): 404/531 kBProgress (1): 408/531 kBProgress (1): 412/531 kBProgress (1): 417/531 kBProgress (1): 421/531 kBProgress (1): 425/531 kBProgress (1): 429/531 kBProgress (1): 433/531 kBProgress (1): 437/531 kBProgress (1): 441/531 kBProgress (1): 445/531 kBProgress (1): 449/531 kBProgress (1): 453/531 kBProgress (1): 457/531 kBProgress (1): 462/531 kBProgress (1): 466/531 kBProgress (1): 470/531 kBProgress (1): 474/531 kBProgress (1): 478/531 kBProgress (1): 482/531 kBProgress (1): 486/531 kBProgress (1): 490/531 kBProgress (1): 494/531 kBProgress (1): 498/531 kBProgress (1): 503/531 kBProgress (1): 507/531 kBProgress (1): 511/531 kBProgress (1): 515/531 kBProgress (1): 519/531 kBProgress (1): 523/531 kBProgress (1): 527/531 kBProgress (1): 531 kB                        Downloaded from central: https://repo.maven.apache.org/maven2/org/apache/maven/surefire/surefire-api/2.6/surefire-api-2.6.jar (531 kB at 7.8 MB/s)
Downloading from central: https://repo.maven.apache.org/maven2/org/apache/maven/surefire/surefire-testng/2.6/surefire-testng-2.6.pom
[WARNING] Failed to create parent directories for tracking file /home/jenkins/.m2/repository/org/apache/maven/surefire/surefire-testng/2.6/surefire-testng-2.6.pom.lastUpdated
[INFO] Failure detected.
[INFO] ------------------------------------------------------------------------
[INFO] Reactor Summary:
[INFO]
[INFO] Struts 2 Bill of Materials ......................... SUCCESS [  9.062 s]
[INFO] Struts 2 ........................................... SUCCESS [ 12.783 s]
[INFO] Struts 2 Core ...................................... FAILURE [ 54.853 s]
[INFO] Struts Plugins ..................................... SKIPPED
[INFO] Struts 2 Configuration Browser Plugin .............. SKIPPED
[INFO] Struts 2 Sitemesh Plugin ........................... SKIPPED
[INFO] Struts 2 Tiles Plugin .............................. SKIPPED
[INFO] Struts 2 DWR Plugin ................................ SKIPPED
[INFO] Struts 2 Spring Plugin ............................. SKIPPED
[INFO] Struts 2 Convention Plugin ......................... SKIPPED
[INFO] Struts 2 JUnit Plugin .............................. SKIPPED
[INFO] Struts 2 JSON Plugin ............................... SKIPPED
[INFO] Struts 2 Bean Validation Plugin .................... SKIPPED
[INFO] Struts 2 Webapps ................................... SKIPPED
[INFO] Struts 2 Showcase Webapp ........................... SKIPPED
[INFO] Struts 2 REST Plugin ............................... SKIPPED
[INFO] Struts 2 Rest Showcase Webapp ...................... SKIPPED
[INFO] Struts 2 CDI Plugin ................................ SKIPPED
[INFO] Struts 2 Embedded JSP Plugin ....................... SKIPPED
[INFO] Struts 2 GXP Plugin ................................ SKIPPED
[INFO] Struts 2 Jasper Reports Plugin ..................... SKIPPED
[INFO] Struts 2 Java Templates Plugin ..................... SKIPPED
[INFO] Struts 2 JFreeChart Plugin ......................... SKIPPED
[INFO] Struts 2 OSGi Plugin ............................... SKIPPED
[INFO] Struts 2 OVal Plugin ............................... SKIPPED
[INFO] Struts 2 Pell Multipart Plugin ..................... SKIPPED
[INFO] Struts 2 Plexus Plugin ............................. SKIPPED
[INFO] Struts 2 Portlet Plugin ............................ SKIPPED
[INFO] Struts 2 Portlet Tiles Plugin ...................... SKIPPED
[INFO] DEPRECATED: Struts 2 Sitegraph Plugin .............. SKIPPED
[INFO] Struts 2 TestNG Plugin ............................. SKIPPED
[INFO] Struts OSGi Bundles ................................ SKIPPED
[INFO] Struts 2 OSGi Admin Bundle ......................... SKIPPED
[INFO] Struts 2 OSGi Demo Bundle .......................... SKIPPED
[INFO] Struts 2 Assembly .................................. SKIPPED
[INFO] ------------------------------------------------------------------------
[INFO] BUILD FAILURE
[INFO] ------------------------------------------------------------------------
[INFO] Total time: 01:21 min
[INFO] Finished at: 2018-01-05T17:17:23Z
[INFO] Final Memory: 74M/1853M
[INFO] ------------------------------------------------------------------------
[ERROR] Failed to execute goal org.apache.maven.plugins:maven-surefire-plugin:2.6:test (default-test) on project struts2-core: Error to resolving surefire provider dependency: Unable to get dependency information for org.apache.maven.surefire:surefire-testng:jar:2.6: Failed to retrieve POM for org.apache.maven.surefire:surefire-testng:jar:2.6: Could not transfer artifact org.apache.maven.surefire:surefire-testng:pom:2.6 from/to central (https://repo.maven.apache.org/maven2): /home/jenkins/.m2/repository/org/apache/maven/surefire/surefire-testng/2.6/surefire-testng-2.6.pom.part.lock (No such file or directory)
[ERROR]   org.apache.maven.surefire:surefire-testng:jar:2.6
[ERROR]
[ERROR] from the specified remote repositories:
[ERROR]   central (https://repo.maven.apache.org/maven2, releases=true, snapshots=false)
[ERROR] Path to dependency:
[ERROR] 1) dummy:dummy:jar:1.0
[ERROR]
[ERROR]
[ERROR] -> [Help 1]
[ERROR]
[ERROR] To see the full stack trace of the errors, re-run Maven with the -e switch.
[ERROR] Re-run Maven using the -X switch to enable full debug logging.
[ERROR]
[ERROR] For more information about the errors and possible solutions, please read the following articles:
[ERROR] [Help 1] http://cwiki.apache.org/confluence/display/MAVEN/MojoExecutionException
[ERROR]
[ERROR] After correcting the problems, you can resume the build with the command
[ERROR]   mvn <goals> -rf :struts2-core
Build step 'Execute shell' marked build as failure
[locks-and-latches] Releasing all the locks
[locks-and-latches] All the locks released
Setting MAVEN_3_LATEST__HOME=/home/jenkins/tools/maven/latest3/


---------------------------------------------------------------------
To unsubscribe, e-mail: [hidden email]
For additional commands, e-mail: [hidden email]

Reply | Threaded
Open this post in threaded view
|

Jenkins build is back to normal : Struts-master-JDK7 #79

Apache Jenkins Server-2
See <https://builds.apache.org/job/Struts-master-JDK7/79/display/redirect?page=changes>


---------------------------------------------------------------------
To unsubscribe, e-mail: [hidden email]
For additional commands, e-mail: [hidden email]