Build failed in Jenkins: Struts-master-JDK7 #75

classic Classic list List threaded Threaded
2 messages Options
Reply | Threaded
Open this post in threaded view
|

Build failed in Jenkins: Struts-master-JDK7 #75

Apache Jenkins Server-2
See <https://builds.apache.org/job/Struts-master-JDK7/75/display/redirect?page=changes>

Changes:

[yasserzamani] Increases the coverage of DefaultActionInvocation

------------------------------------------
[...truncated 2.17 KB...]
[INFO] Struts 2 Spring Plugin
[INFO] Struts 2 Convention Plugin
[INFO] Struts 2 JUnit Plugin
[INFO] Struts 2 JSON Plugin
[INFO] Struts 2 Bean Validation Plugin
[INFO] Struts 2 Webapps
[INFO] Struts 2 Showcase Webapp
[INFO] Struts 2 REST Plugin
[INFO] Struts 2 Rest Showcase Webapp
[INFO] Struts 2 CDI Plugin
[INFO] Struts 2 Embedded JSP Plugin
[INFO] Struts 2 GXP Plugin
[INFO] Struts 2 Jasper Reports Plugin
[INFO] Struts 2 Java Templates Plugin
[INFO] Struts 2 JFreeChart Plugin
[INFO] Struts 2 OSGi Plugin
[INFO] Struts 2 OVal Plugin
[INFO] Struts 2 Pell Multipart Plugin
[INFO] Struts 2 Plexus Plugin
[INFO] Struts 2 Portlet Plugin
[INFO] Struts 2 Portlet Tiles Plugin
[INFO] DEPRECATED: Struts 2 Sitegraph Plugin
[INFO] Struts 2 TestNG Plugin
[INFO] Struts OSGi Bundles
[INFO] Struts 2 OSGi Admin Bundle
[INFO] Struts 2 OSGi Demo Bundle
[INFO] Struts 2 Assembly
[INFO]
[INFO] ------------------------------------------------------------------------
[INFO] Building Struts 2 Bill of Materials 2.6-SNAPSHOT
[INFO] ------------------------------------------------------------------------
[INFO]
[INFO] --- maven-clean-plugin:2.4.1:clean (default-clean) @ struts2-bom ---
[INFO]
[INFO] >>> maven-source-plugin:2.1.2:jar (default-cli) > generate-sources @ struts2-bom >>>
[INFO]
[INFO] <<< maven-source-plugin:2.1.2:jar (default-cli) < generate-sources @ struts2-bom <<<
[INFO]
[INFO]
[INFO] --- maven-source-plugin:2.1.2:jar (default-cli) @ struts2-bom ---
[INFO]
[INFO] --- maven-javadoc-plugin:2.8:jar (default-cli) @ struts2-bom ---
[INFO] Not executing Javadoc as the project is not a Java classpath-capable package
[INFO]
[INFO] --- maven-remote-resources-plugin:1.2.1:process (default) @ struts2-bom ---
[INFO]
[INFO] --- maven-site-plugin:3.0:attach-descriptor (attach-descriptor) @ struts2-bom ---
[INFO]
[INFO] --- maven-install-plugin:2.3.1:install (default-install) @ struts2-bom ---
[INFO] Installing <https://builds.apache.org/job/Struts-master-JDK7/ws/bom/pom.xml> to /home/jenkins/.m2/repository/org/apache/struts/struts2-bom/2.6-SNAPSHOT/struts2-bom-2.6-SNAPSHOT.pom
[INFO]
[INFO] --- maven-remote-resources-plugin:1.2.1:process (default) @ struts2-bom ---
[INFO]
[INFO] --- maven-site-plugin:3.0:attach-descriptor (attach-descriptor) @ struts2-bom ---
[INFO]
[INFO] --- maven-install-plugin:2.3.1:install (default-install) @ struts2-bom ---
[INFO] Installing <https://builds.apache.org/job/Struts-master-JDK7/ws/bom/pom.xml> to /home/jenkins/.m2/repository/org/apache/struts/struts2-bom/2.6-SNAPSHOT/struts2-bom-2.6-SNAPSHOT.pom
[INFO]
[INFO] --- maven-deploy-plugin:2.6:deploy (default-deploy) @ struts2-bom ---
Downloading from apache.snapshots.https: https://repository.apache.org/content/repositories/snapshots/org/apache/struts/struts2-bom/2.6-SNAPSHOT/maven-metadata.xml
Progress (1): 603 B                   Downloaded from apache.snapshots.https: https://repository.apache.org/content/repositories/snapshots/org/apache/struts/struts2-bom/2.6-SNAPSHOT/maven-metadata.xml (603 B at 520 B/s)
Uploading to apache.snapshots.https: https://repository.apache.org/content/repositories/snapshots/org/apache/struts/struts2-bom/2.6-SNAPSHOT/struts2-bom-2.6-20171218.072507-15.pom
Progress (1): 2.0/7.8 kBProgress (1): 4.1/7.8 kBProgress (1): 6.1/7.8 kBProgress (1): 7.8 kB                        Uploaded to apache.snapshots.https: https://repository.apache.org/content/repositories/snapshots/org/apache/struts/struts2-bom/2.6-SNAPSHOT/struts2-bom-2.6-20171218.072507-15.pom (7.8 kB at 7.8 kB/s)
Downloading from apache.snapshots.https: https://repository.apache.org/content/repositories/snapshots/org/apache/struts/struts2-bom/maven-metadata.xml
Progress (1): 831 B                   Downloaded from apache.snapshots.https: https://repository.apache.org/content/repositories/snapshots/org/apache/struts/struts2-bom/maven-metadata.xml (831 B at 1.7 kB/s)
Uploading to apache.snapshots.https: https://repository.apache.org/content/repositories/snapshots/org/apache/struts/struts2-bom/2.6-SNAPSHOT/maven-metadata.xml
Progress (1): 603 B                   Uploaded to apache.snapshots.https: https://repository.apache.org/content/repositories/snapshots/org/apache/struts/struts2-bom/2.6-SNAPSHOT/maven-metadata.xml (603 B at 636 B/s)
Uploading to apache.snapshots.https: https://repository.apache.org/content/repositories/snapshots/org/apache/struts/struts2-bom/maven-metadata.xml
Progress (1): 831 B                   Uploaded to apache.snapshots.https: https://repository.apache.org/content/repositories/snapshots/org/apache/struts/struts2-bom/maven-metadata.xml (831 B at 897 B/s)
[INFO]
[INFO] ------------------------------------------------------------------------
[INFO] Building Struts 2 2.6-SNAPSHOT
[INFO] ------------------------------------------------------------------------
[INFO]
[INFO] --- maven-clean-plugin:3.0.0:clean (default-clean) @ struts2-parent ---
[INFO]
[INFO] >>> maven-source-plugin:3.0.0:jar (default-cli) > generate-sources @ struts2-parent >>>
[INFO]
[INFO] <<< maven-source-plugin:3.0.0:jar (default-cli) < generate-sources @ struts2-parent <<<
[INFO]
[INFO]
[INFO] --- maven-source-plugin:3.0.0:jar (default-cli) @ struts2-parent ---
[INFO]
[INFO] --- maven-javadoc-plugin:2.10.3:jar (default-cli) @ struts2-parent ---
[INFO] Not executing Javadoc as the project is not a Java classpath-capable package
[INFO]
[INFO] --- maven-remote-resources-plugin:1.5:process (process-resource-bundles) @ struts2-parent ---
[INFO]
[INFO] --- maven-bundle-plugin:2.1.0:manifest (bundle-manifest) @ struts2-parent ---
[WARNING] Ignoring project type pom - supportedProjectTypes = [jar, bundle]
[INFO]
[INFO] >>> maven-source-plugin:3.0.0:jar (attach-sources) > generate-sources @ struts2-parent >>>
[INFO]
[INFO] <<< maven-source-plugin:3.0.0:jar (attach-sources) < generate-sources @ struts2-parent <<<
[INFO]
[INFO]
[INFO] --- maven-source-plugin:3.0.0:jar (attach-sources) @ struts2-parent ---
[INFO]
[INFO] --- maven-site-plugin:3.5.1:attach-descriptor (attach-descriptor) @ struts2-parent ---
[INFO]
[INFO] --- apache-rat-plugin:0.11:check (default) @ struts2-parent ---
[INFO] 57 implicit excludes (use -debug for more details).
[INFO] Exclude: src/main/resources/org/apache/struts2/static/domTT.js
[INFO] Exclude: src/site/resources/tags/**/*.html
[INFO] Exclude: src/main/resources/*LICENSE.txt
[INFO] Exclude: src/test/resources/**/*.txt
[INFO] Exclude: src/main/webapp/**/*.css
[INFO] Exclude: src/main/webapp/**/*.map
[INFO] Exclude: src/main/webapp/**/*.js
[INFO] Exclude: src/main/webapp/**/*.svg
[INFO] Exclude: src/main/webapp/**/*.txt
[INFO] Exclude: src/main/resources/**/sitegraph-usage.txt
[INFO] Exclude: src/main/resources/**/docs-urls.txt
[INFO] Exclude: src/etc/header.txt
[INFO] Exclude: src/main/resources/static/css/**/*.css
[INFO] Exclude: src/main/resources/static/js/**/*.js
[INFO] Exclude: src/main/resources/docs.cfg
[INFO] Exclude: src/main/webapp/fonts/**/*
[INFO] 3 resources included (use -debug for more details)
[INFO] Rat check: Summary of files. Unapproved: 0 unknown: 0 generated: 0 approved: 3 licence.
[INFO]
[INFO] --- maven-install-plugin:2.5.2:install (default-install) @ struts2-parent ---
[INFO] Installing <https://builds.apache.org/job/Struts-master-JDK7/ws/pom.xml> to /home/jenkins/.m2/repository/org/apache/struts/struts2-parent/2.6-SNAPSHOT/struts2-parent-2.6-SNAPSHOT.pom
[INFO] Installing <https://builds.apache.org/job/Struts-master-JDK7/ws/target/struts2-parent-2.6-SNAPSHOT-site.xml> to /home/jenkins/.m2/repository/org/apache/struts/struts2-parent/2.6-SNAPSHOT/struts2-parent-2.6-SNAPSHOT-site.xml
[INFO]
[INFO] --- maven-remote-resources-plugin:1.5:process (process-resource-bundles) @ struts2-parent ---
[INFO]
[INFO] --- maven-bundle-plugin:2.1.0:manifest (bundle-manifest) @ struts2-parent ---
[WARNING] Ignoring project type pom - supportedProjectTypes = [jar, bundle]
[INFO]
[INFO] >>> maven-source-plugin:3.0.0:jar (attach-sources) > generate-sources @ struts2-parent >>>
[INFO]
[INFO] <<< maven-source-plugin:3.0.0:jar (attach-sources) < generate-sources @ struts2-parent <<<
[INFO]
[INFO]
[INFO] --- maven-source-plugin:3.0.0:jar (attach-sources) @ struts2-parent ---
[INFO]
[INFO] --- maven-site-plugin:3.5.1:attach-descriptor (attach-descriptor) @ struts2-parent ---
[INFO]
[INFO] --- apache-rat-plugin:0.11:check (default) @ struts2-parent ---
[INFO] 57 implicit excludes (use -debug for more details).
[INFO] Exclude: src/main/resources/org/apache/struts2/static/domTT.js
[INFO] Exclude: src/site/resources/tags/**/*.html
[INFO] Exclude: src/main/resources/*LICENSE.txt
[INFO] Exclude: src/test/resources/**/*.txt
[INFO] Exclude: src/main/webapp/**/*.css
[INFO] Exclude: src/main/webapp/**/*.map
[INFO] Exclude: src/main/webapp/**/*.js
[INFO] Exclude: src/main/webapp/**/*.svg
[INFO] Exclude: src/main/webapp/**/*.txt
[INFO] Exclude: src/main/resources/**/sitegraph-usage.txt
[INFO] Exclude: src/main/resources/**/docs-urls.txt
[INFO] Exclude: src/etc/header.txt
[INFO] Exclude: src/main/resources/static/css/**/*.css
[INFO] Exclude: src/main/resources/static/js/**/*.js
[INFO] Exclude: src/main/resources/docs.cfg
[INFO] Exclude: src/main/webapp/fonts/**/*
[INFO] 3 resources included (use -debug for more details)
[INFO] Rat check: Summary of files. Unapproved: 0 unknown: 0 generated: 0 approved: 3 licence.
[INFO]
[INFO] --- maven-install-plugin:2.5.2:install (default-install) @ struts2-parent ---
[INFO] Installing <https://builds.apache.org/job/Struts-master-JDK7/ws/pom.xml> to /home/jenkins/.m2/repository/org/apache/struts/struts2-parent/2.6-SNAPSHOT/struts2-parent-2.6-SNAPSHOT.pom
[INFO] Installing <https://builds.apache.org/job/Struts-master-JDK7/ws/target/struts2-parent-2.6-SNAPSHOT-site.xml> to /home/jenkins/.m2/repository/org/apache/struts/struts2-parent/2.6-SNAPSHOT/struts2-parent-2.6-SNAPSHOT-site.xml
[INFO] Installing <https://builds.apache.org/job/Struts-master-JDK7/ws/target/struts2-parent-2.6-SNAPSHOT-site.xml> to /home/jenkins/.m2/repository/org/apache/struts/struts2-parent/2.6-SNAPSHOT/struts2-parent-2.6-SNAPSHOT-site.xml
[INFO]
[INFO] --- maven-deploy-plugin:2.8.2:deploy (default-deploy) @ struts2-parent ---
Downloading from apache.snapshots.https: https://repository.apache.org/content/repositories/snapshots/org/apache/struts/struts2-parent/2.6-SNAPSHOT/maven-metadata.xml
Progress (1): 816 B                   Downloaded from apache.snapshots.https: https://repository.apache.org/content/repositories/snapshots/org/apache/struts/struts2-parent/2.6-SNAPSHOT/maven-metadata.xml (816 B at 1.6 kB/s)
Uploading to apache.snapshots.https: https://repository.apache.org/content/repositories/snapshots/org/apache/struts/struts2-parent/2.6-SNAPSHOT/struts2-parent-2.6-20171218.072514-14.pom
Progress (1): 2.0/43 kBProgress (1): 4.1/43 kBProgress (1): 6.1/43 kBProgress (1): 8.2/43 kBProgress (1): 10/43 kB Progress (1): 12/43 kBProgress (1): 14/43 kBProgress (1): 16/43 kBProgress (1): 18/43 kBProgress (1): 20/43 kBProgress (1): 23/43 kBProgress (1): 25/43 kBProgress (1): 27/43 kBProgress (1): 29/43 kBProgress (1): 31/43 kBProgress (1): 33/43 kBProgress (1): 35/43 kBProgress (1): 37/43 kBProgress (1): 39/43 kBProgress (1): 41/43 kBProgress (1): 43 kB                      Uploaded to apache.snapshots.https: https://repository.apache.org/content/repositories/snapshots/org/apache/struts/struts2-parent/2.6-SNAPSHOT/struts2-parent-2.6-20171218.072514-14.pom (43 kB at 40 kB/s)
Downloading from apache.snapshots.https: https://repository.apache.org/content/repositories/snapshots/org/apache/struts/struts2-parent/maven-metadata.xml
Progress (1): 1.3 kB                    Downloaded from apache.snapshots.https: https://repository.apache.org/content/repositories/snapshots/org/apache/struts/struts2-parent/maven-metadata.xml (1.3 kB at 2.7 kB/s)
Uploading to apache.snapshots.https: https://repository.apache.org/content/repositories/snapshots/org/apache/struts/struts2-parent/2.6-SNAPSHOT/maven-metadata.xml
Progress (1): 816 B                   Uploaded to apache.snapshots.https: https://repository.apache.org/content/repositories/snapshots/org/apache/struts/struts2-parent/2.6-SNAPSHOT/maven-metadata.xml (816 B at 863 B/s)
Uploading to apache.snapshots.https: https://repository.apache.org/content/repositories/snapshots/org/apache/struts/struts2-parent/maven-metadata.xml
Progress (1): 1.3 kB                    Uploaded to apache.snapshots.https: https://repository.apache.org/content/repositories/snapshots/org/apache/struts/struts2-parent/maven-metadata.xml (1.3 kB at 1.4 kB/s)
Uploading to apache.snapshots.https: https://repository.apache.org/content/repositories/snapshots/org/apache/struts/struts2-parent/2.6-SNAPSHOT/struts2-parent-2.6-20171218.072514-14-site.xml
Progress (1): 2.0/2.4 kBProgress (1): 2.4 kB                        Uploaded to apache.snapshots.https: https://repository.apache.org/content/repositories/snapshots/org/apache/struts/struts2-parent/2.6-SNAPSHOT/struts2-parent-2.6-20171218.072514-14-site.xml (2.4 kB at 2.6 kB/s)
Uploading to apache.snapshots.https: https://repository.apache.org/content/repositories/snapshots/org/apache/struts/struts2-parent/2.6-SNAPSHOT/maven-metadata.xml
Progress (1): 816 B                   Uploaded to apache.snapshots.https: https://repository.apache.org/content/repositories/snapshots/org/apache/struts/struts2-parent/2.6-SNAPSHOT/maven-metadata.xml (816 B at 890 B/s)
Uploading to apache.snapshots.https: https://repository.apache.org/content/repositories/snapshots/org/apache/struts/struts2-parent/2.6-SNAPSHOT/struts2-parent-2.6-20171218.072514-14-site.xml
Progress (1): 2.0/2.4 kBProgress (1): 2.4 kB                        Uploaded to apache.snapshots.https: https://repository.apache.org/content/repositories/snapshots/org/apache/struts/struts2-parent/2.6-SNAPSHOT/struts2-parent-2.6-20171218.072514-14-site.xml (2.4 kB at 2.6 kB/s)
Uploading to apache.snapshots.https: https://repository.apache.org/content/repositories/snapshots/org/apache/struts/struts2-parent/2.6-SNAPSHOT/maven-metadata.xml
Progress (1): 816 B                   Uploaded to apache.snapshots.https: https://repository.apache.org/content/repositories/snapshots/org/apache/struts/struts2-parent/2.6-SNAPSHOT/maven-metadata.xml (816 B at 832 B/s)
[INFO]
[INFO] ------------------------------------------------------------------------
[INFO] Building Struts 2 Core 2.6-SNAPSHOT
[INFO] ------------------------------------------------------------------------
Downloading from central: https://repo.maven.apache.org/maven2/org/testng/testng/5.14.10/testng-5.14.10.pom
[WARNING] Failed to create parent directories for tracking file /home/jenkins/.m2/repository/org/testng/testng/5.14.10/testng-5.14.10.pom.lastUpdated
[INFO] ------------------------------------------------------------------------
[INFO] Reactor Summary:
[INFO]
[INFO] Struts 2 Bill of Materials ......................... SUCCESS [  7.343 s]
[INFO] Struts 2 ........................................... SUCCESS [ 11.021 s]
[INFO] Struts 2 Core ...................................... FAILURE [  0.559 s]
[INFO] Struts Plugins ..................................... SKIPPED
[INFO] Struts 2 Configuration Browser Plugin .............. SKIPPED
[INFO] Struts 2 Sitemesh Plugin ........................... SKIPPED
[INFO] Struts 2 Tiles Plugin .............................. SKIPPED
[INFO] Struts 2 DWR Plugin ................................ SKIPPED
[INFO] Struts 2 Spring Plugin ............................. SKIPPED
[INFO] Struts 2 Convention Plugin ......................... SKIPPED
[INFO] Struts 2 JUnit Plugin .............................. SKIPPED
[INFO] Struts 2 JSON Plugin ............................... SKIPPED
[INFO] Struts 2 Bean Validation Plugin .................... SKIPPED
[INFO] Struts 2 Webapps ................................... SKIPPED
[INFO] Struts 2 Showcase Webapp ........................... SKIPPED
[INFO] Struts 2 REST Plugin ............................... SKIPPED
[INFO] Struts 2 Rest Showcase Webapp ...................... SKIPPED
[INFO] Struts 2 CDI Plugin ................................ SKIPPED
[INFO] Struts 2 Embedded JSP Plugin ....................... SKIPPED
[INFO] Struts 2 GXP Plugin ................................ SKIPPED
[INFO] Struts 2 Jasper Reports Plugin ..................... SKIPPED
[INFO] Struts 2 Java Templates Plugin ..................... SKIPPED
[INFO] Struts 2 JFreeChart Plugin ......................... SKIPPED
[INFO] Struts 2 OSGi Plugin ............................... SKIPPED
[INFO] Struts 2 OVal Plugin ............................... SKIPPED
[INFO] Struts 2 Pell Multipart Plugin ..................... SKIPPED
[INFO] Struts 2 Plexus Plugin ............................. SKIPPED
[INFO] Struts 2 Portlet Plugin ............................ SKIPPED
[INFO] Struts 2 Portlet Tiles Plugin ...................... SKIPPED
[INFO] DEPRECATED: Struts 2 Sitegraph Plugin .............. SKIPPED
[INFO] Struts 2 TestNG Plugin ............................. SKIPPED
[INFO] Struts OSGi Bundles ................................ SKIPPED
[INFO] Struts 2 OSGi Admin Bundle ......................... SKIPPED
[INFO] Struts 2 OSGi Demo Bundle .......................... SKIPPED
[INFO] Struts 2 Assembly .................................. SKIPPED
[INFO] ------------------------------------------------------------------------
[INFO] BUILD FAILURE
[INFO] ------------------------------------------------------------------------
[INFO] Total time: 21.699 s
[INFO] Finished at: 2017-12-18T07:25:22Z
[INFO] Final Memory: 63M/1448M
[INFO] ------------------------------------------------------------------------
[ERROR] Failed to execute goal on project struts2-core: Could not resolve dependencies for project org.apache.struts:struts2-core:jar:2.6-SNAPSHOT: Failed to collect dependencies at org.testng:testng:jar:5.14.10: Failed to read artifact descriptor for org.testng:testng:jar:5.14.10: Could not transfer artifact org.testng:testng:pom:5.14.10 from/to central (https://repo.maven.apache.org/maven2): /home/jenkins/.m2/repository/org/testng/testng/5.14.10/testng-5.14.10.pom.part.lock (No such file or directory) -> [Help 1]
[ERROR]
[ERROR] To see the full stack trace of the errors, re-run Maven with the -e switch.
[ERROR] Re-run Maven using the -X switch to enable full debug logging.
[ERROR]
[ERROR] For more information about the errors and possible solutions, please read the following articles:
[ERROR] [Help 1] http://cwiki.apache.org/confluence/display/MAVEN/DependencyResolutionException
[ERROR]
[ERROR] After correcting the problems, you can resume the build with the command
[ERROR]   mvn <goals> -rf :struts2-core
Build step 'Execute shell' marked build as failure
[locks-and-latches] Releasing all the locks
[locks-and-latches] All the locks released
Setting MAVEN_3_LATEST__HOME=/home/jenkins/tools/maven/latest3/

---------------------------------------------------------------------
To unsubscribe, e-mail: [hidden email]
For additional commands, e-mail: [hidden email]

Reply | Threaded
Open this post in threaded view
|

Jenkins build is back to normal : Struts-master-JDK7 #76

Apache Jenkins Server-2
See <https://builds.apache.org/job/Struts-master-JDK7/76/display/redirect?page=changes>


---------------------------------------------------------------------
To unsubscribe, e-mail: [hidden email]
For additional commands, e-mail: [hidden email]