Build failed in Jenkins: Struts-master-JDK7 #68

classic Classic list List threaded Threaded
6 messages Options
Reply | Threaded
Open this post in threaded view
|

Build failed in Jenkins: Struts-master-JDK7 #68

Apache Jenkins Server-2
See <https://builds.apache.org/job/Struts-master-JDK7/68/display/redirect?page=changes>

Changes:

[Lukasz Lenart] Kicks Coveralls to build on master

------------------------------------------
[...truncated 42.05 KB...]
Downloading from central: https://repo.maven.apache.org/maven2/org/apache/maven/maven-archiver/3.0.0/maven-archiver-3.0.0.pom
Progress (1): 4.1/4.1 kBProgress (1): 4.1 kB                        Downloaded from central: https://repo.maven.apache.org/maven2/org/apache/maven/maven-archiver/3.0.0/maven-archiver-3.0.0.pom (4.1 kB at 216 kB/s)
Downloading from central: https://repo.maven.apache.org/maven2/org/codehaus/plexus/plexus-archiver/2.9.1/plexus-archiver-2.9.1.pom
Progress (1): 2.2/4.4 kBProgress (1): 4.4 kB                        Downloaded from central: https://repo.maven.apache.org/maven2/org/codehaus/plexus/plexus-archiver/2.9.1/plexus-archiver-2.9.1.pom (4.4 kB at 336 kB/s)
Downloading from central: https://repo.maven.apache.org/maven2/org/codehaus/plexus/plexus-archiver/3.0.3/plexus-archiver-3.0.3.pom
Progress (1): 2.2/4.8 kBProgress (1): 4.8 kB                        Downloaded from central: https://repo.maven.apache.org/maven2/org/codehaus/plexus/plexus-archiver/3.0.3/plexus-archiver-3.0.3.pom (4.8 kB at 300 kB/s)
Downloading from central: https://repo.maven.apache.org/maven2/org/codehaus/plexus/plexus-io/2.7/plexus-io-2.7.pom
Progress (1): 2.2/4.9 kBProgress (1): 4.9/4.9 kBProgress (1): 4.9 kB                        Downloaded from central: https://repo.maven.apache.org/maven2/org/codehaus/plexus/plexus-io/2.7/plexus-io-2.7.pom (4.9 kB at 205 kB/s)
Downloading from central: https://repo.maven.apache.org/maven2/org/apache/maven/maven-archiver/3.0.0/maven-archiver-3.0.0.jar
Downloading from central: https://repo.maven.apache.org/maven2/org/codehaus/plexus/plexus-archiver/3.0.3/plexus-archiver-3.0.3.jar
Downloading from central: https://repo.maven.apache.org/maven2/org/codehaus/plexus/plexus-io/2.7/plexus-io-2.7.jar
Progress (1): 2.1/23 kBProgress (1): 4.9/23 kBProgress (1): 7.7/23 kBProgress (1): 10/23 kB Progress (1): 13/23 kBProgress (1): 16/23 kBProgress (1): 19/23 kBProgress (1): 21/23 kBProgress (1): 23 kB   Progress (2): 23 kB | 2.1/177 kBProgress (2): 23 kB | 4.9/177 kBProgress (2): 23 kB | 7.6/177 kBProgress (2): 23 kB | 10/177 kB Progress (2): 23 kB | 13/177 kBProgress (2): 23 kB | 16/177 kBProgress (3): 23 kB | 16/177 kB | 2.1/86 kBProgress (3): 23 kB | 19/177 kB | 2.1/86 kBProgress (3): 23 kB | 19/177 kB | 4.9/86 kBProgress (3): 23 kB | 21/177 kB | 4.9/86 kBProgress (3): 23 kB | 21/177 kB | 7.7/86 kBProgress (3): 23 kB | 24/177 kB | 7.7/86 kBProgress (3): 23 kB | 24/177 kB | 10/86 kB Progress (3): 23 kB | 27/177 kB | 10/86 kBProgress (3): 23 kB | 27/177 kB | 13/86 kBProgress (3): 23 kB | 30/177 kB | 13/86 kBProgress (3): 23 kB | 30/177 kB | 16/86 kBProgress (3): 23 kB | 32/177 kB | 16/86 kBProgress (3): 23 kB | 32/177 kB | 19/86 kB                                          Downloaded from central: https://repo.maven.apache.org/maven2/org/apache/maven/maven-archiver/3.0.0/maven-archiver-3.0.0.jar (23 kB at 1.2 MB/s)
Progress (2): 36/177 kB | 19/86 kBProgress (2): 36/177 kB | 21/86 kBProgress (2): 40/177 kB | 21/86 kBProgress (2): 40/177 kB | 24/86 kBProgress (2): 44/177 kB | 24/86 kBProgress (2): 44/177 kB | 27/86 kBProgress (2): 49/177 kB | 27/86 kBProgress (2): 49/177 kB | 30/86 kBProgress (2): 49/177 kB | 32/86 kBProgress (2): 53/177 kB | 32/86 kBProgress (2): 57/177 kB | 32/86 kBProgress (2): 57/177 kB | 36/86 kBProgress (2): 61/177 kB | 36/86 kBProgress (2): 61/177 kB | 40/86 kBProgress (2): 65/177 kB | 40/86 kBProgress (2): 65/177 kB | 44/86 kBProgress (2): 65/177 kB | 49/86 kBProgress (2): 69/177 kB | 49/86 kBProgress (2): 73/177 kB | 49/86 kBProgress (2): 73/177 kB | 53/86 kBProgress (2): 77/177 kB | 53/86 kBProgress (2): 77/177 kB | 57/86 kBProgress (2): 81/177 kB | 57/86 kBProgress (2): 81/177 kB | 61/86 kBProgress (2): 81/177 kB | 65/86 kBProgress (2): 85/177 kB | 65/86 kBProgress (2): 89/177 kB | 65/86 kBProgress (2): 89/177 kB | 69/86 kBProgress (2): 94/177 kB | 69/86 kBProgress (2): 94/177 kB | 73/86 kBProgress (2): 98/177 kB | 73/86 kBProgress (2): 98/177 kB | 77/86 kBProgress (2): 98/177 kB | 81/86 kBProgress (2): 102/177 kB | 81/86 kBProgress (2): 102/177 kB | 85/86 kBProgress (2): 106/177 kB | 85/86 kBProgress (2): 106/177 kB | 86 kB   Progress (2): 110/177 kB | 86 kBProgress (2): 114/177 kB | 86 kBProgress (2): 118/177 kB | 86 kBProgress (2): 122/177 kB | 86 kBProgress (2): 126/177 kB | 86 kBProgress (2): 130/177 kB | 86 kBProgress (2): 135/177 kB | 86 kBProgress (2): 139/177 kB | 86 kBProgress (2): 143/177 kB | 86 kBProgress (2): 147/177 kB | 86 kBProgress (2): 151/177 kB | 86 kBProgress (2): 155/177 kB | 86 kBProgress (2): 159/177 kB | 86 kBProgress (2): 163/177 kB | 86 kBProgress (2): 167/177 kB | 86 kBProgress (2): 171/177 kB | 86 kB                                Downloaded from central: https://repo.maven.apache.org/maven2/org/codehaus/plexus/plexus-io/2.7/plexus-io-2.7.jar (86 kB at 2.3 MB/s)
Progress (1): 176/177 kBProgress (1): 177 kB                        Downloaded from central: https://repo.maven.apache.org/maven2/org/codehaus/plexus/plexus-archiver/3.0.3/plexus-archiver-3.0.3.jar (177 kB at 3.8 MB/s)
[INFO]
[INFO] --- maven-javadoc-plugin:2.10.3:jar (default-cli) @ struts2-parent ---
[INFO] Not executing Javadoc as the project is not a Java classpath-capable package
[INFO]
[INFO] --- maven-remote-resources-plugin:1.5:process (process-resource-bundles) @ struts2-parent ---
[INFO]
[INFO] --- maven-bundle-plugin:2.1.0:manifest (bundle-manifest) @ struts2-parent ---
[WARNING] Ignoring project type pom - supportedProjectTypes = [jar, bundle]
[INFO]
[INFO] >>> maven-source-plugin:3.0.0:jar (attach-sources) > generate-sources @ struts2-parent >>>
[INFO]
[INFO] <<< maven-source-plugin:3.0.0:jar (attach-sources) < generate-sources @ struts2-parent <<<
[INFO]
[INFO]
[INFO] --- maven-source-plugin:3.0.0:jar (attach-sources) @ struts2-parent ---
[INFO]
[INFO] --- maven-site-plugin:3.5.1:attach-descriptor (attach-descriptor) @ struts2-parent ---
[INFO]
[INFO] --- apache-rat-plugin:0.11:check (default) @ struts2-parent ---
[INFO] 57 implicit excludes (use -debug for more details).
[INFO] Exclude: src/main/resources/org/apache/struts2/static/domTT.js
[INFO] Exclude: src/site/resources/tags/**/*.html
[INFO] Exclude: src/main/resources/*LICENSE.txt
[INFO] Exclude: src/test/resources/**/*.txt
[INFO] Exclude: src/main/webapp/**/*.css
[INFO] Exclude: src/main/webapp/**/*.map
[INFO] Exclude: src/main/webapp/**/*.js
[INFO] Exclude: src/main/webapp/**/*.svg
[INFO] Exclude: src/main/webapp/**/*.txt
[INFO] Exclude: src/main/resources/**/sitegraph-usage.txt
[INFO] Exclude: src/main/resources/**/docs-urls.txt
[INFO] Exclude: src/etc/header.txt
[INFO] Exclude: src/main/resources/static/css/**/*.css
[INFO] Exclude: src/main/resources/static/js/**/*.js
[INFO] Exclude: src/main/resources/docs.cfg
[INFO] Exclude: src/main/webapp/fonts/**/*
[INFO] 3 resources included (use -debug for more details)
[INFO] Rat check: Summary of files. Unapproved: 0 unknown: 0 generated: 0 approved: 3 licence.
[INFO]
[INFO] --- maven-install-plugin:2.5.2:install (default-install) @ struts2-parent ---
[INFO] Installing <https://builds.apache.org/job/Struts-master-JDK7/ws/pom.xml> to /home/jenkins/.m2/repository/org/apache/struts/struts2-parent/2.6-SNAPSHOT/struts2-parent-2.6-SNAPSHOT.pom
[INFO] Installing <https://builds.apache.org/job/Struts-master-JDK7/ws/target/struts2-parent-2.6-SNAPSHOT-site.xml> to /home/jenkins/.m2/repository/org/apache/struts/struts2-parent/2.6-SNAPSHOT/struts2-parent-2.6-SNAPSHOT-site.xml
[INFO]
[INFO] --- maven-remote-resources-plugin:1.5:process (process-resource-bundles) @ struts2-parent ---
[INFO]
[INFO] --- maven-bundle-plugin:2.1.0:manifest (bundle-manifest) @ struts2-parent ---
[WARNING] Ignoring project type pom - supportedProjectTypes = [jar, bundle]
[INFO]
[INFO] >>> maven-source-plugin:3.0.0:jar (attach-sources) > generate-sources @ struts2-parent >>>
[INFO]
[INFO] <<< maven-source-plugin:3.0.0:jar (attach-sources) < generate-sources @ struts2-parent <<<
[INFO]
[INFO]
[INFO] --- maven-source-plugin:3.0.0:jar (attach-sources) @ struts2-parent ---
[INFO]
[INFO] --- maven-site-plugin:3.5.1:attach-descriptor (attach-descriptor) @ struts2-parent ---
[INFO]
[INFO] --- apache-rat-plugin:0.11:check (default) @ struts2-parent ---
[INFO] 57 implicit excludes (use -debug for more details).
[INFO] Exclude: src/main/resources/org/apache/struts2/static/domTT.js
[INFO] Exclude: src/site/resources/tags/**/*.html
[INFO] Exclude: src/main/resources/*LICENSE.txt
[INFO] Exclude: src/test/resources/**/*.txt
[INFO] Exclude: src/main/webapp/**/*.css
[INFO] Exclude: src/main/webapp/**/*.map
[INFO] Exclude: src/main/webapp/**/*.js
[INFO] Exclude: src/main/webapp/**/*.svg
[INFO] Exclude: src/main/webapp/**/*.txt
[INFO] Exclude: src/main/resources/**/sitegraph-usage.txt
[INFO] Exclude: src/main/resources/**/docs-urls.txt
[INFO] Exclude: src/etc/header.txt
[INFO] Exclude: src/main/resources/static/css/**/*.css
[INFO] Exclude: src/main/resources/static/js/**/*.js
[INFO] Exclude: src/main/resources/docs.cfg
[INFO] Exclude: src/main/webapp/fonts/**/*
[INFO] 3 resources included (use -debug for more details)
[INFO] Rat check: Summary of files. Unapproved: 0 unknown: 0 generated: 0 approved: 3 licence.
[INFO]
[INFO] --- maven-install-plugin:2.5.2:install (default-install) @ struts2-parent ---
[INFO] Installing <https://builds.apache.org/job/Struts-master-JDK7/ws/pom.xml> to /home/jenkins/.m2/repository/org/apache/struts/struts2-parent/2.6-SNAPSHOT/struts2-parent-2.6-SNAPSHOT.pom
[INFO] Installing <https://builds.apache.org/job/Struts-master-JDK7/ws/target/struts2-parent-2.6-SNAPSHOT-site.xml> to /home/jenkins/.m2/repository/org/apache/struts/struts2-parent/2.6-SNAPSHOT/struts2-parent-2.6-SNAPSHOT-site.xml
[INFO] Installing <https://builds.apache.org/job/Struts-master-JDK7/ws/target/struts2-parent-2.6-SNAPSHOT-site.xml> to /home/jenkins/.m2/repository/org/apache/struts/struts2-parent/2.6-SNAPSHOT/struts2-parent-2.6-SNAPSHOT-site.xml
[INFO]
[INFO] --- maven-deploy-plugin:2.8.2:deploy (default-deploy) @ struts2-parent ---
Downloading from apache.snapshots.https: https://repository.apache.org/content/repositories/snapshots/org/apache/struts/struts2-parent/2.6-SNAPSHOT/maven-metadata.xml
Progress (1): 813 B                   Downloaded from apache.snapshots.https: https://repository.apache.org/content/repositories/snapshots/org/apache/struts/struts2-parent/2.6-SNAPSHOT/maven-metadata.xml (813 B at 1.4 kB/s)
Uploading to apache.snapshots.https: https://repository.apache.org/content/repositories/snapshots/org/apache/struts/struts2-parent/2.6-SNAPSHOT/struts2-parent-2.6-20171213.124547-7.pom
Progress (1): 2.0/43 kBProgress (1): 4.1/43 kBProgress (1): 6.1/43 kBProgress (1): 8.2/43 kBProgress (1): 10/43 kB Progress (1): 12/43 kBProgress (1): 14/43 kBProgress (1): 16/43 kBProgress (1): 18/43 kBProgress (1): 20/43 kBProgress (1): 23/43 kBProgress (1): 25/43 kBProgress (1): 27/43 kBProgress (1): 29/43 kBProgress (1): 31/43 kBProgress (1): 33/43 kBProgress (1): 35/43 kBProgress (1): 37/43 kBProgress (1): 39/43 kBProgress (1): 41/43 kBProgress (1): 43 kB                      Uploaded to apache.snapshots.https: https://repository.apache.org/content/repositories/snapshots/org/apache/struts/struts2-parent/2.6-SNAPSHOT/struts2-parent-2.6-20171213.124547-7.pom (43 kB at 33 kB/s)
Downloading from apache.snapshots.https: https://repository.apache.org/content/repositories/snapshots/org/apache/struts/struts2-parent/maven-metadata.xml
Progress (1): 1.3 kB                    Downloaded from apache.snapshots.https: https://repository.apache.org/content/repositories/snapshots/org/apache/struts/struts2-parent/maven-metadata.xml (1.3 kB at 2.3 kB/s)
Uploading to apache.snapshots.https: https://repository.apache.org/content/repositories/snapshots/org/apache/struts/struts2-parent/2.6-SNAPSHOT/maven-metadata.xml
Progress (1): 813 B                   Uploaded to apache.snapshots.https: https://repository.apache.org/content/repositories/snapshots/org/apache/struts/struts2-parent/2.6-SNAPSHOT/maven-metadata.xml (813 B at 705 B/s)
Uploading to apache.snapshots.https: https://repository.apache.org/content/repositories/snapshots/org/apache/struts/struts2-parent/maven-metadata.xml
Progress (1): 1.3 kB                    Uploaded to apache.snapshots.https: https://repository.apache.org/content/repositories/snapshots/org/apache/struts/struts2-parent/maven-metadata.xml (1.3 kB at 1.2 kB/s)
Uploading to apache.snapshots.https: https://repository.apache.org/content/repositories/snapshots/org/apache/struts/struts2-parent/2.6-SNAPSHOT/struts2-parent-2.6-20171213.124547-7-site.xml
Progress (1): 2.0/2.4 kBProgress (1): 2.4 kB                        Uploaded to apache.snapshots.https: https://repository.apache.org/content/repositories/snapshots/org/apache/struts/struts2-parent/2.6-SNAPSHOT/struts2-parent-2.6-20171213.124547-7-site.xml (2.4 kB at 2.1 kB/s)
Uploading to apache.snapshots.https: https://repository.apache.org/content/repositories/snapshots/org/apache/struts/struts2-parent/2.6-SNAPSHOT/maven-metadata.xml
Progress (1): 813 B                   Uploaded to apache.snapshots.https: https://repository.apache.org/content/repositories/snapshots/org/apache/struts/struts2-parent/2.6-SNAPSHOT/maven-metadata.xml (813 B at 723 B/s)
Uploading to apache.snapshots.https: https://repository.apache.org/content/repositories/snapshots/org/apache/struts/struts2-parent/2.6-SNAPSHOT/struts2-parent-2.6-20171213.124547-7-site.xml
Progress (1): 2.0/2.4 kBProgress (1): 2.4 kB                        Uploaded to apache.snapshots.https: https://repository.apache.org/content/repositories/snapshots/org/apache/struts/struts2-parent/2.6-SNAPSHOT/struts2-parent-2.6-20171213.124547-7-site.xml (2.4 kB at 2.1 kB/s)
Uploading to apache.snapshots.https: https://repository.apache.org/content/repositories/snapshots/org/apache/struts/struts2-parent/2.6-SNAPSHOT/maven-metadata.xml
Progress (1): 813 B                   Uploaded to apache.snapshots.https: https://repository.apache.org/content/repositories/snapshots/org/apache/struts/struts2-parent/2.6-SNAPSHOT/maven-metadata.xml (813 B at 726 B/s)
[INFO]
[INFO] ------------------------------------------------------------------------
[INFO] Building Struts 2 Core 2.6-SNAPSHOT
[INFO] ------------------------------------------------------------------------
Downloading from central: https://repo.maven.apache.org/maven2/com/cj/jshintmojo/jshint-maven-plugin/1.6.0/jshint-maven-plugin-1.6.0.pom
Progress (1): 2.2/3.5 kBProgress (1): 3.5 kB                        Downloaded from central: https://repo.maven.apache.org/maven2/com/cj/jshintmojo/jshint-maven-plugin/1.6.0/jshint-maven-plugin-1.6.0.pom (3.5 kB at 195 kB/s)
Downloading from central: https://repo.maven.apache.org/maven2/com/cj/jshintmojo/jshint-maven-plugin/1.6.0/jshint-maven-plugin-1.6.0.jar
Progress (1): 0/1.3 MBProgress (1): 0/1.3 MBProgress (1): 0/1.3 MBProgress (1): 0/1.3 MBProgress (1): 0/1.3 MBProgress (1): 0/1.3 MBProgress (1): 0/1.3 MBProgress (1): 0/1.3 MBProgress (1): 0/1.3 MBProgress (1): 0/1.3 MBProgress (1): 0/1.3 MBProgress (1): 0/1.3 MBProgress (1): 0/1.3 MBProgress (1): 0/1.3 MBProgress (1): 0/1.3 MBProgress (1): 0/1.3 MBProgress (1): 0.1/1.3 MBProgress (1): 0.1/1.3 MBProgress (1): 0.1/1.3 MBProgress (1): 0.1/1.3 MBProgress (1): 0.1/1.3 MBProgress (1): 0.1/1.3 MBProgress (1): 0.1/1.3 MBProgress (1): 0.1/1.3 MBProgress (1): 0.1/1.3 MBProgress (1): 0.1/1.3 MBProgress (1): 0.1/1.3 MBProgress (1): 0.1/1.3 MBProgress (1): 0.1/1.3 MBProgress (1): 0.1/1.3 MBProgress (1): 0.1/1.3 MBProgress (1): 0.1/1.3 MBProgress (1): 0.1/1.3 MBProgress (1): 0.1/1.3 MBProgress (1): 0.1/1.3 MBProgress (1): 0.1/1.3 MBProgress (1): 0.1/1.3 MBProgress (1): 0.1/1.3 MBProgress (1): 0.1/1.3 MBProgress (1): 0.1/1.3 MBProgress (1): 0.2/1.3 MBProgress (1): 0.2/1.3 MBProgress (1): 0.2/1.3 MBProgress (1): 0.2/1.3 MBProgress (1): 0.2/1.3 MBProgress (1): 0.2/1.3 MBProgress (1): 0.2/1.3 MBProgress (1): 0.2/1.3 MBProgress (1): 0.2/1.3 MBProgress (1): 0.2/1.3 MBProgress (1): 0.2/1.3 MBProgress (1): 0.2/1.3 MBProgress (1): 0.2/1.3 MBProgress (1): 0.2/1.3 MBProgress (1): 0.2/1.3 MBProgress (1): 0.2/1.3 MBProgress (1): 0.2/1.3 MBProgress (1): 0.2/1.3 MBProgress (1): 0.2/1.3 MBProgress (1): 0.2/1.3 MBProgress (1): 0.2/1.3 MBProgress (1): 0.2/1.3 MBProgress (1): 0.2/1.3 MBProgress (1): 0.2/1.3 MBProgress (1): 0.2/1.3 MBProgress (1): 0.3/1.3 MBProgress (1): 0.3/1.3 MBProgress (1): 0.3/1.3 MBProgress (1): 0.3/1.3 MBProgress (1): 0.3/1.3 MBProgress (1): 0.3/1.3 MBProgress (1): 0.3/1.3 MBProgress (1): 0.3/1.3 MBProgress (1): 0.3/1.3 MBProgress (1): 0.3/1.3 MBProgress (1): 0.3/1.3 MBProgress (1): 0.3/1.3 MBProgress (1): 0.3/1.3 MBProgress (1): 0.3/1.3 MBProgress (1): 0.3/1.3 MBProgress (1): 0.3/1.3 MBProgress (1): 0.3/1.3 MBProgress (1): 0.3/1.3 MBProgress (1): 0.3/1.3 MBProgress (1): 0.3/1.3 MBProgress (1): 0.3/1.3 MBProgress (1): 0.3/1.3 MBProgress (1): 0.3/1.3 MBProgress (1): 0.3/1.3 MBProgress (1): 0.4/1.3 MBProgress (1): 0.4/1.3 MBProgress (1): 0.4/1.3 MBProgress (1): 0.4/1.3 MBProgress (1): 0.4/1.3 MBProgress (1): 0.4/1.3 MBProgress (1): 0.4/1.3 MBProgress (1): 0.4/1.3 MBProgress (1): 0.4/1.3 MBProgress (1): 0.4/1.3 MBProgress (1): 0.4/1.3 MBProgress (1): 0.4/1.3 MBProgress (1): 0.4/1.3 MBProgress (1): 0.4/1.3 MBProgress (1): 0.4/1.3 MBProgress (1): 0.4/1.3 MBProgress (1): 0.4/1.3 MBProgress (1): 0.4/1.3 MBProgress (1): 0.4/1.3 MBProgress (1): 0.4/1.3 MBProgress (1): 0.4/1.3 MBProgress (1): 0.4/1.3 MBProgress (1): 0.4/1.3 MBProgress (1): 0.4/1.3 MBProgress (1): 0.4/1.3 MBProgress (1): 0.5/1.3 MBProgress (1): 0.5/1.3 MBProgress (1): 0.5/1.3 MBProgress (1): 0.5/1.3 MBProgress (1): 0.5/1.3 MBProgress (1): 0.5/1.3 MBProgress (1): 0.5/1.3 MBProgress (1): 0.5/1.3 MBProgress (1): 0.5/1.3 MBProgress (1): 0.5/1.3 MBProgress (1): 0.5/1.3 MBProgress (1): 0.5/1.3 MBProgress (1): 0.5/1.3 MBProgress (1): 0.5/1.3 MBProgress (1): 0.5/1.3 MBProgress (1): 0.5/1.3 MBProgress (1): 0.5/1.3 MBProgress (1): 0.5/1.3 MBProgress (1): 0.5/1.3 MBProgress (1): 0.5/1.3 MBProgress (1): 0.5/1.3 MBProgress (1): 0.5/1.3 MBProgress (1): 0.5/1.3 MBProgress (1): 0.5/1.3 MBProgress (1): 0.6/1.3 MBProgress (1): 0.6/1.3 MBProgress (1): 0.6/1.3 MBProgress (1): 0.6/1.3 MBProgress (1): 0.6/1.3 MBProgress (1): 0.6/1.3 MBProgress (1): 0.6/1.3 MBProgress (1): 0.6/1.3 MBProgress (1): 0.6/1.3 MBProgress (1): 0.6/1.3 MBProgress (1): 0.6/1.3 MBProgress (1): 0.6/1.3 MBProgress (1): 0.6/1.3 MBProgress (1): 0.6/1.3 MBProgress (1): 0.6/1.3 MBProgress (1): 0.6/1.3 MBProgress (1): 0.6/1.3 MBProgress (1): 0.6/1.3 MBProgress (1): 0.6/1.3 MBProgress (1): 0.6/1.3 MBProgress (1): 0.6/1.3 MBProgress (1): 0.6/1.3 MBProgress (1): 0.6/1.3 MBProgress (1): 0.6/1.3 MBProgress (1): 0.7/1.3 MBProgress (1): 0.7/1.3 MBProgress (1): 0.7/1.3 MBProgress (1): 0.7/1.3 MBProgress (1): 0.7/1.3 MBProgress (1): 0.7/1.3 MBProgress (1): 0.7/1.3 MBProgress (1): 0.7/1.3 MBProgress (1): 0.7/1.3 MBProgress (1): 0.7/1.3 MBProgress (1): 0.7/1.3 MBProgress (1): 0.7/1.3 MBProgress (1): 0.7/1.3 MBProgress (1): 0.7/1.3 MBProgress (1): 0.7/1.3 MBProgress (1): 0.7/1.3 MBProgress (1): 0.7/1.3 MBProgress (1): 0.7/1.3 MBProgress (1): 0.7/1.3 MBProgress (1): 0.7/1.3 MBProgress (1): 0.7/1.3 MBProgress (1): 0.7/1.3 MBProgress (1): 0.7/1.3 MBProgress (1): 0.7/1.3 MBProgress (1): 0.7/1.3 MBProgress (1): 0.8/1.3 MBProgress (1): 0.8/1.3 MBProgress (1): 0.8/1.3 MBProgress (1): 0.8/1.3 MBProgress (1): 0.8/1.3 MBProgress (1): 0.8/1.3 MBProgress (1): 0.8/1.3 MBProgress (1): 0.8/1.3 MBProgress (1): 0.8/1.3 MBProgress (1): 0.8/1.3 MBProgress (1): 0.8/1.3 MBProgress (1): 0.8/1.3 MBProgress (1): 0.8/1.3 MBProgress (1): 0.8/1.3 MBProgress (1): 0.8/1.3 MBProgress (1): 0.8/1.3 MBProgress (1): 0.8/1.3 MBProgress (1): 0.8/1.3 MBProgress (1): 0.8/1.3 MBProgress (1): 0.8/1.3 MBProgress (1): 0.8/1.3 MBProgress (1): 0.8/1.3 MBProgress (1): 0.8/1.3 MBProgress (1): 0.8/1.3 MBProgress (1): 0.9/1.3 MBProgress (1): 0.9/1.3 MBProgress (1): 0.9/1.3 MBProgress (1): 0.9/1.3 MBProgress (1): 0.9/1.3 MBProgress (1): 0.9/1.3 MBProgress (1): 0.9/1.3 MBProgress (1): 0.9/1.3 MBProgress (1): 0.9/1.3 MBProgress (1): 0.9/1.3 MBProgress (1): 0.9/1.3 MBProgress (1): 0.9/1.3 MBProgress (1): 0.9/1.3 MBProgress (1): 0.9/1.3 MBProgress (1): 0.9/1.3 MBProgress (1): 0.9/1.3 MBProgress (1): 0.9/1.3 MBProgress (1): 0.9/1.3 MBProgress (1): 0.9/1.3 MBProgress (1): 0.9/1.3 MBProgress (1): 0.9/1.3 MBProgress (1): 0.9/1.3 MBProgress (1): 0.9/1.3 MBProgress (1): 0.9/1.3 MBProgress (1): 0.9/1.3 MBProgress (1): 1.0/1.3 MBProgress (1): 1.0/1.3 MBProgress (1): 1.0/1.3 MBProgress (1): 1.0/1.3 MBProgress (1): 1.0/1.3 MBProgress (1): 1.0/1.3 MBProgress (1): 1.0/1.3 MBProgress (1): 1.0/1.3 MBProgress (1): 1.0/1.3 MBProgress (1): 1.0/1.3 MBProgress (1): 1.0/1.3 MBProgress (1): 1.0/1.3 MBProgress (1): 1.0/1.3 MBProgress (1): 1.0/1.3 MBProgress (1): 1.0/1.3 MBProgress (1): 1.0/1.3 MBProgress (1): 1.0/1.3 MBProgress (1): 1.0/1.3 MBProgress (1): 1.0/1.3 MBProgress (1): 1.0/1.3 MBProgress (1): 1.0/1.3 MBProgress (1): 1.0/1.3 MBProgress (1): 1.0/1.3 MBProgress (1): 1.0/1.3 MBProgress (1): 1.1/1.3 MBProgress (1): 1.1/1.3 MBProgress (1): 1.1/1.3 MBProgress (1): 1.1/1.3 MBProgress (1): 1.1/1.3 MBProgress (1): 1.1/1.3 MBProgress (1): 1.1/1.3 MBProgress (1): 1.1/1.3 MBProgress (1): 1.1/1.3 MBProgress (1): 1.1/1.3 MBProgress (1): 1.1/1.3 MBProgress (1): 1.1/1.3 MBProgress (1): 1.1/1.3 MBProgress (1): 1.1/1.3 MBProgress (1): 1.1/1.3 MBProgress (1): 1.1/1.3 MBProgress (1): 1.1/1.3 MBProgress (1): 1.1/1.3 MBProgress (1): 1.1/1.3 MBProgress (1): 1.1/1.3 MBProgress (1): 1.1/1.3 MBProgress (1): 1.1/1.3 MBProgress (1): 1.1/1.3 MBProgress (1): 1.1/1.3 MBProgress (1): 1.2/1.3 MBProgress (1): 1.2/1.3 MBProgress (1): 1.2/1.3 MBProgress (1): 1.2/1.3 MBProgress (1): 1.2/1.3 MBProgress (1): 1.2/1.3 MBProgress (1): 1.2/1.3 MBProgress (1): 1.2/1.3 MBProgress (1): 1.2/1.3 MBProgress (1): 1.2/1.3 MBProgress (1): 1.2/1.3 MBProgress (1): 1.2/1.3 MBProgress (1): 1.2/1.3 MBProgress (1): 1.2/1.3 MBProgress (1): 1.2/1.3 MBProgress (1): 1.2/1.3 MBProgress (1): 1.2/1.3 MBProgress (1): 1.2/1.3 MBProgress (1): 1.2/1.3 MBProgress (1): 1.2/1.3 MBProgress (1): 1.2/1.3 MBProgress (1): 1.2/1.3 MBProgress (1): 1.2/1.3 MBProgress (1): 1.2/1.3 MBProgress (1): 1.2/1.3 MBProgress (1): 1.3/1.3 MBProgress (1): 1.3/1.3 MBProgress (1): 1.3/1.3 MBProgress (1): 1.3/1.3 MBProgress (1): 1.3/1.3 MBProgress (1): 1.3/1.3 MBProgress (1): 1.3/1.3 MBProgress (1): 1.3/1.3 MBProgress (1): 1.3/1.3 MBProgress (1): 1.3/1.3 MBProgress (1): 1.3/1.3 MBProgress (1): 1.3 MB                        Downloaded from central: https://repo.maven.apache.org/maven2/com/cj/jshintmojo/jshint-maven-plugin/1.6.0/jshint-maven-plugin-1.6.0.jar (1.3 MB at 10 MB/s)
Downloading from central: https://repo.maven.apache.org/maven2/org/apache/maven/plugins/maven-surefire-plugin/2.6/maven-surefire-plugin-2.6.pom
Progress (1): 4.1/9.4 kBProgress (1): 7.6/9.4 kBProgress (1): 9.4 kB                        Downloaded from central: https://repo.maven.apache.org/maven2/org/apache/maven/plugins/maven-surefire-plugin/2.6/maven-surefire-plugin-2.6.pom (9.4 kB at 587 kB/s)
Downloading from central: https://repo.maven.apache.org/maven2/org/apache/maven/surefire/surefire/2.6/surefire-2.6.pom
Progress (1): 4.1/8.8 kBProgress (1): 7.6/8.8 kBProgress (1): 8.8 kB                        Downloaded from central: https://repo.maven.apache.org/maven2/org/apache/maven/surefire/surefire/2.6/surefire-2.6.pom (8.8 kB at 590 kB/s)
Downloading from central: https://repo.maven.apache.org/maven2/org/apache/maven/plugins/maven-surefire-plugin/2.6/maven-surefire-plugin-2.6.jar
Progress (1): 4.1/28 kBProgress (1): 7.6/28 kBProgress (1): 12/28 kB Progress (1): 16/28 kBProgress (1): 20/28 kBProgress (1): 24/28 kBProgress (1): 28/28 kBProgress (1): 28 kB                      Downloaded from central: https://repo.maven.apache.org/maven2/org/apache/maven/plugins/maven-surefire-plugin/2.6/maven-surefire-plugin-2.6.jar (28 kB at 1.8 MB/s)
Downloading from central: https://repo.maven.apache.org/maven2/org/freemarker/freemarker/2.3.26-incubating/freemarker-2.3.26-incubating.pom
Progress (1): 3.5 kB                    Downloaded from central: https://repo.maven.apache.org/maven2/org/freemarker/freemarker/2.3.26-incubating/freemarker-2.3.26-incubating.pom (3.5 kB at 206 kB/s)
Downloading from central: https://repo.maven.apache.org/maven2/javax/servlet/servlet-api/2.4/servlet-api-2.4.pom
Progress (1): 156 B                   Downloaded from central: https://repo.maven.apache.org/maven2/javax/servlet/servlet-api/2.4/servlet-api-2.4.pom (156 B at 12 kB/s)
Downloading from central: https://repo.maven.apache.org/maven2/javax/servlet/jsp-api/2.0/jsp-api-2.0.pom
Progress (1): 362 B                   Downloaded from central: https://repo.maven.apache.org/maven2/javax/servlet/jsp-api/2.0/jsp-api-2.0.pom (362 B at 24 kB/s)
Downloading from central: https://repo.maven.apache.org/maven2/ognl/ognl/3.1.15/ognl-3.1.15.pom
Progress (1): 2.2/5.9 kBProgress (1): 4.9/5.9 kBProgress (1): 5.9 kB                        Downloaded from central: https://repo.maven.apache.org/maven2/ognl/ognl/3.1.15/ognl-3.1.15.pom (5.9 kB at 391 kB/s)
Downloading from central: https://repo.maven.apache.org/maven2/commons-digester/commons-digester/2.1/commons-digester-2.1.pom
Downloaded from central: https://repo.maven.apache.org/maven2/commons-digester/commons-digester/2.1/commons-digester-2.1.pom (0 B at 0 B/s)
Downloading from central: https://repo.maven.apache.org/maven2/commons-validator/commons-validator/1.5.1/commons-validator-1.5.1.pom
Progress (1): 2.1/12 kBProgress (1): 4.9/12 kBProgress (1): 7.7/12 kBProgress (1): 10/12 kB Progress (1): 12 kB                      Downloaded from central: https://repo.maven.apache.org/maven2/commons-validator/commons-validator/1.5.1/commons-validator-1.5.1.pom (12 kB at 643 kB/s)
Downloading from central: https://repo.maven.apache.org/maven2/org/apache/logging/log4j/log4j-api/2.9.1/log4j-api-2.9.1.pom
Progress (1): 2.8/12 kBProgress (1): 5.5/12 kBProgress (1): 8.3/12 kBProgress (1): 11/12 kB Progress (1): 12 kB                      Downloaded from central: https://repo.maven.apache.org/maven2/org/apache/logging/log4j/log4j-api/2.9.1/log4j-api-2.9.1.pom (12 kB at 825 kB/s)
Downloading from central: https://repo.maven.apache.org/maven2/org/apache/logging/log4j/log4j/2.9.1/log4j-2.9.1.pom
Progress (1): 2.2/55 kBProgress (1): 4.9/55 kBProgress (1): 7.7/55 kBProgress (1): 10/55 kB Progress (1): 13/55 kBProgress (1): 16/55 kBProgress (1): 19/55 kBProgress (1): 21/55 kBProgress (1): 24/55 kBProgress (1): 27/55 kBProgress (1): 30/55 kBProgress (1): 32/55 kBProgress (1): 36/55 kBProgress (1): 40/55 kBProgress (1): 44/55 kBProgress (1): 49/55 kBProgress (1): 53/55 kBProgress (1): 55 kB                      Downloaded from central: https://repo.maven.apache.org/maven2/org/apache/logging/log4j/log4j/2.9.1/log4j-2.9.1.pom (55 kB at 3.3 MB/s)
Downloading from central: https://repo.maven.apache.org/maven2/org/apache/logging/logging-parent/1/logging-parent-1.pom
Progress (1): 2.2/3.2 kBProgress (1): 3.2 kB                        Downloaded from central: https://repo.maven.apache.org/maven2/org/apache/logging/logging-parent/1/logging-parent-1.pom (3.2 kB at 243 kB/s)
Downloading from central: https://repo.maven.apache.org/maven2/org/springframework/spring-core/4.1.9.RELEASE/spring-core-4.1.9.RELEASE.pom
Progress (1): 2.1/2.5 kBProgress (1): 2.5 kB                        Downloaded from central: https://repo.maven.apache.org/maven2/org/springframework/spring-core/4.1.9.RELEASE/spring-core-4.1.9.RELEASE.pom (2.5 kB at 166 kB/s)
Downloading from central: https://repo.maven.apache.org/maven2/org/springframework/spring-aop/4.1.9.RELEASE/spring-aop-4.1.9.RELEASE.pom
Progress (1): 2.2/2.7 kBProgress (1): 2.7 kB                        Downloaded from central: https://repo.maven.apache.org/maven2/org/springframework/spring-aop/4.1.9.RELEASE/spring-aop-4.1.9.RELEASE.pom (2.7 kB at 189 kB/s)
Downloading from central: https://repo.maven.apache.org/maven2/org/springframework/spring-beans/4.1.9.RELEASE/spring-beans-4.1.9.RELEASE.pom
Progress (1): 2.1/2.5 kBProgress (1): 2.5 kB                        Downloaded from central: https://repo.maven.apache.org/maven2/org/springframework/spring-beans/4.1.9.RELEASE/spring-beans-4.1.9.RELEASE.pom (2.5 kB at 179 kB/s)
Downloading from central: https://repo.maven.apache.org/maven2/org/springframework/spring-aspects/4.1.9.RELEASE/spring-aspects-4.1.9.RELEASE.pom
Progress (1): 2.2/3.4 kBProgress (1): 3.4 kB                        Downloaded from central: https://repo.maven.apache.org/maven2/org/springframework/spring-aspects/4.1.9.RELEASE/spring-aspects-4.1.9.RELEASE.pom (3.4 kB at 214 kB/s)
Downloading from central: https://repo.maven.apache.org/maven2/org/aspectj/aspectjweaver/1.8.7/aspectjweaver-1.8.7.pom
Progress (1): 1.0 kB                    Downloaded from central: https://repo.maven.apache.org/maven2/org/aspectj/aspectjweaver/1.8.7/aspectjweaver-1.8.7.pom (1.0 kB at 75 kB/s)
Downloading from central: https://repo.maven.apache.org/maven2/org/springframework/spring-context/4.1.9.RELEASE/spring-context-4.1.9.RELEASE.pom
Progress (1): 2.2/4.8 kBProgress (1): 4.8 kB                        Downloaded from central: https://repo.maven.apache.org/maven2/org/springframework/spring-context/4.1.9.RELEASE/spring-context-4.1.9.RELEASE.pom (4.8 kB at 371 kB/s)
Downloading from central: https://repo.maven.apache.org/maven2/org/springframework/spring-expression/4.1.9.RELEASE/spring-expression-4.1.9.RELEASE.pom
Progress (1): 1.7 kB                    Downloaded from central: https://repo.maven.apache.org/maven2/org/springframework/spring-expression/4.1.9.RELEASE/spring-expression-4.1.9.RELEASE.pom (1.7 kB at 133 kB/s)
Downloading from central: https://repo.maven.apache.org/maven2/org/springframework/spring-context-support/4.1.9.RELEASE/spring-context-support-4.1.9.RELEASE.pom
Progress (1): 2.2/5.5 kBProgress (1): 4.9/5.5 kBProgress (1): 5.5 kB                        Downloaded from central: https://repo.maven.apache.org/maven2/org/springframework/spring-context-support/4.1.9.RELEASE/spring-context-support-4.1.9.RELEASE.pom (5.5 kB at 344 kB/s)
Downloading from central: https://repo.maven.apache.org/maven2/org/springframework/spring-web/4.1.9.RELEASE/spring-web-4.1.9.RELEASE.pom
Progress (1): 2.2/7.5 kBProgress (1): 4.9/7.5 kBProgress (1): 7.5 kB                        Downloaded from central: https://repo.maven.apache.org/maven2/org/springframework/spring-web/4.1.9.RELEASE/spring-web-4.1.9.RELEASE.pom (7.5 kB at 502 kB/s)
Downloading from central: https://repo.maven.apache.org/maven2/org/springframework/spring-test/4.1.9.RELEASE/spring-test-4.1.9.RELEASE.pom
Progress (1): 2.1/6.8 kBProgress (1): 4.9/6.8 kBProgress (1): 6.8 kB                        Downloaded from central: https://repo.maven.apache.org/maven2/org/springframework/spring-test/4.1.9.RELEASE/spring-test-4.1.9.RELEASE.pom (6.8 kB at 263 kB/s)
Downloading from central: https://repo.maven.apache.org/maven2/org/apache/logging/log4j/log4j-core/2.9.1/log4j-core-2.9.1.pom
Progress (1): 2.1/20 kBProgress (1): 4.9/20 kBProgress (1): 7.7/20 kBProgress (1): 10/20 kB Progress (1): 13/20 kBProgress (1): 16/20 kBProgress (1): 19/20 kBProgress (1): 20 kB                      Downloaded from central: https://repo.maven.apache.org/maven2/org/apache/logging/log4j/log4j-core/2.9.1/log4j-core-2.9.1.pom (20 kB at 1.1 MB/s)
Downloading from central: https://repo.maven.apache.org/maven2/mockobjects/mockobjects-jdk1.3/0.09/mockobjects-jdk1.3-0.09.pom
Progress (1): 162 B                   Downloaded from central: https://repo.maven.apache.org/maven2/mockobjects/mockobjects-jdk1.3/0.09/mockobjects-jdk1.3-0.09.pom (162 B at 9.5 kB/s)
Downloading from central: https://repo.maven.apache.org/maven2/mockobjects/mockobjects-alt-jdk1.3/0.09/mockobjects-alt-jdk1.3-0.09.pom
Progress (1): 166 B                   Downloaded from central: https://repo.maven.apache.org/maven2/mockobjects/mockobjects-alt-jdk1.3/0.09/mockobjects-alt-jdk1.3-0.09.pom (166 B at 1.9 kB/s)
Downloading from central: https://repo.maven.apache.org/maven2/mockobjects/mockobjects-alt-jdk1.3-j2ee1.3/0.09/mockobjects-alt-jdk1.3-j2ee1.3-0.09.pom
Progress (1): 174 B                   Downloaded from central: https://repo.maven.apache.org/maven2/mockobjects/mockobjects-alt-jdk1.3-j2ee1.3/0.09/mockobjects-alt-jdk1.3-j2ee1.3-0.09.pom (174 B at 12 kB/s)
Downloading from central: https://repo.maven.apache.org/maven2/mockobjects/mockobjects-jdk1.3-j2ee1.3/0.09/mockobjects-jdk1.3-j2ee1.3-0.09.pom
Progress (1): 170 B                   Downloaded from central: https://repo.maven.apache.org/maven2/mockobjects/mockobjects-jdk1.3-j2ee1.3/0.09/mockobjects-jdk1.3-j2ee1.3-0.09.pom (170 B at 1.9 kB/s)
Downloading from central: https://repo.maven.apache.org/maven2/jmock/jmock/1.2.0/jmock-1.2.0.pom
Progress (1): 895 B                   Downloaded from central: https://repo.maven.apache.org/maven2/jmock/jmock/1.2.0/jmock-1.2.0.pom (895 B at 53 kB/s)
Downloading from central: https://repo.maven.apache.org/maven2/org/easytesting/fest-assert/1.4/fest-assert-1.4.pom
Progress (1): 2.2/2.4 kBProgress (1): 2.4 kB                        Downloaded from central: https://repo.maven.apache.org/maven2/org/easytesting/fest-assert/1.4/fest-assert-1.4.pom (2.4 kB at 158 kB/s)
Downloading from central: https://repo.maven.apache.org/maven2/org/easytesting/fest/1.0.8/fest-1.0.8.pom
Progress (1): 2.1/12 kBProgress (1): 4.9/12 kBProgress (1): 7.7/12 kBProgress (1): 10/12 kB Progress (1): 12 kB                      Downloaded from central: https://repo.maven.apache.org/maven2/org/easytesting/fest/1.0.8/fest-1.0.8.pom (12 kB at 756 kB/s)
Downloading from central: https://repo.maven.apache.org/maven2/org/easytesting/fest-util/1.1.6/fest-util-1.1.6.pom
Progress (1): 1.6 kB                    Downloaded from central: https://repo.maven.apache.org/maven2/org/easytesting/fest-util/1.1.6/fest-util-1.1.6.pom (1.6 kB at 97 kB/s)
Downloading from central: https://repo.maven.apache.org/maven2/org/apache/struts/struts-annotations/1.0.6/struts-annotations-1.0.6.pom
Progress (1): 2.2/2.7 kBProgress (1): 2.7 kB                        Downloaded from central: https://repo.maven.apache.org/maven2/org/apache/struts/struts-annotations/1.0.6/struts-annotations-1.0.6.pom (2.7 kB at 183 kB/s)
Downloading from central: https://repo.maven.apache.org/maven2/org/testng/testng/5.14.10/testng-5.14.10.pom
[WARNING] Failed to create parent directories for tracking file /home/jenkins/.m2/repository/org/testng/testng/5.14.10/testng-5.14.10.pom.lastUpdated
[INFO] ------------------------------------------------------------------------
[INFO] Reactor Summary:
[INFO]
[INFO] Struts 2 Bill of Materials ......................... SUCCESS [  7.784 s]
[INFO] Struts 2 ........................................... SUCCESS [ 12.787 s]
[INFO] Struts 2 Core ...................................... FAILURE [  1.552 s]
[INFO] Struts Plugins ..................................... SKIPPED
[INFO] Struts 2 Configuration Browser Plugin .............. SKIPPED
[INFO] Struts 2 Sitemesh Plugin ........................... SKIPPED
[INFO] Struts 2 Tiles Plugin .............................. SKIPPED
[INFO] Struts 2 DWR Plugin ................................ SKIPPED
[INFO] Struts 2 Spring Plugin ............................. SKIPPED
[INFO] Struts 2 Convention Plugin ......................... SKIPPED
[INFO] Struts 2 JUnit Plugin .............................. SKIPPED
[INFO] Struts 2 JSON Plugin ............................... SKIPPED
[INFO] Struts 2 Bean Validation Plugin .................... SKIPPED
[INFO] Struts 2 Webapps ................................... SKIPPED
[INFO] Struts 2 Showcase Webapp ........................... SKIPPED
[INFO] Struts 2 REST Plugin ............................... SKIPPED
[INFO] Struts 2 Rest Showcase Webapp ...................... SKIPPED
[INFO] Struts 2 CDI Plugin ................................ SKIPPED
[INFO] Struts 2 Embedded JSP Plugin ....................... SKIPPED
[INFO] Struts 2 GXP Plugin ................................ SKIPPED
[INFO] Struts 2 Jasper Reports Plugin ..................... SKIPPED
[INFO] Struts 2 Java Templates Plugin ..................... SKIPPED
[INFO] Struts 2 JFreeChart Plugin ......................... SKIPPED
[INFO] Struts 2 OSGi Plugin ............................... SKIPPED
[INFO] Struts 2 OVal Plugin ............................... SKIPPED
[INFO] Struts 2 Pell Multipart Plugin ..................... SKIPPED
[INFO] Struts 2 Plexus Plugin ............................. SKIPPED
[INFO] Struts 2 Portlet Plugin ............................ SKIPPED
[INFO] Struts 2 Portlet Tiles Plugin ...................... SKIPPED
[INFO] DEPRECATED: Struts 2 Sitegraph Plugin .............. SKIPPED
[INFO] Struts 2 TestNG Plugin ............................. SKIPPED
[INFO] Struts OSGi Bundles ................................ SKIPPED
[INFO] Struts 2 OSGi Admin Bundle ......................... SKIPPED
[INFO] Struts 2 OSGi Demo Bundle .......................... SKIPPED
[INFO] Struts 2 Assembly .................................. SKIPPED
[INFO] ------------------------------------------------------------------------
[INFO] BUILD FAILURE
[INFO] ------------------------------------------------------------------------
[INFO] Total time: 26.533 s
[INFO] Finished at: 2017-12-13T12:45:57Z
[INFO] Final Memory: 51M/1448M
[INFO] ------------------------------------------------------------------------
[ERROR] Failed to execute goal on project struts2-core: Could not resolve dependencies for project org.apache.struts:struts2-core:jar:2.6-SNAPSHOT: Failed to collect dependencies at org.testng:testng:jar:5.14.10: Failed to read artifact descriptor for org.testng:testng:jar:5.14.10: Could not transfer artifact org.testng:testng:pom:5.14.10 from/to central (https://repo.maven.apache.org/maven2): /home/jenkins/.m2/repository/org/testng/testng/5.14.10/testng-5.14.10.pom.part.lock (No such file or directory) -> [Help 1]
[ERROR]
[ERROR] To see the full stack trace of the errors, re-run Maven with the -e switch.
[ERROR] Re-run Maven using the -X switch to enable full debug logging.
[ERROR]
[ERROR] For more information about the errors and possible solutions, please read the following articles:
[ERROR] [Help 1] http://cwiki.apache.org/confluence/display/MAVEN/DependencyResolutionException
[ERROR]
[ERROR] After correcting the problems, you can resume the build with the command
[ERROR]   mvn <goals> -rf :struts2-core
Build step 'Execute shell' marked build as failure
[locks-and-latches] Releasing all the locks
[locks-and-latches] All the locks released
Setting MAVEN_3_LATEST__HOME=/home/jenkins/tools/maven/latest3/


---------------------------------------------------------------------
To unsubscribe, e-mail: [hidden email]
For additional commands, e-mail: [hidden email]

Reply | Threaded
Open this post in threaded view
|

Build failed in Jenkins: Struts-master-JDK7 #69

Apache Jenkins Server-2
See <https://builds.apache.org/job/Struts-master-JDK7/69/display/redirect>

------------------------------------------
[...truncated 2.41 KB...]
[INFO] Struts 2 Spring Plugin
[INFO] Struts 2 Convention Plugin
[INFO] Struts 2 JUnit Plugin
[INFO] Struts 2 JSON Plugin
[INFO] Struts 2 Bean Validation Plugin
[INFO] Struts 2 Webapps
[INFO] Struts 2 Showcase Webapp
[INFO] Struts 2 REST Plugin
[INFO] Struts 2 Rest Showcase Webapp
[INFO] Struts 2 CDI Plugin
[INFO] Struts 2 Embedded JSP Plugin
[INFO] Struts 2 GXP Plugin
[INFO] Struts 2 Jasper Reports Plugin
[INFO] Struts 2 Java Templates Plugin
[INFO] Struts 2 JFreeChart Plugin
[INFO] Struts 2 OSGi Plugin
[INFO] Struts 2 OVal Plugin
[INFO] Struts 2 Pell Multipart Plugin
[INFO] Struts 2 Plexus Plugin
[INFO] Struts 2 Portlet Plugin
[INFO] Struts 2 Portlet Tiles Plugin
[INFO] DEPRECATED: Struts 2 Sitegraph Plugin
[INFO] Struts 2 TestNG Plugin
[INFO] Struts OSGi Bundles
[INFO] Struts 2 OSGi Admin Bundle
[INFO] Struts 2 OSGi Demo Bundle
[INFO] Struts 2 Assembly
[INFO]
[INFO] ------------------------------------------------------------------------
[INFO] Building Struts 2 Bill of Materials 2.6-SNAPSHOT
[INFO] ------------------------------------------------------------------------
[INFO]
[INFO] --- maven-clean-plugin:2.4.1:clean (default-clean) @ struts2-bom ---
[INFO]
[INFO] >>> maven-source-plugin:2.1.2:jar (default-cli) > generate-sources @ struts2-bom >>>
[INFO]
[INFO] <<< maven-source-plugin:2.1.2:jar (default-cli) < generate-sources @ struts2-bom <<<
[INFO]
[INFO]
[INFO] --- maven-source-plugin:2.1.2:jar (default-cli) @ struts2-bom ---
[INFO]
[INFO] --- maven-javadoc-plugin:2.8:jar (default-cli) @ struts2-bom ---
[INFO] Not executing Javadoc as the project is not a Java classpath-capable package
[INFO]
[INFO] --- maven-remote-resources-plugin:1.2.1:process (default) @ struts2-bom ---
[INFO]
[INFO] --- maven-site-plugin:3.0:attach-descriptor (attach-descriptor) @ struts2-bom ---
[INFO]
[INFO] --- maven-install-plugin:2.3.1:install (default-install) @ struts2-bom ---
[INFO] Installing <https://builds.apache.org/job/Struts-master-JDK7/ws/bom/pom.xml> to /home/jenkins/.m2/repository/org/apache/struts/struts2-bom/2.6-SNAPSHOT/struts2-bom-2.6-SNAPSHOT.pom
[INFO]
[INFO] --- maven-remote-resources-plugin:1.2.1:process (default) @ struts2-bom ---
[INFO]
[INFO] --- maven-site-plugin:3.0:attach-descriptor (attach-descriptor) @ struts2-bom ---
[INFO]
[INFO] --- maven-install-plugin:2.3.1:install (default-install) @ struts2-bom ---
[INFO] Installing <https://builds.apache.org/job/Struts-master-JDK7/ws/bom/pom.xml> to /home/jenkins/.m2/repository/org/apache/struts/struts2-bom/2.6-SNAPSHOT/struts2-bom-2.6-SNAPSHOT.pom
[INFO]
[INFO] --- maven-deploy-plugin:2.6:deploy (default-deploy) @ struts2-bom ---
Downloading from apache.snapshots.https: https://repository.apache.org/content/repositories/snapshots/org/apache/struts/struts2-bom/2.6-SNAPSHOT/maven-metadata.xml
Progress (1): 601 B                   Downloaded from apache.snapshots.https: https://repository.apache.org/content/repositories/snapshots/org/apache/struts/struts2-bom/2.6-SNAPSHOT/maven-metadata.xml (601 B at 482 B/s)
Uploading to apache.snapshots.https: https://repository.apache.org/content/repositories/snapshots/org/apache/struts/struts2-bom/2.6-SNAPSHOT/struts2-bom-2.6-20171213.130015-9.pom
Progress (1): 2.0/7.8 kBProgress (1): 4.1/7.8 kBProgress (1): 6.1/7.8 kBProgress (1): 7.8 kB                        Uploaded to apache.snapshots.https: https://repository.apache.org/content/repositories/snapshots/org/apache/struts/struts2-bom/2.6-SNAPSHOT/struts2-bom-2.6-20171213.130015-9.pom (7.8 kB at 6.1 kB/s)
Downloading from apache.snapshots.https: https://repository.apache.org/content/repositories/snapshots/org/apache/struts/struts2-bom/maven-metadata.xml
Progress (1): 831 B                   Downloaded from apache.snapshots.https: https://repository.apache.org/content/repositories/snapshots/org/apache/struts/struts2-bom/maven-metadata.xml (831 B at 748 B/s)
Uploading to apache.snapshots.https: https://repository.apache.org/content/repositories/snapshots/org/apache/struts/struts2-bom/2.6-SNAPSHOT/maven-metadata.xml
Progress (1): 601 B                   Uploaded to apache.snapshots.https: https://repository.apache.org/content/repositories/snapshots/org/apache/struts/struts2-bom/2.6-SNAPSHOT/maven-metadata.xml (601 B at 493 B/s)
Uploading to apache.snapshots.https: https://repository.apache.org/content/repositories/snapshots/org/apache/struts/struts2-bom/maven-metadata.xml
Progress (1): 831 B                   Uploaded to apache.snapshots.https: https://repository.apache.org/content/repositories/snapshots/org/apache/struts/struts2-bom/maven-metadata.xml (831 B at 722 B/s)
[INFO]
[INFO] ------------------------------------------------------------------------
[INFO] Building Struts 2 2.6-SNAPSHOT
[INFO] ------------------------------------------------------------------------
[INFO]
[INFO] --- maven-clean-plugin:3.0.0:clean (default-clean) @ struts2-parent ---
[INFO]
[INFO] >>> maven-source-plugin:3.0.0:jar (default-cli) > generate-sources @ struts2-parent >>>
[INFO]
[INFO] <<< maven-source-plugin:3.0.0:jar (default-cli) < generate-sources @ struts2-parent <<<
[INFO]
[INFO]
[INFO] --- maven-source-plugin:3.0.0:jar (default-cli) @ struts2-parent ---
[INFO]
[INFO] --- maven-javadoc-plugin:2.10.3:jar (default-cli) @ struts2-parent ---
[INFO] Not executing Javadoc as the project is not a Java classpath-capable package
[INFO]
[INFO] --- maven-remote-resources-plugin:1.5:process (process-resource-bundles) @ struts2-parent ---
[INFO]
[INFO] --- maven-bundle-plugin:2.1.0:manifest (bundle-manifest) @ struts2-parent ---
[WARNING] Ignoring project type pom - supportedProjectTypes = [jar, bundle]
[INFO]
[INFO] >>> maven-source-plugin:3.0.0:jar (attach-sources) > generate-sources @ struts2-parent >>>
[INFO]
[INFO] <<< maven-source-plugin:3.0.0:jar (attach-sources) < generate-sources @ struts2-parent <<<
[INFO]
[INFO]
[INFO] --- maven-source-plugin:3.0.0:jar (attach-sources) @ struts2-parent ---
[INFO]
[INFO] --- maven-site-plugin:3.5.1:attach-descriptor (attach-descriptor) @ struts2-parent ---
[INFO]
[INFO] --- apache-rat-plugin:0.11:check (default) @ struts2-parent ---
[INFO] 57 implicit excludes (use -debug for more details).
[INFO] Exclude: src/main/resources/org/apache/struts2/static/domTT.js
[INFO] Exclude: src/site/resources/tags/**/*.html
[INFO] Exclude: src/main/resources/*LICENSE.txt
[INFO] Exclude: src/test/resources/**/*.txt
[INFO] Exclude: src/main/webapp/**/*.css
[INFO] Exclude: src/main/webapp/**/*.map
[INFO] Exclude: src/main/webapp/**/*.js
[INFO] Exclude: src/main/webapp/**/*.svg
[INFO] Exclude: src/main/webapp/**/*.txt
[INFO] Exclude: src/main/resources/**/sitegraph-usage.txt
[INFO] Exclude: src/main/resources/**/docs-urls.txt
[INFO] Exclude: src/etc/header.txt
[INFO] Exclude: src/main/resources/static/css/**/*.css
[INFO] Exclude: src/main/resources/static/js/**/*.js
[INFO] Exclude: src/main/resources/docs.cfg
[INFO] Exclude: src/main/webapp/fonts/**/*
[INFO] 3 resources included (use -debug for more details)
[INFO] Rat check: Summary of files. Unapproved: 0 unknown: 0 generated: 0 approved: 3 licence.
[INFO]
[INFO] --- maven-install-plugin:2.5.2:install (default-install) @ struts2-parent ---
[INFO] Installing <https://builds.apache.org/job/Struts-master-JDK7/ws/pom.xml> to /home/jenkins/.m2/repository/org/apache/struts/struts2-parent/2.6-SNAPSHOT/struts2-parent-2.6-SNAPSHOT.pom
[INFO] Installing <https://builds.apache.org/job/Struts-master-JDK7/ws/target/struts2-parent-2.6-SNAPSHOT-site.xml> to /home/jenkins/.m2/repository/org/apache/struts/struts2-parent/2.6-SNAPSHOT/struts2-parent-2.6-SNAPSHOT-site.xml
[INFO]
[INFO] --- maven-remote-resources-plugin:1.5:process (process-resource-bundles) @ struts2-parent ---
[INFO]
[INFO] --- maven-bundle-plugin:2.1.0:manifest (bundle-manifest) @ struts2-parent ---
[WARNING] Ignoring project type pom - supportedProjectTypes = [jar, bundle]
[INFO]
[INFO] >>> maven-source-plugin:3.0.0:jar (attach-sources) > generate-sources @ struts2-parent >>>
[INFO]
[INFO] <<< maven-source-plugin:3.0.0:jar (attach-sources) < generate-sources @ struts2-parent <<<
[INFO]
[INFO]
[INFO] --- maven-source-plugin:3.0.0:jar (attach-sources) @ struts2-parent ---
[INFO]
[INFO] --- maven-site-plugin:3.5.1:attach-descriptor (attach-descriptor) @ struts2-parent ---
[INFO]
[INFO] --- apache-rat-plugin:0.11:check (default) @ struts2-parent ---
[INFO] 57 implicit excludes (use -debug for more details).
[INFO] Exclude: src/main/resources/org/apache/struts2/static/domTT.js
[INFO] Exclude: src/site/resources/tags/**/*.html
[INFO] Exclude: src/main/resources/*LICENSE.txt
[INFO] Exclude: src/test/resources/**/*.txt
[INFO] Exclude: src/main/webapp/**/*.css
[INFO] Exclude: src/main/webapp/**/*.map
[INFO] Exclude: src/main/webapp/**/*.js
[INFO] Exclude: src/main/webapp/**/*.svg
[INFO] Exclude: src/main/webapp/**/*.txt
[INFO] Exclude: src/main/resources/**/sitegraph-usage.txt
[INFO] Exclude: src/main/resources/**/docs-urls.txt
[INFO] Exclude: src/etc/header.txt
[INFO] Exclude: src/main/resources/static/css/**/*.css
[INFO] Exclude: src/main/resources/static/js/**/*.js
[INFO] Exclude: src/main/resources/docs.cfg
[INFO] Exclude: src/main/webapp/fonts/**/*
[INFO] 3 resources included (use -debug for more details)
[INFO] Rat check: Summary of files. Unapproved: 0 unknown: 0 generated: 0 approved: 3 licence.
[INFO]
[INFO] --- maven-install-plugin:2.5.2:install (default-install) @ struts2-parent ---
[INFO] Installing <https://builds.apache.org/job/Struts-master-JDK7/ws/pom.xml> to /home/jenkins/.m2/repository/org/apache/struts/struts2-parent/2.6-SNAPSHOT/struts2-parent-2.6-SNAPSHOT.pom
[INFO] Installing <https://builds.apache.org/job/Struts-master-JDK7/ws/target/struts2-parent-2.6-SNAPSHOT-site.xml> to /home/jenkins/.m2/repository/org/apache/struts/struts2-parent/2.6-SNAPSHOT/struts2-parent-2.6-SNAPSHOT-site.xml
[INFO] Installing <https://builds.apache.org/job/Struts-master-JDK7/ws/target/struts2-parent-2.6-SNAPSHOT-site.xml> to /home/jenkins/.m2/repository/org/apache/struts/struts2-parent/2.6-SNAPSHOT/struts2-parent-2.6-SNAPSHOT-site.xml
[INFO]
[INFO] --- maven-deploy-plugin:2.8.2:deploy (default-deploy) @ struts2-parent ---
Downloading from apache.snapshots.https: https://repository.apache.org/content/repositories/snapshots/org/apache/struts/struts2-parent/2.6-SNAPSHOT/maven-metadata.xml
Progress (1): 813 B                   Downloaded from apache.snapshots.https: https://repository.apache.org/content/repositories/snapshots/org/apache/struts/struts2-parent/2.6-SNAPSHOT/maven-metadata.xml (813 B at 1.4 kB/s)
Uploading to apache.snapshots.https: https://repository.apache.org/content/repositories/snapshots/org/apache/struts/struts2-parent/2.6-SNAPSHOT/struts2-parent-2.6-20171213.130023-8.pom
Progress (1): 2.0/43 kBProgress (1): 4.1/43 kBProgress (1): 6.1/43 kBProgress (1): 8.2/43 kBProgress (1): 10/43 kB Progress (1): 12/43 kBProgress (1): 14/43 kBProgress (1): 16/43 kBProgress (1): 18/43 kBProgress (1): 20/43 kBProgress (1): 23/43 kBProgress (1): 25/43 kBProgress (1): 27/43 kBProgress (1): 29/43 kBProgress (1): 31/43 kBProgress (1): 33/43 kBProgress (1): 35/43 kBProgress (1): 37/43 kBProgress (1): 39/43 kBProgress (1): 41/43 kBProgress (1): 43 kB                      Uploaded to apache.snapshots.https: https://repository.apache.org/content/repositories/snapshots/org/apache/struts/struts2-parent/2.6-SNAPSHOT/struts2-parent-2.6-20171213.130023-8.pom (43 kB at 32 kB/s)
Downloading from apache.snapshots.https: https://repository.apache.org/content/repositories/snapshots/org/apache/struts/struts2-parent/maven-metadata.xml
Progress (1): 1.3 kB                    Downloaded from apache.snapshots.https: https://repository.apache.org/content/repositories/snapshots/org/apache/struts/struts2-parent/maven-metadata.xml (1.3 kB at 2.3 kB/s)
Uploading to apache.snapshots.https: https://repository.apache.org/content/repositories/snapshots/org/apache/struts/struts2-parent/2.6-SNAPSHOT/maven-metadata.xml
Progress (1): 813 B                   Uploaded to apache.snapshots.https: https://repository.apache.org/content/repositories/snapshots/org/apache/struts/struts2-parent/2.6-SNAPSHOT/maven-metadata.xml (813 B at 716 B/s)
Uploading to apache.snapshots.https: https://repository.apache.org/content/repositories/snapshots/org/apache/struts/struts2-parent/maven-metadata.xml
Progress (1): 1.3 kB                    Uploaded to apache.snapshots.https: https://repository.apache.org/content/repositories/snapshots/org/apache/struts/struts2-parent/maven-metadata.xml (1.3 kB at 1.1 kB/s)
Uploading to apache.snapshots.https: https://repository.apache.org/content/repositories/snapshots/org/apache/struts/struts2-parent/2.6-SNAPSHOT/struts2-parent-2.6-20171213.130023-8-site.xml
Progress (1): 2.0/2.4 kBProgress (1): 2.4 kB                        Uploaded to apache.snapshots.https: https://repository.apache.org/content/repositories/snapshots/org/apache/struts/struts2-parent/2.6-SNAPSHOT/struts2-parent-2.6-20171213.130023-8-site.xml (2.4 kB at 2.1 kB/s)
Uploading to apache.snapshots.https: https://repository.apache.org/content/repositories/snapshots/org/apache/struts/struts2-parent/2.6-SNAPSHOT/maven-metadata.xml
Progress (1): 813 B                   Uploaded to apache.snapshots.https: https://repository.apache.org/content/repositories/snapshots/org/apache/struts/struts2-parent/2.6-SNAPSHOT/maven-metadata.xml (813 B at 708 B/s)
Uploading to apache.snapshots.https: https://repository.apache.org/content/repositories/snapshots/org/apache/struts/struts2-parent/2.6-SNAPSHOT/struts2-parent-2.6-20171213.130023-8-site.xml
Progress (1): 2.0/2.4 kBProgress (1): 2.4 kB                        Uploaded to apache.snapshots.https: https://repository.apache.org/content/repositories/snapshots/org/apache/struts/struts2-parent/2.6-SNAPSHOT/struts2-parent-2.6-20171213.130023-8-site.xml (2.4 kB at 2.1 kB/s)
Uploading to apache.snapshots.https: https://repository.apache.org/content/repositories/snapshots/org/apache/struts/struts2-parent/2.6-SNAPSHOT/maven-metadata.xml
Progress (1): 813 B                   Uploaded to apache.snapshots.https: https://repository.apache.org/content/repositories/snapshots/org/apache/struts/struts2-parent/2.6-SNAPSHOT/maven-metadata.xml (813 B at 706 B/s)
[INFO]
[INFO] ------------------------------------------------------------------------
[INFO] Building Struts 2 Core 2.6-SNAPSHOT
[INFO] ------------------------------------------------------------------------
Downloading from central: https://repo.maven.apache.org/maven2/org/testng/testng/5.14.10/testng-5.14.10.pom
[WARNING] Failed to create parent directories for tracking file /home/jenkins/.m2/repository/org/testng/testng/5.14.10/testng-5.14.10.pom.lastUpdated
[INFO] ------------------------------------------------------------------------
[INFO] Reactor Summary:
[INFO]
[INFO] Struts 2 Bill of Materials ......................... SUCCESS [  8.872 s]
[INFO] Struts 2 ........................................... SUCCESS [ 12.470 s]
[INFO] Struts 2 Core ...................................... FAILURE [  0.199 s]
[INFO] Struts Plugins ..................................... SKIPPED
[INFO] Struts 2 Configuration Browser Plugin .............. SKIPPED
[INFO] Struts 2 Sitemesh Plugin ........................... SKIPPED
[INFO] Struts 2 Tiles Plugin .............................. SKIPPED
[INFO] Struts 2 DWR Plugin ................................ SKIPPED
[INFO] Struts 2 Spring Plugin ............................. SKIPPED
[INFO] Struts 2 Convention Plugin ......................... SKIPPED
[INFO] Struts 2 JUnit Plugin .............................. SKIPPED
[INFO] Struts 2 JSON Plugin ............................... SKIPPED
[INFO] Struts 2 Bean Validation Plugin .................... SKIPPED
[INFO] Struts 2 Webapps ................................... SKIPPED
[INFO] Struts 2 Showcase Webapp ........................... SKIPPED
[INFO] Struts 2 REST Plugin ............................... SKIPPED
[INFO] Struts 2 Rest Showcase Webapp ...................... SKIPPED
[INFO] Struts 2 CDI Plugin ................................ SKIPPED
[INFO] Struts 2 Embedded JSP Plugin ....................... SKIPPED
[INFO] Struts 2 GXP Plugin ................................ SKIPPED
[INFO] Struts 2 Jasper Reports Plugin ..................... SKIPPED
[INFO] Struts 2 Java Templates Plugin ..................... SKIPPED
[INFO] Struts 2 JFreeChart Plugin ......................... SKIPPED
[INFO] Struts 2 OSGi Plugin ............................... SKIPPED
[INFO] Struts 2 OVal Plugin ............................... SKIPPED
[INFO] Struts 2 Pell Multipart Plugin ..................... SKIPPED
[INFO] Struts 2 Plexus Plugin ............................. SKIPPED
[INFO] Struts 2 Portlet Plugin ............................ SKIPPED
[INFO] Struts 2 Portlet Tiles Plugin ...................... SKIPPED
[INFO] DEPRECATED: Struts 2 Sitegraph Plugin .............. SKIPPED
[INFO] Struts 2 TestNG Plugin ............................. SKIPPED
[INFO] Struts OSGi Bundles ................................ SKIPPED
[INFO] Struts 2 OSGi Admin Bundle ......................... SKIPPED
[INFO] Struts 2 OSGi Demo Bundle .......................... SKIPPED
[INFO] Struts 2 Assembly .................................. SKIPPED
[INFO] ------------------------------------------------------------------------
[INFO] BUILD FAILURE
[INFO] ------------------------------------------------------------------------
[INFO] Total time: 24.100 s
[INFO] Finished at: 2017-12-13T13:00:33Z
[INFO] Final Memory: 63M/1448M
[INFO] ------------------------------------------------------------------------
[ERROR] Failed to execute goal on project struts2-core: Could not resolve dependencies for project org.apache.struts:struts2-core:jar:2.6-SNAPSHOT: Failed to collect dependencies at org.testng:testng:jar:5.14.10: Failed to read artifact descriptor for org.testng:testng:jar:5.14.10: Could not transfer artifact org.testng:testng:pom:5.14.10 from/to central (https://repo.maven.apache.org/maven2): /home/jenkins/.m2/repository/org/testng/testng/5.14.10/testng-5.14.10.pom.part.lock (No such file or directory) -> [Help 1]
[ERROR]
[ERROR] To see the full stack trace of the errors, re-run Maven with the -e switch.
[ERROR] Re-run Maven using the -X switch to enable full debug logging.
[ERROR]
[ERROR] For more information about the errors and possible solutions, please read the following articles:
[ERROR] [Help 1] http://cwiki.apache.org/confluence/display/MAVEN/DependencyResolutionException
[ERROR]
[ERROR] After correcting the problems, you can resume the build with the command
[ERROR]   mvn <goals> -rf :struts2-core
Build step 'Execute shell' marked build as failure
[locks-and-latches] Releasing all the locks
[locks-and-latches] All the locks released
Setting MAVEN_3_LATEST__HOME=/home/jenkins/tools/maven/latest3/

---------------------------------------------------------------------
To unsubscribe, e-mail: [hidden email]
For additional commands, e-mail: [hidden email]

Reply | Threaded
Open this post in threaded view
|

Build failed in Jenkins: Struts-master-JDK7 #70

Apache Jenkins Server-2
See <https://builds.apache.org/job/Struts-master-JDK7/70/display/redirect?page=changes>

Changes:

[yasserzamani] WW-4900 Makes BackgroundProcess transient

[yasserzamani] WW-4900 Reverts BackgroundProcess access modifiers

[yasserzamani] WW-4900 Fixes BackgroundProcessTest via synchronization

------------------------------------------
[...truncated 2.18 KB...]
[INFO] Struts 2 Convention Plugin
[INFO] Struts 2 JUnit Plugin
[INFO] Struts 2 JSON Plugin
[INFO] Struts 2 Bean Validation Plugin
[INFO] Struts 2 Webapps
[INFO] Struts 2 Showcase Webapp
[INFO] Struts 2 REST Plugin
[INFO] Struts 2 Rest Showcase Webapp
[INFO] Struts 2 CDI Plugin
[INFO] Struts 2 Embedded JSP Plugin
[INFO] Struts 2 GXP Plugin
[INFO] Struts 2 Jasper Reports Plugin
[INFO] Struts 2 Java Templates Plugin
[INFO] Struts 2 JFreeChart Plugin
[INFO] Struts 2 OSGi Plugin
[INFO] Struts 2 OVal Plugin
[INFO] Struts 2 Pell Multipart Plugin
[INFO] Struts 2 Plexus Plugin
[INFO] Struts 2 Portlet Plugin
[INFO] Struts 2 Portlet Tiles Plugin
[INFO] DEPRECATED: Struts 2 Sitegraph Plugin
[INFO] Struts 2 TestNG Plugin
[INFO] Struts OSGi Bundles
[INFO] Struts 2 OSGi Admin Bundle
[INFO] Struts 2 OSGi Demo Bundle
[INFO] Struts 2 Assembly
[INFO]
[INFO] ------------------------------------------------------------------------
[INFO] Building Struts 2 Bill of Materials 2.6-SNAPSHOT
[INFO] ------------------------------------------------------------------------
[INFO]
[INFO] --- maven-clean-plugin:2.4.1:clean (default-clean) @ struts2-bom ---
[INFO]
[INFO] >>> maven-source-plugin:2.1.2:jar (default-cli) > generate-sources @ struts2-bom >>>
[INFO]
[INFO] <<< maven-source-plugin:2.1.2:jar (default-cli) < generate-sources @ struts2-bom <<<
[INFO]
[INFO]
[INFO] --- maven-source-plugin:2.1.2:jar (default-cli) @ struts2-bom ---
[INFO]
[INFO] --- maven-javadoc-plugin:2.8:jar (default-cli) @ struts2-bom ---
[INFO] Not executing Javadoc as the project is not a Java classpath-capable package
[INFO]
[INFO] --- maven-remote-resources-plugin:1.2.1:process (default) @ struts2-bom ---
[INFO]
[INFO] --- maven-site-plugin:3.0:attach-descriptor (attach-descriptor) @ struts2-bom ---
[INFO]
[INFO] --- maven-install-plugin:2.3.1:install (default-install) @ struts2-bom ---
[INFO] Installing <https://builds.apache.org/job/Struts-master-JDK7/ws/bom/pom.xml> to /home/jenkins/.m2/repository/org/apache/struts/struts2-bom/2.6-SNAPSHOT/struts2-bom-2.6-SNAPSHOT.pom
[INFO]
[INFO] --- maven-remote-resources-plugin:1.2.1:process (default) @ struts2-bom ---
[INFO]
[INFO] --- maven-site-plugin:3.0:attach-descriptor (attach-descriptor) @ struts2-bom ---
[INFO]
[INFO] --- maven-install-plugin:2.3.1:install (default-install) @ struts2-bom ---
[INFO] Installing <https://builds.apache.org/job/Struts-master-JDK7/ws/bom/pom.xml> to /home/jenkins/.m2/repository/org/apache/struts/struts2-bom/2.6-SNAPSHOT/struts2-bom-2.6-SNAPSHOT.pom
[INFO]
[INFO] --- maven-deploy-plugin:2.6:deploy (default-deploy) @ struts2-bom ---
Downloading from apache.snapshots.https: https://repository.apache.org/content/repositories/snapshots/org/apache/struts/struts2-bom/2.6-SNAPSHOT/maven-metadata.xml
Progress (1): 601 B                   Downloaded from apache.snapshots.https: https://repository.apache.org/content/repositories/snapshots/org/apache/struts/struts2-bom/2.6-SNAPSHOT/maven-metadata.xml (601 B at 469 B/s)
Uploading to apache.snapshots.https: https://repository.apache.org/content/repositories/snapshots/org/apache/struts/struts2-bom/2.6-SNAPSHOT/struts2-bom-2.6-20171213.133052-10.pom
Progress (1): 2.0/7.8 kBProgress (1): 4.1/7.8 kBProgress (1): 6.1/7.8 kBProgress (1): 7.8 kB                        Uploaded to apache.snapshots.https: https://repository.apache.org/content/repositories/snapshots/org/apache/struts/struts2-bom/2.6-SNAPSHOT/struts2-bom-2.6-20171213.133052-10.pom (7.8 kB at 6.5 kB/s)
Downloading from apache.snapshots.https: https://repository.apache.org/content/repositories/snapshots/org/apache/struts/struts2-bom/maven-metadata.xml
Progress (1): 831 B                   Downloaded from apache.snapshots.https: https://repository.apache.org/content/repositories/snapshots/org/apache/struts/struts2-bom/maven-metadata.xml (831 B at 1.5 kB/s)
Uploading to apache.snapshots.https: https://repository.apache.org/content/repositories/snapshots/org/apache/struts/struts2-bom/2.6-SNAPSHOT/maven-metadata.xml
Progress (1): 603 B                   Uploaded to apache.snapshots.https: https://repository.apache.org/content/repositories/snapshots/org/apache/struts/struts2-bom/2.6-SNAPSHOT/maven-metadata.xml (603 B at 521 B/s)
Uploading to apache.snapshots.https: https://repository.apache.org/content/repositories/snapshots/org/apache/struts/struts2-bom/maven-metadata.xml
Progress (1): 831 B                   Uploaded to apache.snapshots.https: https://repository.apache.org/content/repositories/snapshots/org/apache/struts/struts2-bom/maven-metadata.xml (831 B at 719 B/s)
[INFO]
[INFO] ------------------------------------------------------------------------
[INFO] Building Struts 2 2.6-SNAPSHOT
[INFO] ------------------------------------------------------------------------
[INFO]
[INFO] --- maven-clean-plugin:3.0.0:clean (default-clean) @ struts2-parent ---
[INFO]
[INFO] >>> maven-source-plugin:3.0.0:jar (default-cli) > generate-sources @ struts2-parent >>>
[INFO]
[INFO] <<< maven-source-plugin:3.0.0:jar (default-cli) < generate-sources @ struts2-parent <<<
[INFO]
[INFO]
[INFO] --- maven-source-plugin:3.0.0:jar (default-cli) @ struts2-parent ---
[INFO]
[INFO] --- maven-javadoc-plugin:2.10.3:jar (default-cli) @ struts2-parent ---
[INFO] Not executing Javadoc as the project is not a Java classpath-capable package
[INFO]
[INFO] --- maven-remote-resources-plugin:1.5:process (process-resource-bundles) @ struts2-parent ---
[INFO]
[INFO] --- maven-bundle-plugin:2.1.0:manifest (bundle-manifest) @ struts2-parent ---
[WARNING] Ignoring project type pom - supportedProjectTypes = [jar, bundle]
[INFO]
[INFO] >>> maven-source-plugin:3.0.0:jar (attach-sources) > generate-sources @ struts2-parent >>>
[INFO]
[INFO] <<< maven-source-plugin:3.0.0:jar (attach-sources) < generate-sources @ struts2-parent <<<
[INFO]
[INFO]
[INFO] --- maven-source-plugin:3.0.0:jar (attach-sources) @ struts2-parent ---
[INFO]
[INFO] --- maven-site-plugin:3.5.1:attach-descriptor (attach-descriptor) @ struts2-parent ---
[INFO]
[INFO] --- apache-rat-plugin:0.11:check (default) @ struts2-parent ---
[INFO] 57 implicit excludes (use -debug for more details).
[INFO] Exclude: src/main/resources/org/apache/struts2/static/domTT.js
[INFO] Exclude: src/site/resources/tags/**/*.html
[INFO] Exclude: src/main/resources/*LICENSE.txt
[INFO] Exclude: src/test/resources/**/*.txt
[INFO] Exclude: src/main/webapp/**/*.css
[INFO] Exclude: src/main/webapp/**/*.map
[INFO] Exclude: src/main/webapp/**/*.js
[INFO] Exclude: src/main/webapp/**/*.svg
[INFO] Exclude: src/main/webapp/**/*.txt
[INFO] Exclude: src/main/resources/**/sitegraph-usage.txt
[INFO] Exclude: src/main/resources/**/docs-urls.txt
[INFO] Exclude: src/etc/header.txt
[INFO] Exclude: src/main/resources/static/css/**/*.css
[INFO] Exclude: src/main/resources/static/js/**/*.js
[INFO] Exclude: src/main/resources/docs.cfg
[INFO] Exclude: src/main/webapp/fonts/**/*
[INFO] 3 resources included (use -debug for more details)
[INFO] Rat check: Summary of files. Unapproved: 0 unknown: 0 generated: 0 approved: 3 licence.
[INFO]
[INFO] --- maven-install-plugin:2.5.2:install (default-install) @ struts2-parent ---
[INFO] Installing <https://builds.apache.org/job/Struts-master-JDK7/ws/pom.xml> to /home/jenkins/.m2/repository/org/apache/struts/struts2-parent/2.6-SNAPSHOT/struts2-parent-2.6-SNAPSHOT.pom
[INFO] Installing <https://builds.apache.org/job/Struts-master-JDK7/ws/target/struts2-parent-2.6-SNAPSHOT-site.xml> to /home/jenkins/.m2/repository/org/apache/struts/struts2-parent/2.6-SNAPSHOT/struts2-parent-2.6-SNAPSHOT-site.xml
[INFO]
[INFO] --- maven-remote-resources-plugin:1.5:process (process-resource-bundles) @ struts2-parent ---
[INFO]
[INFO] --- maven-bundle-plugin:2.1.0:manifest (bundle-manifest) @ struts2-parent ---
[WARNING] Ignoring project type pom - supportedProjectTypes = [jar, bundle]
[INFO]
[INFO] >>> maven-source-plugin:3.0.0:jar (attach-sources) > generate-sources @ struts2-parent >>>
[INFO]
[INFO] <<< maven-source-plugin:3.0.0:jar (attach-sources) < generate-sources @ struts2-parent <<<
[INFO]
[INFO]
[INFO] --- maven-source-plugin:3.0.0:jar (attach-sources) @ struts2-parent ---
[INFO]
[INFO] --- maven-site-plugin:3.5.1:attach-descriptor (attach-descriptor) @ struts2-parent ---
[INFO]
[INFO] --- apache-rat-plugin:0.11:check (default) @ struts2-parent ---
[INFO] 57 implicit excludes (use -debug for more details).
[INFO] Exclude: src/main/resources/org/apache/struts2/static/domTT.js
[INFO] Exclude: src/site/resources/tags/**/*.html
[INFO] Exclude: src/main/resources/*LICENSE.txt
[INFO] Exclude: src/test/resources/**/*.txt
[INFO] Exclude: src/main/webapp/**/*.css
[INFO] Exclude: src/main/webapp/**/*.map
[INFO] Exclude: src/main/webapp/**/*.js
[INFO] Exclude: src/main/webapp/**/*.svg
[INFO] Exclude: src/main/webapp/**/*.txt
[INFO] Exclude: src/main/resources/**/sitegraph-usage.txt
[INFO] Exclude: src/main/resources/**/docs-urls.txt
[INFO] Exclude: src/etc/header.txt
[INFO] Exclude: src/main/resources/static/css/**/*.css
[INFO] Exclude: src/main/resources/static/js/**/*.js
[INFO] Exclude: src/main/resources/docs.cfg
[INFO] Exclude: src/main/webapp/fonts/**/*
[INFO] 3 resources included (use -debug for more details)
[INFO] Rat check: Summary of files. Unapproved: 0 unknown: 0 generated: 0 approved: 3 licence.
[INFO]
[INFO] --- maven-install-plugin:2.5.2:install (default-install) @ struts2-parent ---
[INFO] Installing <https://builds.apache.org/job/Struts-master-JDK7/ws/pom.xml> to /home/jenkins/.m2/repository/org/apache/struts/struts2-parent/2.6-SNAPSHOT/struts2-parent-2.6-SNAPSHOT.pom
[INFO] Installing <https://builds.apache.org/job/Struts-master-JDK7/ws/target/struts2-parent-2.6-SNAPSHOT-site.xml> to /home/jenkins/.m2/repository/org/apache/struts/struts2-parent/2.6-SNAPSHOT/struts2-parent-2.6-SNAPSHOT-site.xml
[INFO] Installing <https://builds.apache.org/job/Struts-master-JDK7/ws/target/struts2-parent-2.6-SNAPSHOT-site.xml> to /home/jenkins/.m2/repository/org/apache/struts/struts2-parent/2.6-SNAPSHOT/struts2-parent-2.6-SNAPSHOT-site.xml
[INFO]
[INFO] --- maven-deploy-plugin:2.8.2:deploy (default-deploy) @ struts2-parent ---
Downloading from apache.snapshots.https: https://repository.apache.org/content/repositories/snapshots/org/apache/struts/struts2-parent/2.6-SNAPSHOT/maven-metadata.xml
Progress (1): 813 B                   Downloaded from apache.snapshots.https: https://repository.apache.org/content/repositories/snapshots/org/apache/struts/struts2-parent/2.6-SNAPSHOT/maven-metadata.xml (813 B at 1.4 kB/s)
Uploading to apache.snapshots.https: https://repository.apache.org/content/repositories/snapshots/org/apache/struts/struts2-parent/2.6-SNAPSHOT/struts2-parent-2.6-20171213.133100-9.pom
Progress (1): 2.0/43 kBProgress (1): 4.1/43 kBProgress (1): 6.1/43 kBProgress (1): 8.2/43 kBProgress (1): 10/43 kB Progress (1): 12/43 kBProgress (1): 14/43 kBProgress (1): 16/43 kBProgress (1): 18/43 kBProgress (1): 20/43 kBProgress (1): 23/43 kBProgress (1): 25/43 kBProgress (1): 27/43 kBProgress (1): 29/43 kBProgress (1): 31/43 kBProgress (1): 33/43 kBProgress (1): 35/43 kBProgress (1): 37/43 kBProgress (1): 39/43 kBProgress (1): 41/43 kBProgress (1): 43 kB                      Uploaded to apache.snapshots.https: https://repository.apache.org/content/repositories/snapshots/org/apache/struts/struts2-parent/2.6-SNAPSHOT/struts2-parent-2.6-20171213.133100-9.pom (43 kB at 32 kB/s)
Downloading from apache.snapshots.https: https://repository.apache.org/content/repositories/snapshots/org/apache/struts/struts2-parent/maven-metadata.xml
Progress (1): 1.3 kB                    Downloaded from apache.snapshots.https: https://repository.apache.org/content/repositories/snapshots/org/apache/struts/struts2-parent/maven-metadata.xml (1.3 kB at 2.3 kB/s)
Uploading to apache.snapshots.https: https://repository.apache.org/content/repositories/snapshots/org/apache/struts/struts2-parent/2.6-SNAPSHOT/maven-metadata.xml
Progress (1): 813 B                   Uploaded to apache.snapshots.https: https://repository.apache.org/content/repositories/snapshots/org/apache/struts/struts2-parent/2.6-SNAPSHOT/maven-metadata.xml (813 B at 729 B/s)
Uploading to apache.snapshots.https: https://repository.apache.org/content/repositories/snapshots/org/apache/struts/struts2-parent/maven-metadata.xml
Progress (1): 1.3 kB                    Uploaded to apache.snapshots.https: https://repository.apache.org/content/repositories/snapshots/org/apache/struts/struts2-parent/maven-metadata.xml (1.3 kB at 1.2 kB/s)
Uploading to apache.snapshots.https: https://repository.apache.org/content/repositories/snapshots/org/apache/struts/struts2-parent/2.6-SNAPSHOT/struts2-parent-2.6-20171213.133100-9-site.xml
Progress (1): 2.0/2.4 kBProgress (1): 2.4 kB                        Uploaded to apache.snapshots.https: https://repository.apache.org/content/repositories/snapshots/org/apache/struts/struts2-parent/2.6-SNAPSHOT/struts2-parent-2.6-20171213.133100-9-site.xml (2.4 kB at 2.1 kB/s)
Uploading to apache.snapshots.https: https://repository.apache.org/content/repositories/snapshots/org/apache/struts/struts2-parent/2.6-SNAPSHOT/maven-metadata.xml
Progress (1): 813 B                   Uploaded to apache.snapshots.https: https://repository.apache.org/content/repositories/snapshots/org/apache/struts/struts2-parent/2.6-SNAPSHOT/maven-metadata.xml (813 B at 732 B/s)
Uploading to apache.snapshots.https: https://repository.apache.org/content/repositories/snapshots/org/apache/struts/struts2-parent/2.6-SNAPSHOT/struts2-parent-2.6-20171213.133100-9-site.xml
Progress (1): 2.0/2.4 kBProgress (1): 2.4 kB                        Uploaded to apache.snapshots.https: https://repository.apache.org/content/repositories/snapshots/org/apache/struts/struts2-parent/2.6-SNAPSHOT/struts2-parent-2.6-20171213.133100-9-site.xml (2.4 kB at 2.1 kB/s)
Uploading to apache.snapshots.https: https://repository.apache.org/content/repositories/snapshots/org/apache/struts/struts2-parent/2.6-SNAPSHOT/maven-metadata.xml
Progress (1): 813 B                   Uploaded to apache.snapshots.https: https://repository.apache.org/content/repositories/snapshots/org/apache/struts/struts2-parent/2.6-SNAPSHOT/maven-metadata.xml (813 B at 720 B/s)
[INFO]
[INFO] ------------------------------------------------------------------------
[INFO] Building Struts 2 Core 2.6-SNAPSHOT
[INFO] ------------------------------------------------------------------------
Downloading from central: https://repo.maven.apache.org/maven2/org/testng/testng/5.14.10/testng-5.14.10.pom
[WARNING] Failed to create parent directories for tracking file /home/jenkins/.m2/repository/org/testng/testng/5.14.10/testng-5.14.10.pom.lastUpdated
[INFO] ------------------------------------------------------------------------
[INFO] Reactor Summary:
[INFO]
[INFO] Struts 2 Bill of Materials ......................... SUCCESS [  7.941 s]
[INFO] Struts 2 ........................................... SUCCESS [ 12.267 s]
[INFO] Struts 2 Core ...................................... FAILURE [  0.207 s]
[INFO] Struts Plugins ..................................... SKIPPED
[INFO] Struts 2 Configuration Browser Plugin .............. SKIPPED
[INFO] Struts 2 Sitemesh Plugin ........................... SKIPPED
[INFO] Struts 2 Tiles Plugin .............................. SKIPPED
[INFO] Struts 2 DWR Plugin ................................ SKIPPED
[INFO] Struts 2 Spring Plugin ............................. SKIPPED
[INFO] Struts 2 Convention Plugin ......................... SKIPPED
[INFO] Struts 2 JUnit Plugin .............................. SKIPPED
[INFO] Struts 2 JSON Plugin ............................... SKIPPED
[INFO] Struts 2 Bean Validation Plugin .................... SKIPPED
[INFO] Struts 2 Webapps ................................... SKIPPED
[INFO] Struts 2 Showcase Webapp ........................... SKIPPED
[INFO] Struts 2 REST Plugin ............................... SKIPPED
[INFO] Struts 2 Rest Showcase Webapp ...................... SKIPPED
[INFO] Struts 2 CDI Plugin ................................ SKIPPED
[INFO] Struts 2 Embedded JSP Plugin ....................... SKIPPED
[INFO] Struts 2 GXP Plugin ................................ SKIPPED
[INFO] Struts 2 Jasper Reports Plugin ..................... SKIPPED
[INFO] Struts 2 Java Templates Plugin ..................... SKIPPED
[INFO] Struts 2 JFreeChart Plugin ......................... SKIPPED
[INFO] Struts 2 OSGi Plugin ............................... SKIPPED
[INFO] Struts 2 OVal Plugin ............................... SKIPPED
[INFO] Struts 2 Pell Multipart Plugin ..................... SKIPPED
[INFO] Struts 2 Plexus Plugin ............................. SKIPPED
[INFO] Struts 2 Portlet Plugin ............................ SKIPPED
[INFO] Struts 2 Portlet Tiles Plugin ...................... SKIPPED
[INFO] DEPRECATED: Struts 2 Sitegraph Plugin .............. SKIPPED
[INFO] Struts 2 TestNG Plugin ............................. SKIPPED
[INFO] Struts OSGi Bundles ................................ SKIPPED
[INFO] Struts 2 OSGi Admin Bundle ......................... SKIPPED
[INFO] Struts 2 OSGi Demo Bundle .......................... SKIPPED
[INFO] Struts 2 Assembly .................................. SKIPPED
[INFO] ------------------------------------------------------------------------
[INFO] BUILD FAILURE
[INFO] ------------------------------------------------------------------------
[INFO] Total time: 22.931 s
[INFO] Finished at: 2017-12-13T13:31:09Z
[INFO] Final Memory: 62M/1448M
[INFO] ------------------------------------------------------------------------
[ERROR] Failed to execute goal on project struts2-core: Could not resolve dependencies for project org.apache.struts:struts2-core:jar:2.6-SNAPSHOT: Failed to collect dependencies at org.testng:testng:jar:5.14.10: Failed to read artifact descriptor for org.testng:testng:jar:5.14.10: Could not transfer artifact org.testng:testng:pom:5.14.10 from/to central (https://repo.maven.apache.org/maven2): /home/jenkins/.m2/repository/org/testng/testng/5.14.10/testng-5.14.10.pom.part.lock (No such file or directory) -> [Help 1]
[ERROR]
[ERROR] To see the full stack trace of the errors, re-run Maven with the -e switch.
[ERROR] Re-run Maven using the -X switch to enable full debug logging.
[ERROR]
[ERROR] For more information about the errors and possible solutions, please read the following articles:
[ERROR] [Help 1] http://cwiki.apache.org/confluence/display/MAVEN/DependencyResolutionException
[ERROR]
[ERROR] After correcting the problems, you can resume the build with the command
[ERROR]   mvn <goals> -rf :struts2-core
Build step 'Execute shell' marked build as failure
[locks-and-latches] Releasing all the locks
[locks-and-latches] All the locks released
[JIRA] Updating issue WW-4900
Setting MAVEN_3_LATEST__HOME=/home/jenkins/tools/maven/latest3/

---------------------------------------------------------------------
To unsubscribe, e-mail: [hidden email]
For additional commands, e-mail: [hidden email]

Reply | Threaded
Open this post in threaded view
|

Re: Build failed in Jenkins: Struts-master-JDK7 #70

Yasser Zamani-2


On 12/13/2017 5:01 PM, Apache Jenkins Server wrote:
> [WARNING] Failed to create parent directories for tracking file/home/jenkins/.m2/repository/org/testng/testng/5.14.10/testng-5.14.10.pom.lastUpdated

I found [1] :

> Ah-ha! Looks like at least one of the Jenkins hosts for some reason had some directories under /home/jenkins/.m2/repository owned by root, not jenkins. I've fixed that across all the slaves.

[1]
https://issues.apache.org/jira/browse/INFRA-10286?focusedCommentId=14380351&page=com.atlassian.jira.plugin.system.issuetabpanels:comment-tabpanel#comment-14380351

---------------------------------------------------------------------
To unsubscribe, e-mail: [hidden email]
For additional commands, e-mail: [hidden email]

Reply | Threaded
Open this post in threaded view
|

Re: Build failed in Jenkins: Struts-master-JDK7 #70

Lukasz Lenart
2017-12-13 16:19 GMT+01:00 Yasser Zamani <[hidden email]>:

>
>
> On 12/13/2017 5:01 PM, Apache Jenkins Server wrote:
>> [WARNING] Failed to create parent directories for tracking file/home/jenkins/.m2/repository/org/testng/testng/5.14.10/testng-5.14.10.pom.lastUpdated
>
> I found [1] :
>
>> Ah-ha! Looks like at least one of the Jenkins hosts for some reason had some directories under /home/jenkins/.m2/repository owned by root, not jenkins. I've fixed that across all the slaves.
>
> [1]
> https://issues.apache.org/jira/browse/INFRA-10286?focusedCommentId=14380351&page=com.atlassian.jira.plugin.system.issuetabpanels:comment-tabpanel#comment-14380351

Great, thanks :)


Regards
--
Ɓukasz
+ 48 606 323 122 http://www.lenart.org.pl/

---------------------------------------------------------------------
To unsubscribe, e-mail: [hidden email]
For additional commands, e-mail: [hidden email]

Reply | Threaded
Open this post in threaded view
|

Jenkins build is back to normal : Struts-master-JDK7 #71

Apache Jenkins Server-2
In reply to this post by Apache Jenkins Server-2
See <https://builds.apache.org/job/Struts-master-JDK7/71/display/redirect?page=changes>


---------------------------------------------------------------------
To unsubscribe, e-mail: [hidden email]
For additional commands, e-mail: [hidden email]