Build failed in Jenkins: Struts-master-JDK7 #37

classic Classic list List threaded Threaded
5 messages Options
Reply | Threaded
Open this post in threaded view
|

Build failed in Jenkins: Struts-master-JDK7 #37

Apache Jenkins Server-2
See <https://builds.apache.org/job/Struts-master-JDK7/37/display/redirect?page=changes>

Changes:

[Lukasz Lenart] Adds missing header with license or updates the existing one

[Lukasz Lenart] Adds missing header with license or updates the existing one

[Lukasz Lenart] Adds missing header with license

[Lukasz Lenart] Adds missing header with license

[Lukasz Lenart] Adds missing header with license

[Lukasz Lenart] Adds missing header with license

[Lukasz Lenart] Adds missing header with license

[Lukasz Lenart] Adds missing header with license

[Lukasz Lenart] Enables Rat plugin on each build

[Lukasz Lenart] Adds missing header with license

[Lukasz Lenart] Adds missing header with license

[Lukasz Lenart] Adds missing header with license and fixes tests

[Lukasz Lenart] Adds missing header with license and fixes tests

[Lukasz Lenart] Uses property instead of hardcoding path

[Lukasz Lenart] Fixes encoding

[Lukasz Lenart] Fixes encoding

[Lukasz Lenart] Puts back JavaDoc reference

[Lukasz Lenart] Removes unneeded header

[Lukasz Lenart] Fixes encoding

[Lukasz Lenart] Fixes encoding

[Lukasz Lenart] Converts content to a proper CSS

------------------------------------------
[...truncated 3.12 MB...]
Generating <https://builds.apache.org/job/Struts-master-JDK7/ws/apps/showcase/target/apidocs/org/apache/struts2/showcase/xslt/class-use/JVMAction.ImportantInfo.html...>
Generating <https://builds.apache.org/job/Struts-master-JDK7/ws/apps/showcase/target/apidocs/org/apache/struts2/showcase/chat/class-use/ChatService.html...>
Generating <https://builds.apache.org/job/Struts-master-JDK7/ws/apps/showcase/target/apidocs/org/apache/struts2/showcase/chat/class-use/CrudRoomAction.html...>
Generating <https://builds.apache.org/job/Struts-master-JDK7/ws/apps/showcase/target/apidocs/org/apache/struts2/showcase/chat/class-use/DateConverter.html...>
Generating <https://builds.apache.org/job/Struts-master-JDK7/ws/apps/showcase/target/apidocs/org/apache/struts2/showcase/chat/class-use/ChatMessage.html...>
Generating <https://builds.apache.org/job/Struts-master-JDK7/ws/apps/showcase/target/apidocs/org/apache/struts2/showcase/chat/class-use/Constants.html...>
Generating <https://builds.apache.org/job/Struts-master-JDK7/ws/apps/showcase/target/apidocs/org/apache/struts2/showcase/chat/class-use/ChatServiceImpl.html...>
Generating <https://builds.apache.org/job/Struts-master-JDK7/ws/apps/showcase/target/apidocs/org/apache/struts2/showcase/chat/class-use/ChatSessionListener.html...>
Generating <https://builds.apache.org/job/Struts-master-JDK7/ws/apps/showcase/target/apidocs/org/apache/struts2/showcase/chat/class-use/ChatInterceptor.html...>
Generating <https://builds.apache.org/job/Struts-master-JDK7/ws/apps/showcase/target/apidocs/org/apache/struts2/showcase/chat/class-use/User.html...>
Generating <https://builds.apache.org/job/Struts-master-JDK7/ws/apps/showcase/target/apidocs/org/apache/struts2/showcase/chat/class-use/ChatException.html...>
Generating <https://builds.apache.org/job/Struts-master-JDK7/ws/apps/showcase/target/apidocs/org/apache/struts2/showcase/chat/class-use/ChatException.ErrorType.html...>
Generating <https://builds.apache.org/job/Struts-master-JDK7/ws/apps/showcase/target/apidocs/org/apache/struts2/showcase/chat/class-use/ChatAuthenticationInterceptor.html...>
Generating <https://builds.apache.org/job/Struts-master-JDK7/ws/apps/showcase/target/apidocs/org/apache/struts2/showcase/chat/class-use/UsersAvailableAction.html...>
Generating <https://builds.apache.org/job/Struts-master-JDK7/ws/apps/showcase/target/apidocs/org/apache/struts2/showcase/chat/class-use/Room.html...>
Generating <https://builds.apache.org/job/Struts-master-JDK7/ws/apps/showcase/target/apidocs/org/apache/struts2/showcase/chat/class-use/SendMessageToRoomAction.html...>
Generating <https://builds.apache.org/job/Struts-master-JDK7/ws/apps/showcase/target/apidocs/org/apache/struts2/showcase/chat/class-use/ChatLoginAction.html...>
Generating <https://builds.apache.org/job/Struts-master-JDK7/ws/apps/showcase/target/apidocs/org/apache/struts2/showcase/chat/class-use/UsersAvailableInRoomAction.html...>
Generating <https://builds.apache.org/job/Struts-master-JDK7/ws/apps/showcase/target/apidocs/org/apache/struts2/showcase/chat/class-use/ExitRoomAction.html...>
Generating <https://builds.apache.org/job/Struts-master-JDK7/ws/apps/showcase/target/apidocs/org/apache/struts2/showcase/chat/class-use/ChatLogoutAction.html...>
Generating <https://builds.apache.org/job/Struts-master-JDK7/ws/apps/showcase/target/apidocs/org/apache/struts2/showcase/chat/class-use/EnterRoomAction.html...>
Generating <https://builds.apache.org/job/Struts-master-JDK7/ws/apps/showcase/target/apidocs/org/apache/struts2/showcase/chat/class-use/RoomsAvailableAction.html...>
Generating <https://builds.apache.org/job/Struts-master-JDK7/ws/apps/showcase/target/apidocs/org/apache/struts2/showcase/chat/class-use/MessagesAvailableInRoomAction.html...>
Generating <https://builds.apache.org/job/Struts-master-JDK7/ws/apps/showcase/target/apidocs/org/apache/struts2/showcase/exception/class-use/StorageException.html...>
Generating <https://builds.apache.org/job/Struts-master-JDK7/ws/apps/showcase/target/apidocs/org/apache/struts2/showcase/exception/class-use/UpdateException.html...>
Generating <https://builds.apache.org/job/Struts-master-JDK7/ws/apps/showcase/target/apidocs/org/apache/struts2/showcase/exception/class-use/DeleteException.html...>
Generating <https://builds.apache.org/job/Struts-master-JDK7/ws/apps/showcase/target/apidocs/org/apache/struts2/showcase/exception/class-use/DuplicateKeyException.html...>
Generating <https://builds.apache.org/job/Struts-master-JDK7/ws/apps/showcase/target/apidocs/org/apache/struts2/showcase/exception/class-use/CreateException.html...>
Generating <https://builds.apache.org/job/Struts-master-JDK7/ws/apps/showcase/target/apidocs/org/apache/struts2/showcase/model/class-use/Skill.html...>
Generating <https://builds.apache.org/job/Struts-master-JDK7/ws/apps/showcase/target/apidocs/org/apache/struts2/showcase/model/class-use/IdEntity.html...>
Generating <https://builds.apache.org/job/Struts-master-JDK7/ws/apps/showcase/target/apidocs/org/apache/struts2/showcase/model/class-use/Employee.html...>
Generating <https://builds.apache.org/job/Struts-master-JDK7/ws/apps/showcase/target/apidocs/org/apache/struts2/showcase/tag/nonui/iteratortag/class-use/IteratorGeneratorTagDemo.html...>
Generating <https://builds.apache.org/job/Struts-master-JDK7/ws/apps/showcase/target/apidocs/org/apache/struts2/showcase/tag/nonui/iteratortag/class-use/AppendIteratorTagDemo.html...>
Generating <https://builds.apache.org/job/Struts-master-JDK7/ws/apps/showcase/target/apidocs/org/apache/struts2/showcase/tag/nonui/iteratortag/class-use/SubsetIteratorTagDemo.html...>
Generating <https://builds.apache.org/job/Struts-master-JDK7/ws/apps/showcase/target/apidocs/org/apache/struts2/showcase/tag/nonui/iteratortag/class-use/MergeIteratorTagDemo.html...>
Generating <https://builds.apache.org/job/Struts-master-JDK7/ws/apps/showcase/target/apidocs/org/apache/struts2/showcase/tag/nonui/actiontag/class-use/ActionTagDemo.html...>
Generating <https://builds.apache.org/job/Struts-master-JDK7/ws/apps/showcase/target/apidocs/org/apache/struts2/showcase/tag/nonui/actionPrefix/class-use/SubmitAction.html...>
Generating <https://builds.apache.org/job/Struts-master-JDK7/ws/apps/showcase/target/apidocs/org/apache/struts2/showcase/person/class-use/NewPersonAction.html...>
Generating <https://builds.apache.org/job/Struts-master-JDK7/ws/apps/showcase/target/apidocs/org/apache/struts2/showcase/person/class-use/ListPeopleAction.html...>
Generating <https://builds.apache.org/job/Struts-master-JDK7/ws/apps/showcase/target/apidocs/org/apache/struts2/showcase/person/class-use/EditPersonAction.html...>
Generating <https://builds.apache.org/job/Struts-master-JDK7/ws/apps/showcase/target/apidocs/org/apache/struts2/showcase/person/class-use/PersonManager.html...>
Generating <https://builds.apache.org/job/Struts-master-JDK7/ws/apps/showcase/target/apidocs/org/apache/struts2/showcase/person/class-use/Person.html...>
Generating <https://builds.apache.org/job/Struts-master-JDK7/ws/apps/showcase/target/apidocs/org/apache/struts2/showcase/fileupload/class-use/FileUploadAction.html...>
Generating <https://builds.apache.org/job/Struts-master-JDK7/ws/apps/showcase/target/apidocs/org/apache/struts2/showcase/fileupload/class-use/MultipleFileUploadUsingArrayAction.html...>
Generating <https://builds.apache.org/job/Struts-master-JDK7/ws/apps/showcase/target/apidocs/org/apache/struts2/showcase/fileupload/class-use/MultipleFileUploadUsingListAction.html...>
Generating <https://builds.apache.org/job/Struts-master-JDK7/ws/apps/showcase/target/apidocs/org/apache/struts2/showcase/filedownload/class-use/FileDownloadAction.html...>
Generating <https://builds.apache.org/job/Struts-master-JDK7/ws/apps/showcase/target/apidocs/org/apache/struts2/showcase/tiles/class-use/TilesAnnotationsAction.html...>
Generating <https://builds.apache.org/job/Struts-master-JDK7/ws/apps/showcase/target/apidocs/org/apache/struts2/showcase/token/class-use/TokenAction.html...>
Generating <https://builds.apache.org/job/Struts-master-JDK7/ws/apps/showcase/target/apidocs/org/apache/struts2/showcase/modelDriven/class-use/ModelDrivenAction.html...>
Generating <https://builds.apache.org/job/Struts-master-JDK7/ws/apps/showcase/target/apidocs/org/apache/struts2/showcase/modelDriven/class-use/Gangster.html...>
Generating <https://builds.apache.org/job/Struts-master-JDK7/ws/apps/showcase/target/apidocs/org/apache/struts2/showcase/source/class-use/ViewSourceAction.html...>
Generating <https://builds.apache.org/job/Struts-master-JDK7/ws/apps/showcase/target/apidocs/org/apache/struts2/showcase/ajax/tree/class-use/GetCategory.html...>
Generating <https://builds.apache.org/job/Struts-master-JDK7/ws/apps/showcase/target/apidocs/org/apache/struts2/showcase/ajax/tree/class-use/Category.html...>
Generating <https://builds.apache.org/job/Struts-master-JDK7/ws/apps/showcase/target/apidocs/org/apache/struts2/showcase/ajax/tree/class-use/Toggle.html...>
Generating <https://builds.apache.org/job/Struts-master-JDK7/ws/apps/showcase/target/apidocs/org/apache/struts2/showcase/ajax/class-use/Example4ShowPanelAction.html...>
Generating <https://builds.apache.org/job/Struts-master-JDK7/ws/apps/showcase/target/apidocs/org/apache/struts2/showcase/ajax/class-use/AutocompleterExampleAction.html...>
Generating <https://builds.apache.org/job/Struts-master-JDK7/ws/apps/showcase/target/apidocs/org/apache/struts2/showcase/ajax/class-use/AjaxTestAction.html...>
Generating <https://builds.apache.org/job/Struts-master-JDK7/ws/apps/showcase/target/apidocs/org/apache/struts2/showcase/ajax/class-use/Example5Action.html...>
Generating <https://builds.apache.org/job/Struts-master-JDK7/ws/apps/showcase/target/apidocs/org/apache/struts2/showcase/action/class-use/SkillAction.html...>
Generating <https://builds.apache.org/job/Struts-master-JDK7/ws/apps/showcase/target/apidocs/org/apache/struts2/showcase/action/class-use/ExampleAction.html...>
Generating <https://builds.apache.org/job/Struts-master-JDK7/ws/apps/showcase/target/apidocs/org/apache/struts2/showcase/action/class-use/EmployeeAction.html...>
Generating <https://builds.apache.org/job/Struts-master-JDK7/ws/apps/showcase/target/apidocs/org/apache/struts2/showcase/action/class-use/JSPEvalAction.html...>
Generating <https://builds.apache.org/job/Struts-master-JDK7/ws/apps/showcase/target/apidocs/org/apache/struts2/showcase/action/class-use/AbstractCRUDAction.html...>
Generating <https://builds.apache.org/job/Struts-master-JDK7/ws/apps/showcase/target/apidocs/org/apache/struts2/showcase/package-use.html...>
Generating <https://builds.apache.org/job/Struts-master-JDK7/ws/apps/showcase/target/apidocs/org/apache/struts2/showcase/action/package-use.html...>
Generating <https://builds.apache.org/job/Struts-master-JDK7/ws/apps/showcase/target/apidocs/org/apache/struts2/showcase/actionchaining/package-use.html...>
Generating <https://builds.apache.org/job/Struts-master-JDK7/ws/apps/showcase/target/apidocs/org/apache/struts2/showcase/ajax/package-use.html...>
Generating <https://builds.apache.org/job/Struts-master-JDK7/ws/apps/showcase/target/apidocs/org/apache/struts2/showcase/ajax/tree/package-use.html...>
Generating <https://builds.apache.org/job/Struts-master-JDK7/ws/apps/showcase/target/apidocs/org/apache/struts2/showcase/application/package-use.html...>
Generating <https://builds.apache.org/job/Struts-master-JDK7/ws/apps/showcase/target/apidocs/org/apache/struts2/showcase/chat/package-use.html...>
Generating <https://builds.apache.org/job/Struts-master-JDK7/ws/apps/showcase/target/apidocs/org/apache/struts2/showcase/conversion/package-use.html...>
Generating <https://builds.apache.org/job/Struts-master-JDK7/ws/apps/showcase/target/apidocs/org/apache/struts2/showcase/dao/package-use.html...>
Generating <https://builds.apache.org/job/Struts-master-JDK7/ws/apps/showcase/target/apidocs/org/apache/struts2/showcase/exception/package-use.html...>
Generating <https://builds.apache.org/job/Struts-master-JDK7/ws/apps/showcase/target/apidocs/org/apache/struts2/showcase/filedownload/package-use.html...>
Generating <https://builds.apache.org/job/Struts-master-JDK7/ws/apps/showcase/target/apidocs/org/apache/struts2/showcase/fileupload/package-use.html...>
Generating <https://builds.apache.org/job/Struts-master-JDK7/ws/apps/showcase/target/apidocs/org/apache/struts2/showcase/freemarker/package-use.html...>
Generating <https://builds.apache.org/job/Struts-master-JDK7/ws/apps/showcase/target/apidocs/org/apache/struts2/showcase/hangman/package-use.html...>
Generating <https://builds.apache.org/job/Struts-master-JDK7/ws/apps/showcase/target/apidocs/org/apache/struts2/showcase/model/package-use.html...>
Generating <https://builds.apache.org/job/Struts-master-JDK7/ws/apps/showcase/target/apidocs/org/apache/struts2/showcase/modelDriven/package-use.html...>
Generating <https://builds.apache.org/job/Struts-master-JDK7/ws/apps/showcase/target/apidocs/org/apache/struts2/showcase/person/package-use.html...>
Generating <https://builds.apache.org/job/Struts-master-JDK7/ws/apps/showcase/target/apidocs/org/apache/struts2/showcase/source/package-use.html...>
Generating <https://builds.apache.org/job/Struts-master-JDK7/ws/apps/showcase/target/apidocs/org/apache/struts2/showcase/tag/nonui/actionPrefix/package-use.html...>
Generating <https://builds.apache.org/job/Struts-master-JDK7/ws/apps/showcase/target/apidocs/org/apache/struts2/showcase/tag/nonui/actiontag/package-use.html...>
Generating <https://builds.apache.org/job/Struts-master-JDK7/ws/apps/showcase/target/apidocs/org/apache/struts2/showcase/tag/nonui/iteratortag/package-use.html...>
Generating <https://builds.apache.org/job/Struts-master-JDK7/ws/apps/showcase/target/apidocs/org/apache/struts2/showcase/tiles/package-use.html...>
Generating <https://builds.apache.org/job/Struts-master-JDK7/ws/apps/showcase/target/apidocs/org/apache/struts2/showcase/token/package-use.html...>
Generating <https://builds.apache.org/job/Struts-master-JDK7/ws/apps/showcase/target/apidocs/org/apache/struts2/showcase/validation/package-use.html...>
Generating <https://builds.apache.org/job/Struts-master-JDK7/ws/apps/showcase/target/apidocs/org/apache/struts2/showcase/wait/package-use.html...>
Generating <https://builds.apache.org/job/Struts-master-JDK7/ws/apps/showcase/target/apidocs/org/apache/struts2/showcase/xslt/package-use.html...>
Building index for all the packages and classes...
Generating <https://builds.apache.org/job/Struts-master-JDK7/ws/apps/showcase/target/apidocs/overview-tree.html...>
Generating <https://builds.apache.org/job/Struts-master-JDK7/ws/apps/showcase/target/apidocs/index-all.html...>
Generating <https://builds.apache.org/job/Struts-master-JDK7/ws/apps/showcase/target/apidocs/deprecated-list.html...>
Building index for all classes...
Generating <https://builds.apache.org/job/Struts-master-JDK7/ws/apps/showcase/target/apidocs/allclasses-frame.html...>
Generating <https://builds.apache.org/job/Struts-master-JDK7/ws/apps/showcase/target/apidocs/allclasses-noframe.html...>
Generating <https://builds.apache.org/job/Struts-master-JDK7/ws/apps/showcase/target/apidocs/index.html...>
Generating <https://builds.apache.org/job/Struts-master-JDK7/ws/apps/showcase/target/apidocs/overview-summary.html...>
Generating <https://builds.apache.org/job/Struts-master-JDK7/ws/apps/showcase/target/apidocs/help-doc.html...>
[INFO] Building jar: <https://builds.apache.org/job/Struts-master-JDK7/ws/apps/showcase/target/struts2-showcase-javadoc.jar>
[INFO]
[INFO] --- maven-antrun-plugin:1.8:run (copy-sources) @ struts2-showcase ---
[WARNING] Parameter tasks is deprecated, use target instead
[INFO] Executing tasks

main:
     [copy] Copying 112 files to <https://builds.apache.org/job/Struts-master-JDK7/ws/apps/showcase/target/struts2-showcase/WEB-INF/src/java>
     [copy] Copying 59 files to <https://builds.apache.org/job/Struts-master-JDK7/ws/apps/showcase/target/struts2-showcase/WEB-INF/src/java>
[INFO] Executed tasks
[INFO]
[INFO] --- maven-remote-resources-plugin:1.5:process (process-resource-bundles) @ struts2-showcase ---
[INFO]
[INFO] --- maven-resources-plugin:2.7:resources (default-resources) @ struts2-showcase ---
[INFO] Using 'UTF-8' encoding to copy filtered resources.
[INFO] Copying 59 resources
[INFO] Copying 112 resources
[INFO] Copying 3 resources
[INFO]
[INFO] --- maven-compiler-plugin:3.5.1:compile (default-compile) @ struts2-showcase ---
[INFO] Changes detected - recompiling the module!
[INFO] Compiling 112 source files to <https://builds.apache.org/job/Struts-master-JDK7/ws/apps/showcase/target/classes>
[INFO] <https://builds.apache.org/job/Struts-master-JDK7/ws/apps/showcase/src/main/java/org/apache/struts2/showcase/application/TestDataProvider.java>: Some input files use or override a deprecated API.
[INFO] <https://builds.apache.org/job/Struts-master-JDK7/ws/apps/showcase/src/main/java/org/apache/struts2/showcase/application/TestDataProvider.java>: Recompile with -Xlint:deprecation for details.
[INFO] <https://builds.apache.org/job/Struts-master-JDK7/ws/apps/showcase/src/main/java/org/apache/struts2/showcase/chat/ChatLoginAction.java>: Some input files use unchecked or unsafe operations.
[INFO] <https://builds.apache.org/job/Struts-master-JDK7/ws/apps/showcase/src/main/java/org/apache/struts2/showcase/chat/ChatLoginAction.java>: Recompile with -Xlint:unchecked for details.
[INFO]
[INFO] --- maven-bundle-plugin:2.1.0:manifest (bundle-manifest) @ struts2-showcase ---
[WARNING] Ignoring project type war - supportedProjectTypes = [jar, bundle]
[INFO]
[INFO] --- maven-resources-plugin:2.7:testResources (default-testResources) @ struts2-showcase ---
[INFO] Using 'UTF-8' encoding to copy filtered resources.
[INFO] skip non existing resourceDirectory <https://builds.apache.org/job/Struts-master-JDK7/ws/apps/showcase/src/test/resources>
[INFO] Copying 3 resources
[INFO]
[INFO] --- maven-compiler-plugin:3.5.1:testCompile (default-testCompile) @ struts2-showcase ---
[INFO] Changes detected - recompiling the module!
[INFO] Compiling 14 source files to <https://builds.apache.org/job/Struts-master-JDK7/ws/apps/showcase/target/test-classes>
[INFO] <https://builds.apache.org/job/Struts-master-JDK7/ws/apps/showcase/src/test/java/org/apache/struts2/showcase/filedownload/FileDownloadActionTest.java>: <https://builds.apache.org/job/Struts-master-JDK7/ws/apps/showcase/src/test/java/org/apache/struts2/showcase/filedownload/FileDownloadActionTest.java> uses or overrides a deprecated API.
[INFO] <https://builds.apache.org/job/Struts-master-JDK7/ws/apps/showcase/src/test/java/org/apache/struts2/showcase/filedownload/FileDownloadActionTest.java>: Recompile with -Xlint:deprecation for details.
[INFO]
[INFO] --- maven-surefire-plugin:2.20.1:test (default-test) @ struts2-showcase ---
[INFO]
[INFO] -------------------------------------------------------
[INFO]  T E S T S
[INFO] -------------------------------------------------------
[INFO] Running org.apache.struts2.showcase.filedownload.FileDownloadActionTest
[INFO] Tests run: 5, Failures: 0, Errors: 0, Skipped: 0, Time elapsed: 0.101 s - in org.apache.struts2.showcase.filedownload.FileDownloadActionTest
[INFO]
[INFO] Results:
[INFO]
[INFO] Tests run: 5, Failures: 0, Errors: 0, Skipped: 0
[INFO]
[INFO]
[INFO] --- maven-war-plugin:2.1:war (default-war) @ struts2-showcase ---
[INFO] Packaging webapp
[INFO] Assembling webapp [struts2-showcase] in [<https://builds.apache.org/job/Struts-master-JDK7/ws/apps/showcase/target/struts2-showcase]>
[INFO] Processing war project
[INFO] Copying webapp webResources [<https://builds.apache.org/job/Struts-master-JDK7/ws/apps/showcase/src/main/resources]> to [<https://builds.apache.org/job/Struts-master-JDK7/ws/apps/showcase/target/struts2-showcase]>
[INFO] Copying webapp resources [<https://builds.apache.org/job/Struts-master-JDK7/ws/apps/showcase/src/main/webapp]>
[INFO] Webapp assembled in [308 msecs]
[INFO] Building war: <https://builds.apache.org/job/Struts-master-JDK7/ws/apps/showcase/target/struts2-showcase.war>
[INFO] WEB-INF/web.xml already added, skipping
[INFO]
[INFO] >>> maven-source-plugin:3.0.0:jar (attach-sources) > generate-sources @ struts2-showcase >>>
[INFO]
[INFO] <<< maven-source-plugin:3.0.0:jar (attach-sources) < generate-sources @ struts2-showcase <<<
[INFO]
[INFO]
[INFO] --- maven-source-plugin:3.0.0:jar (attach-sources) @ struts2-showcase ---
[INFO] Building jar: <https://builds.apache.org/job/Struts-master-JDK7/ws/apps/showcase/target/struts2-showcase-sources.jar>
[INFO]
[INFO] --- maven-site-plugin:3.5.1:attach-descriptor (attach-descriptor) @ struts2-showcase ---
[INFO]
[INFO] --- apache-rat-plugin:0.11:check (default) @ struts2-showcase ---
[INFO] 51 implicit excludes (use -debug for more details).
[INFO] Exclude: src/main/resources/org/apache/struts2/static/domTT.js
[INFO] Exclude: src/site/resources/tags/**/*.html
[INFO] Exclude: src/main/resources/*LICENSE.txt
[INFO] Exclude: src/test/resources/**/*.txt
[INFO] Exclude: src/main/webapp/**/*.css
[INFO] Exclude: src/main/webapp/**/*.map
[INFO] Exclude: src/main/webapp/**/*.js
[INFO] Exclude: src/main/webapp/**/*.svg
[INFO] Exclude: src/main/webapp/**/*.txt
[INFO] Exclude: src/main/resources/**/sitegraph-usage.txt
[INFO] Exclude: src/main/resources/static/css/**/*.css
[INFO] Exclude: src/main/resources/static/js/**/*.js
[INFO] Exclude: src/main/resources/docs.cfg
[INFO] 370 resources included (use -debug for more details)
[INFO] Rat check: Summary of files. Unapproved: 1 unknown: 1 generated: 0 approved: 307 licence.
[INFO] ------------------------------------------------------------------------
[INFO] Reactor Summary:
[INFO]
[INFO] Struts 2 Bill of Materials ......................... SUCCESS [  7.402 s]
[INFO] Struts 2 ........................................... SUCCESS [ 11.705 s]
[INFO] Struts 2 Core ...................................... SUCCESS [03:12 min]
[INFO] Struts Plugins ..................................... SUCCESS [  9.602 s]
[INFO] Struts 2 Configuration Browser Plugin .............. SUCCESS [ 18.931 s]
[INFO] Struts 2 Sitemesh Plugin ........................... SUCCESS [ 18.830 s]
[INFO] Struts 2 Tiles Plugin .............................. SUCCESS [ 20.073 s]
[INFO] Struts 2 DWR Plugin ................................ SUCCESS [ 17.441 s]
[INFO] Struts 2 Spring Plugin ............................. SUCCESS [ 19.977 s]
[INFO] Struts 2 Convention Plugin ......................... SUCCESS [ 24.289 s]
[INFO] Struts 2 JUnit Plugin .............................. SUCCESS [ 23.892 s]
[INFO] Struts 2 JSON Plugin ............................... SUCCESS [ 26.622 s]
[INFO] Struts 2 Bean Validation Plugin .................... SUCCESS [ 21.281 s]
[INFO] Struts 2 Webapps ................................... SUCCESS [  6.015 s]
[INFO] Struts 2 Showcase Webapp ........................... FAILURE [ 10.870 s]
[INFO] Struts 2 REST Plugin ............................... SKIPPED
[INFO] Struts 2 Rest Showcase Webapp ...................... SKIPPED
[INFO] Struts 2 CDI Plugin ................................ SKIPPED
[INFO] Struts 2 Embedded JSP Plugin ....................... SKIPPED
[INFO] Struts 2 GXP Plugin ................................ SKIPPED
[INFO] Struts 2 Jasper Reports Plugin ..................... SKIPPED
[INFO] Struts 2 Java Templates Plugin ..................... SKIPPED
[INFO] Struts 2 JFreeChart Plugin ......................... SKIPPED
[INFO] Struts 2 OSGi Plugin ............................... SKIPPED
[INFO] Struts 2 OVal Plugin ............................... SKIPPED
[INFO] Struts 2 Pell Multipart Plugin ..................... SKIPPED
[INFO] Struts 2 Plexus Plugin ............................. SKIPPED
[INFO] Struts 2 Portlet Plugin ............................ SKIPPED
[INFO] Struts 2 Portlet Tiles Plugin ...................... SKIPPED
[INFO] DEPRECATED: Struts 2 Sitegraph Plugin .............. SKIPPED
[INFO] Struts 2 TestNG Plugin ............................. SKIPPED
[INFO] Struts OSGi Bundles ................................ SKIPPED
[INFO] Struts 2 OSGi Admin Bundle ......................... SKIPPED
[INFO] Struts 2 OSGi Demo Bundle .......................... SKIPPED
[INFO] Struts 2 Assembly .................................. SKIPPED
[INFO] ------------------------------------------------------------------------
[INFO] BUILD FAILURE
[INFO] ------------------------------------------------------------------------
[INFO] Total time: 07:11 min
[INFO] Finished at: 2017-10-22T07:30:30Z
[INFO] Final Memory: 92M/2741M
[INFO] ------------------------------------------------------------------------
[ERROR] Failed to execute goal org.apache.rat:apache-rat-plugin:0.11:check (default) on project struts2-showcase: Too many files with unapproved license: 1 See RAT report in: <https://builds.apache.org/job/Struts-master-JDK7/ws/apps/showcase/target/rat.txt> -> [Help 1]
[ERROR]
[ERROR] To see the full stack trace of the errors, re-run Maven with the -e switch.
[ERROR] Re-run Maven using the -X switch to enable full debug logging.
[ERROR]
[ERROR] For more information about the errors and possible solutions, please read the following articles:
[ERROR] [Help 1] http://cwiki.apache.org/confluence/display/MAVEN/MojoFailureException
[ERROR]
[ERROR] After correcting the problems, you can resume the build with the command
[ERROR]   mvn <goals> -rf :struts2-showcase
Build step 'Execute shell' marked build as failure
[locks-and-latches] Releasing all the locks
[locks-and-latches] All the locks released
Setting MAVEN_3_LATEST__HOME=/home/jenkins/tools/maven/latest3/

---------------------------------------------------------------------
To unsubscribe, e-mail: [hidden email]
For additional commands, e-mail: [hidden email]

Reply | Threaded
Open this post in threaded view
|

Build failed in Jenkins: Struts-master-JDK7 #38

Apache Jenkins Server-2
See <https://builds.apache.org/job/Struts-master-JDK7/38/display/redirect?page=changes>

Changes:

[Lukasz Lenart] Uses <target/> instead of <tasks/> to avoid warnings

[Lukasz Lenart] Changes how docs are fetched

[Lukasz Lenart] Excludes fonts

------------------------------------------
[...truncated 4.12 MB...]
     [exec] 2017-10-22 08:12:48 URL:http://struts.apache.org/tag-developers/form-tags.html [23707/23707] -> "<https://builds.apache.org/job/Struts-master-JDK7/ws/assembly/target/docs/tag-developers/form-tags.html"> [1]
     [exec] 2017-10-22 08:12:48 URL:http://struts.apache.org/tag-developers/template-loading.html [12810/12810] -> "<https://builds.apache.org/job/Struts-master-JDK7/ws/assembly/target/docs/tag-developers/template-loading.html"> [1]
     [exec] 2017-10-22 08:12:48 URL:http://struts.apache.org/tag-developers/selecting-template-directory.html [8920/8920] -> "<https://builds.apache.org/job/Struts-master-JDK7/ws/assembly/target/docs/tag-developers/selecting-template-directory.html"> [1]
     [exec] 2017-10-22 08:12:48 URL:http://struts.apache.org/tag-developers/selecting-themes.html [9377/9377] -> "<https://builds.apache.org/job/Struts-master-JDK7/ws/assembly/target/docs/tag-developers/selecting-themes.html"> [1]
     [exec] 2017-10-22 08:12:49 URL:http://struts.apache.org/tag-developers/extending-themes.html [14299/14299] -> "<https://builds.apache.org/job/Struts-master-JDK7/ws/assembly/target/docs/tag-developers/extending-themes.html"> [1]
     [exec] 2017-10-22 08:12:49 URL:http://struts.apache.org/tag-developers/simple-theme.html [10604/10604] -> "<https://builds.apache.org/job/Struts-master-JDK7/ws/assembly/target/docs/tag-developers/simple-theme.html"> [1]
     [exec] 2017-10-22 08:12:49 URL:http://struts.apache.org/tag-developers/xhtml-theme.html [33779/33779] -> "<https://builds.apache.org/job/Struts-master-JDK7/ws/assembly/target/docs/tag-developers/xhtml-theme.html"> [1]
     [exec] 2017-10-22 08:12:49 URL:http://struts.apache.org/tag-developers/css-xhtml-theme.html [23235/23235] -> "<https://builds.apache.org/job/Struts-master-JDK7/ws/assembly/target/docs/tag-developers/css-xhtml-theme.html"> [1]
     [exec] 2017-10-22 08:12:49 URL:http://struts.apache.org/tag-developers/ajax-theme.html [12101/12101] -> "<https://builds.apache.org/job/Struts-master-JDK7/ws/assembly/target/docs/tag-developers/ajax-theme.html"> [1]
     [exec] 2017-10-22 08:12:49 URL:http://struts.apache.org/tag-developers/if-tag.html [10100/10100] -> "<https://builds.apache.org/job/Struts-master-JDK7/ws/assembly/target/docs/tag-developers/if-tag.html"> [1]
     [exec] 2017-10-22 08:12:49 URL:http://struts.apache.org/tag-developers/a-tag.html [32630/32630] -> "<https://builds.apache.org/job/Struts-master-JDK7/ws/assembly/target/docs/tag-developers/a-tag.html"> [1]
     [exec] 2017-10-22 08:12:49 URL:http://struts.apache.org/tag-developers/elseif-tag.html [10083/10083] -> "<https://builds.apache.org/job/Struts-master-JDK7/ws/assembly/target/docs/tag-developers/elseif-tag.html"> [1]
     [exec] 2017-10-22 08:12:49 URL:http://struts.apache.org/tag-developers/action-tag.html [16539/16539] -> "<https://builds.apache.org/job/Struts-master-JDK7/ws/assembly/target/docs/tag-developers/action-tag.html"> [1]
     [exec] 2017-10-22 08:12:49 URL:http://struts.apache.org/tag-developers/else-tag.html [9710/9710] -> "<https://builds.apache.org/job/Struts-master-JDK7/ws/assembly/target/docs/tag-developers/else-tag.html"> [1]
     [exec] 2017-10-22 08:12:49 URL:http://struts.apache.org/tag-developers/bean-tag.html [11924/11924] -> "<https://builds.apache.org/job/Struts-master-JDK7/ws/assembly/target/docs/tag-developers/bean-tag.html"> [1]
     [exec] 2017-10-22 08:12:49 URL:http://struts.apache.org/tag-developers/append-tag.html [14581/14581] -> "<https://builds.apache.org/job/Struts-master-JDK7/ws/assembly/target/docs/tag-developers/append-tag.html"> [1]
     [exec] 2017-10-22 08:12:50 URL:http://struts.apache.org/tag-developers/date-tag.html [13493/13493] -> "<https://builds.apache.org/job/Struts-master-JDK7/ws/assembly/target/docs/tag-developers/date-tag.html"> [1]
     [exec] 2017-10-22 08:12:50 URL:http://struts.apache.org/tag-developers/generator-tag.html [13936/13936] -> "<https://builds.apache.org/job/Struts-master-JDK7/ws/assembly/target/docs/tag-developers/generator-tag.html"> [1]
     [exec] 2017-10-22 08:12:50 URL:http://struts.apache.org/tag-developers/debug-tag.html [7977/7977] -> "<https://builds.apache.org/job/Struts-master-JDK7/ws/assembly/target/docs/tag-developers/debug-tag.html"> [1]
     [exec] 2017-10-22 08:12:50 URL:http://struts.apache.org/tag-developers/iterator-tag.html [20457/20457] -> "<https://builds.apache.org/job/Struts-master-JDK7/ws/assembly/target/docs/tag-developers/iterator-tag.html"> [1]
     [exec] 2017-10-22 08:12:50 URL:http://struts.apache.org/tag-developers/i18n-tag.html [9800/9800] -> "<https://builds.apache.org/job/Struts-master-JDK7/ws/assembly/target/docs/tag-developers/i18n-tag.html"> [1]
     [exec] 2017-10-22 08:12:50 URL:http://struts.apache.org/tag-developers/merge-tag.html [14891/14891] -> "<https://builds.apache.org/job/Struts-master-JDK7/ws/assembly/target/docs/tag-developers/merge-tag.html"> [1]
     [exec] 2017-10-22 08:12:50 URL:http://struts.apache.org/tag-developers/include-tag.html [10364/10364] -> "<https://builds.apache.org/job/Struts-master-JDK7/ws/assembly/target/docs/tag-developers/include-tag.html"> [1]
     [exec] 2017-10-22 08:12:50 URL:http://struts.apache.org/tag-developers/sort-tag.html [11334/11334] -> "<https://builds.apache.org/job/Struts-master-JDK7/ws/assembly/target/docs/tag-developers/sort-tag.html"> [1]
     [exec] 2017-10-22 08:12:50 URL:http://struts.apache.org/tag-developers/param-tag.html [13374/13374] -> "<https://builds.apache.org/job/Struts-master-JDK7/ws/assembly/target/docs/tag-developers/param-tag.html"> [1]
     [exec] 2017-10-22 08:12:50 URL:http://struts.apache.org/tag-developers/subset-tag.html [17689/17689] -> "<https://builds.apache.org/job/Struts-master-JDK7/ws/assembly/target/docs/tag-developers/subset-tag.html"> [1]
     [exec] 2017-10-22 08:12:50 URL:http://struts.apache.org/tag-developers/property-tag.html [11935/11935] -> "<https://builds.apache.org/job/Struts-master-JDK7/ws/assembly/target/docs/tag-developers/property-tag.html"> [1]
     [exec] 2017-10-22 08:12:50 URL:http://struts.apache.org/tag-developers/push-tag.html [13039/13039] -> "<https://builds.apache.org/job/Struts-master-JDK7/ws/assembly/target/docs/tag-developers/push-tag.html"> [1]
     [exec] 2017-10-22 08:12:51 URL:http://struts.apache.org/tag-developers/set-tag.html [11934/11934] -> "<https://builds.apache.org/job/Struts-master-JDK7/ws/assembly/target/docs/tag-developers/set-tag.html"> [1]
     [exec] 2017-10-22 08:12:51 URL:http://struts.apache.org/tag-developers/text-tag.html [13214/13214] -> "<https://builds.apache.org/job/Struts-master-JDK7/ws/assembly/target/docs/tag-developers/text-tag.html"> [1]
     [exec] 2017-10-22 08:12:51 URL:http://struts.apache.org/tag-developers/url-tag.html [16086/16086] -> "<https://builds.apache.org/job/Struts-master-JDK7/ws/assembly/target/docs/tag-developers/url-tag.html"> [1]
     [exec] 2017-10-22 08:12:51 URL:http://struts.apache.org/tag-developers/checkbox-tag.html [25263/25263] -> "<https://builds.apache.org/job/Struts-master-JDK7/ws/assembly/target/docs/tag-developers/checkbox-tag.html"> [1]
     [exec] 2017-10-22 08:12:51 URL:http://struts.apache.org/tag-developers/actionerror-tag.html [24591/24591] -> "<https://builds.apache.org/job/Struts-master-JDK7/ws/assembly/target/docs/tag-developers/actionerror-tag.html"> [1]
     [exec] 2017-10-22 08:12:51 URL:http://struts.apache.org/tag-developers/checkboxlist-tag.html [27519/27519] -> "<https://builds.apache.org/job/Struts-master-JDK7/ws/assembly/target/docs/tag-developers/checkboxlist-tag.html"> [1]
     [exec] 2017-10-22 08:12:51 URL:http://struts.apache.org/tag-developers/actionmessage-tag.html [24590/24590] -> "<https://builds.apache.org/job/Struts-master-JDK7/ws/assembly/target/docs/tag-developers/actionmessage-tag.html"> [1]
     [exec] 2017-10-22 08:12:51 URL:http://struts.apache.org/tag-developers/combobox-tag.html [29411/29411] -> "<https://builds.apache.org/job/Struts-master-JDK7/ws/assembly/target/docs/tag-developers/combobox-tag.html"> [1]
     [exec] 2017-10-22 08:12:51 URL:http://struts.apache.org/tag-developers/component-tag.html [28051/28051] -> "<https://builds.apache.org/job/Struts-master-JDK7/ws/assembly/target/docs/tag-developers/component-tag.html"> [1]
     [exec] 2017-10-22 08:12:51 URL:http://struts.apache.org/tag-developers/datetextfield-tag.html [24693/24693] -> "<https://builds.apache.org/job/Struts-master-JDK7/ws/assembly/target/docs/tag-developers/datetextfield-tag.html"> [1]
     [exec] 2017-10-22 08:12:51 URL:http://struts.apache.org/tag-developers/div-tag.html [24477/24477] -> "<https://builds.apache.org/job/Struts-master-JDK7/ws/assembly/target/docs/tag-developers/div-tag.html"> [1]
     [exec] 2017-10-22 08:12:52 URL:http://struts.apache.org/tag-developers/doubleselect-tag.html [41719/41719] -> "<https://builds.apache.org/job/Struts-master-JDK7/ws/assembly/target/docs/tag-developers/doubleselect-tag.html"> [1]
     [exec] 2017-10-22 08:12:52 URL:http://struts.apache.org/tag-developers/fielderror-tag.html [26066/26066] -> "<https://builds.apache.org/job/Struts-master-JDK7/ws/assembly/target/docs/tag-developers/fielderror-tag.html"> [1]
     [exec] 2017-10-22 08:12:52 URL:http://struts.apache.org/tag-developers/head-tag.html [24280/24280] -> "<https://builds.apache.org/job/Struts-master-JDK7/ws/assembly/target/docs/tag-developers/head-tag.html"> [1]
     [exec] 2017-10-22 08:12:52 URL:http://struts.apache.org/tag-developers/file-tag.html [25097/25097] -> "<https://builds.apache.org/job/Struts-master-JDK7/ws/assembly/target/docs/tag-developers/file-tag.html"> [1]
     [exec] 2017-10-22 08:12:52 URL:http://struts.apache.org/tag-developers/form-tag.html [30292/30292] -> "<https://builds.apache.org/job/Struts-master-JDK7/ws/assembly/target/docs/tag-developers/form-tag.html"> [1]
     [exec] 2017-10-22 08:12:52 URL:http://struts.apache.org/tag-developers/hidden-tag.html [25325/25325] -> "<https://builds.apache.org/job/Struts-master-JDK7/ws/assembly/target/docs/tag-developers/hidden-tag.html"> [1]
     [exec] 2017-10-22 08:12:52 URL:http://struts.apache.org/tag-developers/inputtransferselect-tag.html [32533/32533] -> "<https://builds.apache.org/job/Struts-master-JDK7/ws/assembly/target/docs/tag-developers/inputtransferselect-tag.html"> [1]
     [exec] 2017-10-22 08:12:52 URL:http://struts.apache.org/tag-developers/label-tag.html [24930/24930] -> "<https://builds.apache.org/job/Struts-master-JDK7/ws/assembly/target/docs/tag-developers/label-tag.html"> [1]
     [exec] 2017-10-22 08:12:52 URL:http://struts.apache.org/tag-developers/optiontransferselect-tag.html [51201/51201] -> "<https://builds.apache.org/job/Struts-master-JDK7/ws/assembly/target/docs/tag-developers/optiontransferselect-tag.html"> [1]
     [exec] 2017-10-22 08:12:52 URL:http://struts.apache.org/tag-developers/optgroup-tag.html [11618/11618] -> "<https://builds.apache.org/job/Struts-master-JDK7/ws/assembly/target/docs/tag-developers/optgroup-tag.html"> [1]
     [exec] 2017-10-22 08:12:52 URL:http://struts.apache.org/tag-developers/password-tag.html [26597/26597] -> "<https://builds.apache.org/job/Struts-master-JDK7/ws/assembly/target/docs/tag-developers/password-tag.html"> [1]
     [exec] 2017-10-22 08:12:52 URL:http://struts.apache.org/tag-developers/radio-tag.html [28401/28401] -> "<https://builds.apache.org/job/Struts-master-JDK7/ws/assembly/target/docs/tag-developers/radio-tag.html"> [1]
     [exec] 2017-10-22 08:12:53 URL:http://struts.apache.org/tag-developers/reset-tag.html [26859/26859] -> "<https://builds.apache.org/job/Struts-master-JDK7/ws/assembly/target/docs/tag-developers/reset-tag.html"> [1]
     [exec] 2017-10-22 08:12:53 URL:http://struts.apache.org/tag-developers/select-tag.html [31001/31001] -> "<https://builds.apache.org/job/Struts-master-JDK7/ws/assembly/target/docs/tag-developers/select-tag.html"> [1]
     [exec] 2017-10-22 08:12:53 URL:http://struts.apache.org/tag-developers/submit-tag.html [27256/27256] -> "<https://builds.apache.org/job/Struts-master-JDK7/ws/assembly/target/docs/tag-developers/submit-tag.html"> [1]
     [exec] 2017-10-22 08:12:53 URL:http://struts.apache.org/tag-developers/textarea-tag.html [25611/25611] -> "<https://builds.apache.org/job/Struts-master-JDK7/ws/assembly/target/docs/tag-developers/textarea-tag.html"> [1]
     [exec] 2017-10-22 08:12:53 URL:http://struts.apache.org/tag-developers/textfield-tag.html [26032/26032] -> "<https://builds.apache.org/job/Struts-master-JDK7/ws/assembly/target/docs/tag-developers/textfield-tag.html"> [1]
     [exec] 2017-10-22 08:12:53 URL:http://struts.apache.org/tag-developers/token-tag.html [24345/24345] -> "<https://builds.apache.org/job/Struts-master-JDK7/ws/assembly/target/docs/tag-developers/token-tag.html"> [1]
     [exec] 2017-10-22 08:12:53 URL:http://struts.apache.org/tag-developers/updownselect-tag.html [33059/33059] -> "<https://builds.apache.org/job/Struts-master-JDK7/ws/assembly/target/docs/tag-developers/updownselect-tag.html"> [1]
     [exec] 2017-10-22 08:12:53 URL:http://struts.apache.org/tag-developers/ui-tag-reference.html [10591/10591] -> "<https://builds.apache.org/job/Struts-master-JDK7/ws/assembly/target/docs/tag-developers/ui-tag-reference.html"> [1]
     [exec] http://struts.apache.org/tag-developers/dojo-href-tag.html:
     [exec] 2017-10-22 08:12:53 ERROR 404: Not Found.
     [exec] 2017-10-22 08:12:53 URL:http://struts.apache.org/tag-developers/dojo-autocompleter-tag.html [41761/41761] -> "<https://builds.apache.org/job/Struts-master-JDK7/ws/assembly/target/docs/tag-developers/dojo-autocompleter-tag.html"> [1]
     [exec] 2017-10-22 08:12:53 URL:http://struts.apache.org/tag-developers/dojo-bind-tag.html [25441/25441] -> "<https://builds.apache.org/job/Struts-master-JDK7/ws/assembly/target/docs/tag-developers/dojo-bind-tag.html"> [1]
     [exec] 2017-10-22 08:12:54 URL:http://struts.apache.org/tag-developers/dojo-datetimepicker-tag.html [32471/32471] -> "<https://builds.apache.org/job/Struts-master-JDK7/ws/assembly/target/docs/tag-developers/dojo-datetimepicker-tag.html"> [1]
     [exec] 2017-10-22 08:12:54 URL:http://struts.apache.org/tag-developers/dojo-div-tag.html [37164/37164] -> "<https://builds.apache.org/job/Struts-master-JDK7/ws/assembly/target/docs/tag-developers/dojo-div-tag.html"> [1]
     [exec] 2017-10-22 08:12:54 URL:http://struts.apache.org/tag-developers/dojo-head-tag.html [15783/15783] -> "<https://builds.apache.org/job/Struts-master-JDK7/ws/assembly/target/docs/tag-developers/dojo-head-tag.html"> [1]
     [exec] 2017-10-22 08:12:54 URL:http://struts.apache.org/tag-developers/dojo-submit-tag.html [40428/40428] -> "<https://builds.apache.org/job/Struts-master-JDK7/ws/assembly/target/docs/tag-developers/dojo-submit-tag.html"> [1]
     [exec] 2017-10-22 08:12:54 URL:http://struts.apache.org/tag-developers/dojo-tabbedpanel-tag.html [35876/35876] -> "<https://builds.apache.org/job/Struts-master-JDK7/ws/assembly/target/docs/tag-developers/dojo-tabbedpanel-tag.html"> [1]
     [exec] 2017-10-22 08:12:54 URL:http://struts.apache.org/tag-developers/dojo-textarea-tag.html [24637/24637] -> "<https://builds.apache.org/job/Struts-master-JDK7/ws/assembly/target/docs/tag-developers/dojo-textarea-tag.html"> [1]
     [exec] 2017-10-22 08:12:54 URL:http://struts.apache.org/tag-developers/dojo-tree-tag.html [37392/37392] -> "<https://builds.apache.org/job/Struts-master-JDK7/ws/assembly/target/docs/tag-developers/dojo-tree-tag.html"> [1]
     [exec] 2017-10-22 08:12:54 URL:http://struts.apache.org/tag-developers/dojo-treenode-tag.html [26527/26527] -> "<https://builds.apache.org/job/Struts-master-JDK7/ws/assembly/target/docs/tag-developers/dojo-treenode-tag.html"> [1]
     [exec] 2017-10-22 08:12:54 URL:http://struts.apache.org/tag-developers/access-to-valuestack-from-jsps.html [16373/16373] -> "<https://builds.apache.org/job/Struts-master-JDK7/ws/assembly/target/docs/tag-developers/access-to-valuestack-from-jsps.html"> [1]
     [exec] http://struts.apache.org/tag-developers/tags.html:
     [exec] 2017-10-22 08:12:55 ERROR 404: Not Found.
     [exec] http://struts.apache.org/tag-developers/ogn.html:
     [exec] 2017-10-22 08:12:55 ERROR 404: Not Found.
     [exec] http://struts.apache.org/tag-developers/css-xhtml-theme.xhtml:
     [exec] 2017-10-22 08:12:55 ERROR 404: Not Found.
     [exec] http://struts.apache.org/tag-developers/form-tag.htmk:
     [exec] 2017-10-22 08:12:55 ERROR 404: Not Found.
     [exec] 2017-10-22 08:12:55 URL:http://struts.apache.org/tag-developers/dojo-a-tag.html [37911/37911] -> "<https://builds.apache.org/job/Struts-master-JDK7/ws/assembly/target/docs/tag-developers/dojo-a-tag.html"> [1]
     [exec] 2017-10-22 08:12:55 URL:http://struts.apache.org/tag-developers/ajax-head-template.html [18587/18587] -> "<https://builds.apache.org/job/Struts-master-JDK7/ws/assembly/target/docs/tag-developers/ajax-head-template.html"> [1]
     [exec] 2017-10-22 08:12:55 URL:http://struts.apache.org/tag-developers/ajax-div-template.html [19743/19743] -> "<https://builds.apache.org/job/Struts-master-JDK7/ws/assembly/target/docs/tag-developers/ajax-div-template.html"> [1]
     [exec] 2017-10-22 08:12:55 URL:http://struts.apache.org/tag-developers/ajax-a-template.html [9586/9586] -> "<https://builds.apache.org/job/Struts-master-JDK7/ws/assembly/target/docs/tag-developers/ajax-a-template.html"> [1]
     [exec] 2017-10-22 08:12:55 URL:http://struts.apache.org/tag-developers/ajax-event-system.html [10990/10990] -> "<https://builds.apache.org/job/Struts-master-JDK7/ws/assembly/target/docs/tag-developers/ajax-event-system.html"> [1]
     [exec] http://struts.apache.org/tag-developers/head-tag.htlm:
     [exec] 2017-10-22 08:12:55 ERROR 404: Not Found.
     [exec] http://struts.apache.org/tag-developers/autocompleter-tag.html:
     [exec] 2017-10-22 08:12:55 ERROR 404: Not Found.
     [exec] http://struts.apache.org/tag-developers/bind-tag.html:
     [exec] 2017-10-22 08:12:55 ERROR 404: Not Found.
     [exec] http://struts.apache.org/tag-developers/datetimepicker-tag.html:
     [exec] 2017-10-22 08:12:56 ERROR 404: Not Found.
     [exec] http://struts.apache.org/tag-developers/tabbed-tag.html:
     [exec] 2017-10-22 08:12:56 ERROR 404: Not Found.
     [exec] http://struts.apache.org/tag-developers/tree-tag.html:
     [exec] 2017-10-22 08:12:56 ERROR 404: Not Found.
     [exec] http://struts.apache.org/tag-developers/treenode-tag.html:
     [exec] 2017-10-22 08:12:56 ERROR 404: Not Found.
     [exec] 2017-10-22 08:12:56 URL:http://struts.apache.org/maven-archetypes/ [22310/22310] -> "<https://builds.apache.org/job/Struts-master-JDK7/ws/assembly/target/docs/maven-archetypes/index.html"> [1]
     [exec] 2017-10-22 08:12:56 URL:http://struts.apache.org/maven-archetypes/struts2-archetype-blank.html [23604/23604] -> "<https://builds.apache.org/job/Struts-master-JDK7/ws/assembly/target/docs/maven-archetypes/struts2-archetype-blank.html"> [1]
     [exec] 2017-10-22 08:12:56 URL:http://struts.apache.org/maven-archetypes/index.html [22310/22310] -> "<https://builds.apache.org/job/Struts-master-JDK7/ws/assembly/target/docs/maven-archetypes/index.html"> [1]
     [exec] 2017-10-22 08:12:56 URL:http://struts.apache.org/plugins/ [10135/10135] -> "<https://builds.apache.org/job/Struts-master-JDK7/ws/assembly/target/docs/plugins/index.html"> [1]
     [exec] 2017-10-22 08:12:56 URL:http://struts.apache.org/plugins/plugins.html [39614/39614] -> "<https://builds.apache.org/job/Struts-master-JDK7/ws/assembly/target/docs/plugins/plugins.html"> [1]
     [exec] http://struts.apache.org/plugins/extending-an-application-with-custom-plugins.html:
     [exec] 2017-10-22 08:12:56 ERROR 404: Not Found.
     [exec] 2017-10-22 08:12:57 URL:http://struts.apache.org/plugins/bean-validation/ [28145/28145] -> "<https://builds.apache.org/job/Struts-master-JDK7/ws/assembly/target/docs/plugins/bean-validation.html"> [1]
     [exec] 2017-10-22 08:12:57 URL:http://struts.apache.org/plugins/cdi/ [40844/40844] -> "<https://builds.apache.org/job/Struts-master-JDK7/ws/assembly/target/docs/plugins/cdi.html"> [1]
     [exec] 2017-10-22 08:12:57 URL:http://struts.apache.org/plugins/codebehind/ [14976/14976] -> "<https://builds.apache.org/job/Struts-master-JDK7/ws/assembly/target/docs/plugins/codebehind.html"> [1]
     [exec] 2017-10-22 08:12:57 URL:http://struts.apache.org/plugins/config-browser/ [9351/9351] -> "<https://builds.apache.org/job/Struts-master-JDK7/ws/assembly/target/docs/plugins/config-browser.html"> [1]
     [exec] 2017-10-22 08:12:57 URL:http://struts.apache.org/plugins/convention/ [80174/80174] -> "<https://builds.apache.org/job/Struts-master-JDK7/ws/assembly/target/docs/plugins/convention.html"> [1]
     [exec] 2017-10-22 08:12:57 URL:http://struts.apache.org/plugins/dwr/ [9572/9572] -> "<https://builds.apache.org/job/Struts-master-JDK7/ws/assembly/target/docs/plugins/dwr.html"> [1]
     [exec] 2017-10-22 08:12:58 URL:http://struts.apache.org/plugins/embedded-jsp/ [11957/11957] -> "<https://builds.apache.org/job/Struts-master-JDK7/ws/assembly/target/docs/plugins/embedded-jsp.html"> [1]
     [exec] 2017-10-22 08:12:58 URL:http://struts.apache.org/plugins/jasperreports/ [13230/13230] -> "<https://builds.apache.org/job/Struts-master-JDK7/ws/assembly/target/docs/plugins/jasperreports.html"> [1]
     [exec] 2017-10-22 08:12:58 URL:http://struts.apache.org/plugins/java-8-support/ [9937/9937] -> "<https://builds.apache.org/job/Struts-master-JDK7/ws/assembly/target/docs/plugins/java-8-support.html"> [1]
     [exec] 2017-10-22 08:12:58 URL:http://struts.apache.org/plugins/javatemplates/ [9724/9724] -> "<https://builds.apache.org/job/Struts-master-JDK7/ws/assembly/target/docs/plugins/javatemplates.html"> [1]
     [exec] 2017-10-22 08:12:58 URL:http://struts.apache.org/plugins/jfreechart/ [15812/15812] -> "<https://builds.apache.org/job/Struts-master-JDK7/ws/assembly/target/docs/plugins/jfreechart.html"> [1]
     [exec] 2017-10-22 08:12:58 URL:http://struts.apache.org/plugins/jsf/ [14912/14912] -> "<https://builds.apache.org/job/Struts-master-JDK7/ws/assembly/target/docs/plugins/jsf.html"> [1]
     [exec] 2017-10-22 08:12:59 URL:http://struts.apache.org/plugins/json/ [59395/59395] -> "<https://builds.apache.org/job/Struts-master-JDK7/ws/assembly/target/docs/plugins/json.html"> [1]
     [exec] 2017-10-22 08:12:59 URL:http://struts.apache.org/plugins/junit/ [21505/21505] -> "<https://builds.apache.org/job/Struts-master-JDK7/ws/assembly/target/docs/plugins/junit.html"> [1]
     [exec] 2017-10-22 08:12:59 URL:http://struts.apache.org/plugins/oval/ [22999/22999] -> "<https://builds.apache.org/job/Struts-master-JDK7/ws/assembly/target/docs/plugins/oval.html"> [1]
     [exec] 2017-10-22 08:12:59 URL:http://struts.apache.org/plugins/osgi/ [30855/30855] -> "<https://builds.apache.org/job/Struts-master-JDK7/ws/assembly/target/docs/plugins/osgi.html"> [1]
     [exec] 2017-10-22 08:12:59 URL:http://struts.apache.org/plugins/plexus/ [10515/10515] -> "<https://builds.apache.org/job/Struts-master-JDK7/ws/assembly/target/docs/plugins/plexus.html"> [1]
     [exec] 2017-10-22 08:13:00 URL:http://struts.apache.org/plugins/portlet/ [20812/20812] -> "<https://builds.apache.org/job/Struts-master-JDK7/ws/assembly/target/docs/plugins/portlet.html"> [1]
     [exec] 2017-10-22 08:13:00 URL:http://struts.apache.org/plugins/portlet-tiles/ [11382/11382] -> "<https://builds.apache.org/job/Struts-master-JDK7/ws/assembly/target/docs/plugins/portlet-tiles.html"> [1]
     [exec] 2017-10-22 08:13:00 URL:http://struts.apache.org/plugins/rest/ [36941/36941] -> "<https://builds.apache.org/job/Struts-master-JDK7/ws/assembly/target/docs/plugins/rest.html"> [1]
     [exec] 2017-10-22 08:13:00 URL:http://struts.apache.org/plugins/sitegraph/ [15104/15104] -> "<https://builds.apache.org/job/Struts-master-JDK7/ws/assembly/target/docs/plugins/sitegraph.html"> [1]
     [exec] 2017-10-22 08:13:00 URL:http://struts.apache.org/plugins/sitemesh/ [26943/26943] -> "<https://builds.apache.org/job/Struts-master-JDK7/ws/assembly/target/docs/plugins/sitemesh.html"> [1]
     [exec] 2017-10-22 08:13:00 URL:http://struts.apache.org/plugins/spring/ [24998/24998] -> "<https://builds.apache.org/job/Struts-master-JDK7/ws/assembly/target/docs/plugins/spring.html"> [1]
     [exec] 2017-10-22 08:13:01 URL:http://struts.apache.org/plugins/struts-1/ [22812/22812] -> "<https://builds.apache.org/job/Struts-master-JDK7/ws/assembly/target/docs/plugins/struts-1.html"> [1]
     [exec] 2017-10-22 08:13:01 URL:http://struts.apache.org/plugins/testng/ [10314/10314] -> "<https://builds.apache.org/job/Struts-master-JDK7/ws/assembly/target/docs/plugins/testng.html"> [1]
     [exec] 2017-10-22 08:13:01 URL:http://struts.apache.org/plugins/tiles/ [19113/19113] -> "<https://builds.apache.org/job/Struts-master-JDK7/ws/assembly/target/docs/plugins/tiles.html"> [1]
     [exec] 2017-10-22 08:13:01 URL:http://struts.apache.org/plugins/tiles-3/ [11765/11765] -> "<https://builds.apache.org/job/Struts-master-JDK7/ws/assembly/target/docs/plugins/tiles-3.html"> [1]
     [exec] 2017-10-22 08:13:01 URL:http://struts.apache.org/plugins/index.html [10135/10135] -> "<https://builds.apache.org/job/Struts-master-JDK7/ws/assembly/target/docs/plugins/index.html"> [1]
     [exec] 2017-10-22 08:13:01 URL:http://struts.apache.org/plugins/plugin-developers.html [10654/10654] -> "<https://builds.apache.org/job/Struts-master-JDK7/ws/assembly/target/docs/plugins/plugin-developers.html"> [1]
     [exec] http://struts.apache.org/plugins/architects-guide.html:
     [exec] 2017-10-22 08:13:01 ERROR 404: Not Found.
     [exec] FINISHED --2017-10-22 08:13:01--
     [exec] Total wall clock time: 34s
     [exec] Downloaded: 340 files, 6.0M in 0.5s (13.2 MB/s)
     [exec] Result: 8
[INFO] Executed tasks
[INFO]
[INFO] >>> maven-source-plugin:3.0.0:jar (attach-sources) > generate-sources @ struts2-assembly >>>
[INFO]
[INFO] <<< maven-source-plugin:3.0.0:jar (attach-sources) < generate-sources @ struts2-assembly <<<
[INFO]
[INFO]
[INFO] --- maven-source-plugin:3.0.0:jar (attach-sources) @ struts2-assembly ---
[INFO]
[INFO] --- maven-site-plugin:3.5.1:attach-descriptor (attach-descriptor) @ struts2-assembly ---
[INFO]
[INFO] --- dependency-maven-plugin:1.0:copy (copy-war) @ struts2-assembly ---
[INFO] Configured Artifact: org.apache.struts:struts2-showcase:null:2.5.14-SNAPSHOT:war
[INFO] Configured Artifact: org.apache.struts:struts2-rest-showcase:null:2.5.14-SNAPSHOT:war
[INFO] Copying <https://builds.apache.org/job/Struts-master-JDK7/ws/apps/showcase/target/struts2-showcase.war> to <https://builds.apache.org/job/Struts-master-JDK7/ws/assembly/target/apps/struts2-showcase.war>
[INFO] Copying <https://builds.apache.org/job/Struts-master-JDK7/ws/apps/rest-showcase/target/struts2-rest-showcase.war> to <https://builds.apache.org/job/Struts-master-JDK7/ws/assembly/target/apps/struts2-rest-showcase.war>
[INFO]
[INFO] --- maven-assembly-plugin:2.6:attached (make-assembly) @ struts2-assembly ---
[INFO] Reading assembly descriptor: src/main/assembly/all.xml
[INFO] Reading assembly descriptor: src/main/assembly/lib.xml
[INFO] Reading assembly descriptor: src/main/assembly/min-lib.xml
[INFO] Reading assembly descriptor: src/main/assembly/apps.xml
[INFO] Reading assembly descriptor: src/main/assembly/src.xml
[INFO] Reading assembly descriptor: src/main/assembly/docs.xml
[INFO] Building zip: <https://builds.apache.org/job/Struts-master-JDK7/ws/assembly/target/assembly/out/struts-2.5.14-SNAPSHOT-all.zip>
[INFO] Building zip: <https://builds.apache.org/job/Struts-master-JDK7/ws/assembly/target/assembly/out/struts-2.5.14-SNAPSHOT-lib.zip>
[INFO] Building zip: <https://builds.apache.org/job/Struts-master-JDK7/ws/assembly/target/assembly/out/struts-2.5.14-SNAPSHOT-min-lib.zip>
[INFO] Building zip: <https://builds.apache.org/job/Struts-master-JDK7/ws/assembly/target/assembly/out/struts-2.5.14-SNAPSHOT-apps.zip>
[INFO] Building zip: <https://builds.apache.org/job/Struts-master-JDK7/ws/assembly/target/assembly/out/struts-2.5.14-SNAPSHOT-src.zip>
[INFO] Building zip: <https://builds.apache.org/job/Struts-master-JDK7/ws/assembly/target/assembly/out/struts-2.5.14-SNAPSHOT-docs.zip>
[INFO]
[INFO] --- apache-rat-plugin:0.11:check (default) @ struts2-assembly ---
[INFO] 51 implicit excludes (use -debug for more details).
[INFO] Exclude: src/main/resources/org/apache/struts2/static/domTT.js
[INFO] Exclude: src/site/resources/tags/**/*.html
[INFO] Exclude: src/main/resources/*LICENSE.txt
[INFO] Exclude: src/test/resources/**/*.txt
[INFO] Exclude: src/main/webapp/**/*.css
[INFO] Exclude: src/main/webapp/**/*.map
[INFO] Exclude: src/main/webapp/**/*.js
[INFO] Exclude: src/main/webapp/**/*.svg
[INFO] Exclude: src/main/webapp/**/*.txt
[INFO] Exclude: src/main/resources/**/sitegraph-usage.txt
[INFO] Exclude: src/main/resources/static/css/**/*.css
[INFO] Exclude: src/main/resources/static/js/**/*.js
[INFO] Exclude: src/main/resources/docs.cfg
[INFO] Exclude: src/main/webapp/fonts/**/*
[INFO] 11 resources included (use -debug for more details)
[INFO] Rat check: Summary of files. Unapproved: 1 unknown: 1 generated: 0 approved: 9 licence.
[INFO] ------------------------------------------------------------------------
[INFO] Reactor Summary:
[INFO]
[INFO] Struts 2 Bill of Materials ......................... SUCCESS [  8.338 s]
[INFO] Struts 2 ........................................... SUCCESS [  9.503 s]
[INFO] Struts 2 Core ...................................... SUCCESS [04:22 min]
[INFO] Struts Plugins ..................................... SUCCESS [  2.143 s]
[INFO] Struts 2 Configuration Browser Plugin .............. SUCCESS [  6.235 s]
[INFO] Struts 2 Sitemesh Plugin ........................... SUCCESS [  6.052 s]
[INFO] Struts 2 Tiles Plugin .............................. SUCCESS [  8.817 s]
[INFO] Struts 2 DWR Plugin ................................ SUCCESS [  4.789 s]
[INFO] Struts 2 Spring Plugin ............................. SUCCESS [  8.110 s]
[INFO] Struts 2 Convention Plugin ......................... SUCCESS [ 14.371 s]
[INFO] Struts 2 JUnit Plugin .............................. SUCCESS [ 11.848 s]
[INFO] Struts 2 JSON Plugin ............................... SUCCESS [ 13.149 s]
[INFO] Struts 2 Bean Validation Plugin .................... SUCCESS [  7.720 s]
[INFO] Struts 2 Webapps ................................... SUCCESS [  2.570 s]
[INFO] Struts 2 Showcase Webapp ........................... SUCCESS [ 23.824 s]
[INFO] Struts 2 REST Plugin ............................... SUCCESS [ 10.254 s]
[INFO] Struts 2 Rest Showcase Webapp ...................... SUCCESS [  8.705 s]
[INFO] Struts 2 CDI Plugin ................................ SUCCESS [  6.913 s]
[INFO] Struts 2 Embedded JSP Plugin ....................... SUCCESS [ 21.882 s]
[INFO] Struts 2 GXP Plugin ................................ SUCCESS [  5.565 s]
[INFO] Struts 2 Jasper Reports Plugin ..................... SUCCESS [  6.430 s]
[INFO] Struts 2 Java Templates Plugin ..................... SUCCESS [  8.426 s]
[INFO] Struts 2 JFreeChart Plugin ......................... SUCCESS [ 11.110 s]
[INFO] Struts 2 OSGi Plugin ............................... SUCCESS [  7.414 s]
[INFO] Struts 2 OVal Plugin ............................... SUCCESS [  8.569 s]
[INFO] Struts 2 Pell Multipart Plugin ..................... SUCCESS [  4.773 s]
[INFO] Struts 2 Plexus Plugin ............................. SUCCESS [  5.054 s]
[INFO] Struts 2 Portlet Plugin ............................ SUCCESS [ 16.168 s]
[INFO] Struts 2 Portlet Tiles Plugin ...................... SUCCESS [  5.925 s]
[INFO] DEPRECATED: Struts 2 Sitegraph Plugin .............. SUCCESS [  8.865 s]
[INFO] Struts 2 TestNG Plugin ............................. SUCCESS [  9.919 s]
[INFO] Struts OSGi Bundles ................................ SUCCESS [  0.877 s]
[INFO] Struts 2 OSGi Admin Bundle ......................... SUCCESS [  6.545 s]
[INFO] Struts 2 OSGi Demo Bundle .......................... SUCCESS [  4.538 s]
[INFO] Struts 2 Assembly .................................. FAILURE [ 54.955 s]
[INFO] ------------------------------------------------------------------------
[INFO] BUILD FAILURE
[INFO] ------------------------------------------------------------------------
[INFO] Total time: 10:07 min
[INFO] Finished at: 2017-10-22T08:13:21Z
[INFO] Final Memory: 86M/1298M
[INFO] ------------------------------------------------------------------------
[ERROR] Failed to execute goal org.apache.rat:apache-rat-plugin:0.11:check (default) on project struts2-assembly: Too many files with unapproved license: 1 See RAT report in: <https://builds.apache.org/job/Struts-master-JDK7/ws/assembly/target/rat.txt> -> [Help 1]
[ERROR]
[ERROR] To see the full stack trace of the errors, re-run Maven with the -e switch.
[ERROR] Re-run Maven using the -X switch to enable full debug logging.
[ERROR]
[ERROR] For more information about the errors and possible solutions, please read the following articles:
[ERROR] [Help 1] http://cwiki.apache.org/confluence/display/MAVEN/MojoFailureException
[ERROR]
[ERROR] After correcting the problems, you can resume the build with the command
[ERROR]   mvn <goals> -rf :struts2-assembly
Build step 'Execute shell' marked build as failure
[locks-and-latches] Releasing all the locks
[locks-and-latches] All the locks released
Setting MAVEN_3_LATEST__HOME=/home/jenkins/tools/maven/latest3/

---------------------------------------------------------------------
To unsubscribe, e-mail: [hidden email]
For additional commands, e-mail: [hidden email]

Reply | Threaded
Open this post in threaded view
|

Build failed in Jenkins: Struts-master-JDK7 #39

Apache Jenkins Server-2
See <https://builds.apache.org/job/Struts-master-JDK7/39/display/redirect?page=changes>

Changes:

[Lukasz Lenart] Uses new docs location when preparing packages

------------------------------------------
[...truncated 4.10 MB...]
     [exec] 2017-10-22 08:33:28 URL:http://struts.apache.org/tag-developers/form-tags.html [23707/23707] -> "<https://builds.apache.org/job/Struts-master-JDK7/ws/assembly/target/docs/tag-developers/form-tags.html"> [1]
     [exec] 2017-10-22 08:33:28 URL:http://struts.apache.org/tag-developers/template-loading.html [12810/12810] -> "<https://builds.apache.org/job/Struts-master-JDK7/ws/assembly/target/docs/tag-developers/template-loading.html"> [1]
     [exec] 2017-10-22 08:33:28 URL:http://struts.apache.org/tag-developers/selecting-template-directory.html [8920/8920] -> "<https://builds.apache.org/job/Struts-master-JDK7/ws/assembly/target/docs/tag-developers/selecting-template-directory.html"> [1]
     [exec] 2017-10-22 08:33:28 URL:http://struts.apache.org/tag-developers/selecting-themes.html [9377/9377] -> "<https://builds.apache.org/job/Struts-master-JDK7/ws/assembly/target/docs/tag-developers/selecting-themes.html"> [1]
     [exec] 2017-10-22 08:33:28 URL:http://struts.apache.org/tag-developers/extending-themes.html [14299/14299] -> "<https://builds.apache.org/job/Struts-master-JDK7/ws/assembly/target/docs/tag-developers/extending-themes.html"> [1]
     [exec] 2017-10-22 08:33:28 URL:http://struts.apache.org/tag-developers/simple-theme.html [10604/10604] -> "<https://builds.apache.org/job/Struts-master-JDK7/ws/assembly/target/docs/tag-developers/simple-theme.html"> [1]
     [exec] 2017-10-22 08:33:28 URL:http://struts.apache.org/tag-developers/xhtml-theme.html [33779/33779] -> "<https://builds.apache.org/job/Struts-master-JDK7/ws/assembly/target/docs/tag-developers/xhtml-theme.html"> [1]
     [exec] 2017-10-22 08:33:28 URL:http://struts.apache.org/tag-developers/css-xhtml-theme.html [23235/23235] -> "<https://builds.apache.org/job/Struts-master-JDK7/ws/assembly/target/docs/tag-developers/css-xhtml-theme.html"> [1]
     [exec] 2017-10-22 08:33:28 URL:http://struts.apache.org/tag-developers/ajax-theme.html [12101/12101] -> "<https://builds.apache.org/job/Struts-master-JDK7/ws/assembly/target/docs/tag-developers/ajax-theme.html"> [1]
     [exec] 2017-10-22 08:33:28 URL:http://struts.apache.org/tag-developers/if-tag.html [10100/10100] -> "<https://builds.apache.org/job/Struts-master-JDK7/ws/assembly/target/docs/tag-developers/if-tag.html"> [1]
     [exec] 2017-10-22 08:33:29 URL:http://struts.apache.org/tag-developers/a-tag.html [32630/32630] -> "<https://builds.apache.org/job/Struts-master-JDK7/ws/assembly/target/docs/tag-developers/a-tag.html"> [1]
     [exec] 2017-10-22 08:33:29 URL:http://struts.apache.org/tag-developers/elseif-tag.html [10083/10083] -> "<https://builds.apache.org/job/Struts-master-JDK7/ws/assembly/target/docs/tag-developers/elseif-tag.html"> [1]
     [exec] 2017-10-22 08:33:29 URL:http://struts.apache.org/tag-developers/action-tag.html [16539/16539] -> "<https://builds.apache.org/job/Struts-master-JDK7/ws/assembly/target/docs/tag-developers/action-tag.html"> [1]
     [exec] 2017-10-22 08:33:29 URL:http://struts.apache.org/tag-developers/else-tag.html [9710/9710] -> "<https://builds.apache.org/job/Struts-master-JDK7/ws/assembly/target/docs/tag-developers/else-tag.html"> [1]
     [exec] 2017-10-22 08:33:29 URL:http://struts.apache.org/tag-developers/bean-tag.html [11924/11924] -> "<https://builds.apache.org/job/Struts-master-JDK7/ws/assembly/target/docs/tag-developers/bean-tag.html"> [1]
     [exec] 2017-10-22 08:33:29 URL:http://struts.apache.org/tag-developers/append-tag.html [14581/14581] -> "<https://builds.apache.org/job/Struts-master-JDK7/ws/assembly/target/docs/tag-developers/append-tag.html"> [1]
     [exec] 2017-10-22 08:33:29 URL:http://struts.apache.org/tag-developers/date-tag.html [13493/13493] -> "<https://builds.apache.org/job/Struts-master-JDK7/ws/assembly/target/docs/tag-developers/date-tag.html"> [1]
     [exec] 2017-10-22 08:33:29 URL:http://struts.apache.org/tag-developers/generator-tag.html [13936/13936] -> "<https://builds.apache.org/job/Struts-master-JDK7/ws/assembly/target/docs/tag-developers/generator-tag.html"> [1]
     [exec] 2017-10-22 08:33:29 URL:http://struts.apache.org/tag-developers/debug-tag.html [7977/7977] -> "<https://builds.apache.org/job/Struts-master-JDK7/ws/assembly/target/docs/tag-developers/debug-tag.html"> [1]
     [exec] 2017-10-22 08:33:29 URL:http://struts.apache.org/tag-developers/iterator-tag.html [20457/20457] -> "<https://builds.apache.org/job/Struts-master-JDK7/ws/assembly/target/docs/tag-developers/iterator-tag.html"> [1]
     [exec] 2017-10-22 08:33:29 URL:http://struts.apache.org/tag-developers/i18n-tag.html [9800/9800] -> "<https://builds.apache.org/job/Struts-master-JDK7/ws/assembly/target/docs/tag-developers/i18n-tag.html"> [1]
     [exec] 2017-10-22 08:33:29 URL:http://struts.apache.org/tag-developers/merge-tag.html [14891/14891] -> "<https://builds.apache.org/job/Struts-master-JDK7/ws/assembly/target/docs/tag-developers/merge-tag.html"> [1]
     [exec] 2017-10-22 08:33:30 URL:http://struts.apache.org/tag-developers/include-tag.html [10364/10364] -> "<https://builds.apache.org/job/Struts-master-JDK7/ws/assembly/target/docs/tag-developers/include-tag.html"> [1]
     [exec] 2017-10-22 08:33:30 URL:http://struts.apache.org/tag-developers/sort-tag.html [11334/11334] -> "<https://builds.apache.org/job/Struts-master-JDK7/ws/assembly/target/docs/tag-developers/sort-tag.html"> [1]
     [exec] 2017-10-22 08:33:30 URL:http://struts.apache.org/tag-developers/param-tag.html [13374/13374] -> "<https://builds.apache.org/job/Struts-master-JDK7/ws/assembly/target/docs/tag-developers/param-tag.html"> [1]
     [exec] 2017-10-22 08:33:30 URL:http://struts.apache.org/tag-developers/subset-tag.html [17689/17689] -> "<https://builds.apache.org/job/Struts-master-JDK7/ws/assembly/target/docs/tag-developers/subset-tag.html"> [1]
     [exec] 2017-10-22 08:33:30 URL:http://struts.apache.org/tag-developers/property-tag.html [11935/11935] -> "<https://builds.apache.org/job/Struts-master-JDK7/ws/assembly/target/docs/tag-developers/property-tag.html"> [1]
     [exec] 2017-10-22 08:33:30 URL:http://struts.apache.org/tag-developers/push-tag.html [13039/13039] -> "<https://builds.apache.org/job/Struts-master-JDK7/ws/assembly/target/docs/tag-developers/push-tag.html"> [1]
     [exec] 2017-10-22 08:33:30 URL:http://struts.apache.org/tag-developers/set-tag.html [11934/11934] -> "<https://builds.apache.org/job/Struts-master-JDK7/ws/assembly/target/docs/tag-developers/set-tag.html"> [1]
     [exec] 2017-10-22 08:33:30 URL:http://struts.apache.org/tag-developers/text-tag.html [13214/13214] -> "<https://builds.apache.org/job/Struts-master-JDK7/ws/assembly/target/docs/tag-developers/text-tag.html"> [1]
     [exec] 2017-10-22 08:33:30 URL:http://struts.apache.org/tag-developers/url-tag.html [16086/16086] -> "<https://builds.apache.org/job/Struts-master-JDK7/ws/assembly/target/docs/tag-developers/url-tag.html"> [1]
     [exec] 2017-10-22 08:33:30 URL:http://struts.apache.org/tag-developers/checkbox-tag.html [25263/25263] -> "<https://builds.apache.org/job/Struts-master-JDK7/ws/assembly/target/docs/tag-developers/checkbox-tag.html"> [1]
     [exec] 2017-10-22 08:33:30 URL:http://struts.apache.org/tag-developers/actionerror-tag.html [24591/24591] -> "<https://builds.apache.org/job/Struts-master-JDK7/ws/assembly/target/docs/tag-developers/actionerror-tag.html"> [1]
     [exec] 2017-10-22 08:33:30 URL:http://struts.apache.org/tag-developers/checkboxlist-tag.html [27519/27519] -> "<https://builds.apache.org/job/Struts-master-JDK7/ws/assembly/target/docs/tag-developers/checkboxlist-tag.html"> [1]
     [exec] 2017-10-22 08:33:31 URL:http://struts.apache.org/tag-developers/actionmessage-tag.html [24590/24590] -> "<https://builds.apache.org/job/Struts-master-JDK7/ws/assembly/target/docs/tag-developers/actionmessage-tag.html"> [1]
     [exec] 2017-10-22 08:33:31 URL:http://struts.apache.org/tag-developers/combobox-tag.html [29411/29411] -> "<https://builds.apache.org/job/Struts-master-JDK7/ws/assembly/target/docs/tag-developers/combobox-tag.html"> [1]
     [exec] 2017-10-22 08:33:31 URL:http://struts.apache.org/tag-developers/component-tag.html [28051/28051] -> "<https://builds.apache.org/job/Struts-master-JDK7/ws/assembly/target/docs/tag-developers/component-tag.html"> [1]
     [exec] 2017-10-22 08:33:31 URL:http://struts.apache.org/tag-developers/datetextfield-tag.html [24693/24693] -> "<https://builds.apache.org/job/Struts-master-JDK7/ws/assembly/target/docs/tag-developers/datetextfield-tag.html"> [1]
     [exec] 2017-10-22 08:33:31 URL:http://struts.apache.org/tag-developers/div-tag.html [24477/24477] -> "<https://builds.apache.org/job/Struts-master-JDK7/ws/assembly/target/docs/tag-developers/div-tag.html"> [1]
     [exec] 2017-10-22 08:33:31 URL:http://struts.apache.org/tag-developers/doubleselect-tag.html [41719/41719] -> "<https://builds.apache.org/job/Struts-master-JDK7/ws/assembly/target/docs/tag-developers/doubleselect-tag.html"> [1]
     [exec] 2017-10-22 08:33:31 URL:http://struts.apache.org/tag-developers/fielderror-tag.html [26066/26066] -> "<https://builds.apache.org/job/Struts-master-JDK7/ws/assembly/target/docs/tag-developers/fielderror-tag.html"> [1]
     [exec] 2017-10-22 08:33:31 URL:http://struts.apache.org/tag-developers/head-tag.html [24280/24280] -> "<https://builds.apache.org/job/Struts-master-JDK7/ws/assembly/target/docs/tag-developers/head-tag.html"> [1]
     [exec] 2017-10-22 08:33:31 URL:http://struts.apache.org/tag-developers/file-tag.html [25097/25097] -> "<https://builds.apache.org/job/Struts-master-JDK7/ws/assembly/target/docs/tag-developers/file-tag.html"> [1]
     [exec] 2017-10-22 08:33:31 URL:http://struts.apache.org/tag-developers/form-tag.html [30292/30292] -> "<https://builds.apache.org/job/Struts-master-JDK7/ws/assembly/target/docs/tag-developers/form-tag.html"> [1]
     [exec] 2017-10-22 08:33:31 URL:http://struts.apache.org/tag-developers/hidden-tag.html [25325/25325] -> "<https://builds.apache.org/job/Struts-master-JDK7/ws/assembly/target/docs/tag-developers/hidden-tag.html"> [1]
     [exec] 2017-10-22 08:33:32 URL:http://struts.apache.org/tag-developers/inputtransferselect-tag.html [32533/32533] -> "<https://builds.apache.org/job/Struts-master-JDK7/ws/assembly/target/docs/tag-developers/inputtransferselect-tag.html"> [1]
     [exec] 2017-10-22 08:33:32 URL:http://struts.apache.org/tag-developers/label-tag.html [24930/24930] -> "<https://builds.apache.org/job/Struts-master-JDK7/ws/assembly/target/docs/tag-developers/label-tag.html"> [1]
     [exec] 2017-10-22 08:33:32 URL:http://struts.apache.org/tag-developers/optiontransferselect-tag.html [51201/51201] -> "<https://builds.apache.org/job/Struts-master-JDK7/ws/assembly/target/docs/tag-developers/optiontransferselect-tag.html"> [1]
     [exec] 2017-10-22 08:33:32 URL:http://struts.apache.org/tag-developers/optgroup-tag.html [11618/11618] -> "<https://builds.apache.org/job/Struts-master-JDK7/ws/assembly/target/docs/tag-developers/optgroup-tag.html"> [1]
     [exec] 2017-10-22 08:33:32 URL:http://struts.apache.org/tag-developers/password-tag.html [26597/26597] -> "<https://builds.apache.org/job/Struts-master-JDK7/ws/assembly/target/docs/tag-developers/password-tag.html"> [1]
     [exec] 2017-10-22 08:33:32 URL:http://struts.apache.org/tag-developers/radio-tag.html [28401/28401] -> "<https://builds.apache.org/job/Struts-master-JDK7/ws/assembly/target/docs/tag-developers/radio-tag.html"> [1]
     [exec] 2017-10-22 08:33:32 URL:http://struts.apache.org/tag-developers/reset-tag.html [26859/26859] -> "<https://builds.apache.org/job/Struts-master-JDK7/ws/assembly/target/docs/tag-developers/reset-tag.html"> [1]
     [exec] 2017-10-22 08:33:32 URL:http://struts.apache.org/tag-developers/select-tag.html [31001/31001] -> "<https://builds.apache.org/job/Struts-master-JDK7/ws/assembly/target/docs/tag-developers/select-tag.html"> [1]
     [exec] 2017-10-22 08:33:32 URL:http://struts.apache.org/tag-developers/submit-tag.html [27256/27256] -> "<https://builds.apache.org/job/Struts-master-JDK7/ws/assembly/target/docs/tag-developers/submit-tag.html"> [1]
     [exec] 2017-10-22 08:33:32 URL:http://struts.apache.org/tag-developers/textarea-tag.html [25611/25611] -> "<https://builds.apache.org/job/Struts-master-JDK7/ws/assembly/target/docs/tag-developers/textarea-tag.html"> [1]
     [exec] 2017-10-22 08:33:32 URL:http://struts.apache.org/tag-developers/textfield-tag.html [26032/26032] -> "<https://builds.apache.org/job/Struts-master-JDK7/ws/assembly/target/docs/tag-developers/textfield-tag.html"> [1]
     [exec] 2017-10-22 08:33:32 URL:http://struts.apache.org/tag-developers/token-tag.html [24345/24345] -> "<https://builds.apache.org/job/Struts-master-JDK7/ws/assembly/target/docs/tag-developers/token-tag.html"> [1]
     [exec] 2017-10-22 08:33:33 URL:http://struts.apache.org/tag-developers/updownselect-tag.html [33059/33059] -> "<https://builds.apache.org/job/Struts-master-JDK7/ws/assembly/target/docs/tag-developers/updownselect-tag.html"> [1]
     [exec] 2017-10-22 08:33:33 URL:http://struts.apache.org/tag-developers/ui-tag-reference.html [10591/10591] -> "<https://builds.apache.org/job/Struts-master-JDK7/ws/assembly/target/docs/tag-developers/ui-tag-reference.html"> [1]
     [exec] http://struts.apache.org/tag-developers/dojo-href-tag.html:
     [exec] 2017-10-22 08:33:33 ERROR 404: Not Found.
     [exec] 2017-10-22 08:33:33 URL:http://struts.apache.org/tag-developers/dojo-autocompleter-tag.html [41761/41761] -> "<https://builds.apache.org/job/Struts-master-JDK7/ws/assembly/target/docs/tag-developers/dojo-autocompleter-tag.html"> [1]
     [exec] 2017-10-22 08:33:33 URL:http://struts.apache.org/tag-developers/dojo-bind-tag.html [25441/25441] -> "<https://builds.apache.org/job/Struts-master-JDK7/ws/assembly/target/docs/tag-developers/dojo-bind-tag.html"> [1]
     [exec] 2017-10-22 08:33:33 URL:http://struts.apache.org/tag-developers/dojo-datetimepicker-tag.html [32471/32471] -> "<https://builds.apache.org/job/Struts-master-JDK7/ws/assembly/target/docs/tag-developers/dojo-datetimepicker-tag.html"> [1]
     [exec] 2017-10-22 08:33:33 URL:http://struts.apache.org/tag-developers/dojo-div-tag.html [37164/37164] -> "<https://builds.apache.org/job/Struts-master-JDK7/ws/assembly/target/docs/tag-developers/dojo-div-tag.html"> [1]
     [exec] 2017-10-22 08:33:33 URL:http://struts.apache.org/tag-developers/dojo-head-tag.html [15783/15783] -> "<https://builds.apache.org/job/Struts-master-JDK7/ws/assembly/target/docs/tag-developers/dojo-head-tag.html"> [1]
     [exec] 2017-10-22 08:33:33 URL:http://struts.apache.org/tag-developers/dojo-submit-tag.html [40428/40428] -> "<https://builds.apache.org/job/Struts-master-JDK7/ws/assembly/target/docs/tag-developers/dojo-submit-tag.html"> [1]
     [exec] 2017-10-22 08:33:33 URL:http://struts.apache.org/tag-developers/dojo-tabbedpanel-tag.html [35876/35876] -> "<https://builds.apache.org/job/Struts-master-JDK7/ws/assembly/target/docs/tag-developers/dojo-tabbedpanel-tag.html"> [1]
     [exec] 2017-10-22 08:33:34 URL:http://struts.apache.org/tag-developers/dojo-textarea-tag.html [24637/24637] -> "<https://builds.apache.org/job/Struts-master-JDK7/ws/assembly/target/docs/tag-developers/dojo-textarea-tag.html"> [1]
     [exec] 2017-10-22 08:33:34 URL:http://struts.apache.org/tag-developers/dojo-tree-tag.html [37392/37392] -> "<https://builds.apache.org/job/Struts-master-JDK7/ws/assembly/target/docs/tag-developers/dojo-tree-tag.html"> [1]
     [exec] 2017-10-22 08:33:34 URL:http://struts.apache.org/tag-developers/dojo-treenode-tag.html [26527/26527] -> "<https://builds.apache.org/job/Struts-master-JDK7/ws/assembly/target/docs/tag-developers/dojo-treenode-tag.html"> [1]
     [exec] 2017-10-22 08:33:34 URL:http://struts.apache.org/tag-developers/access-to-valuestack-from-jsps.html [16373/16373] -> "<https://builds.apache.org/job/Struts-master-JDK7/ws/assembly/target/docs/tag-developers/access-to-valuestack-from-jsps.html"> [1]
     [exec] http://struts.apache.org/tag-developers/tags.html:
     [exec] 2017-10-22 08:33:34 ERROR 404: Not Found.
     [exec] http://struts.apache.org/tag-developers/ogn.html:
     [exec] 2017-10-22 08:33:34 ERROR 404: Not Found.
     [exec] http://struts.apache.org/tag-developers/css-xhtml-theme.xhtml:
     [exec] 2017-10-22 08:33:34 ERROR 404: Not Found.
     [exec] http://struts.apache.org/tag-developers/form-tag.htmk:
     [exec] 2017-10-22 08:33:34 ERROR 404: Not Found.
     [exec] 2017-10-22 08:33:34 URL:http://struts.apache.org/tag-developers/dojo-a-tag.html [37911/37911] -> "<https://builds.apache.org/job/Struts-master-JDK7/ws/assembly/target/docs/tag-developers/dojo-a-tag.html"> [1]
     [exec] 2017-10-22 08:33:34 URL:http://struts.apache.org/tag-developers/ajax-head-template.html [18587/18587] -> "<https://builds.apache.org/job/Struts-master-JDK7/ws/assembly/target/docs/tag-developers/ajax-head-template.html"> [1]
     [exec] 2017-10-22 08:33:35 URL:http://struts.apache.org/tag-developers/ajax-div-template.html [19743/19743] -> "<https://builds.apache.org/job/Struts-master-JDK7/ws/assembly/target/docs/tag-developers/ajax-div-template.html"> [1]
     [exec] 2017-10-22 08:33:35 URL:http://struts.apache.org/tag-developers/ajax-a-template.html [9586/9586] -> "<https://builds.apache.org/job/Struts-master-JDK7/ws/assembly/target/docs/tag-developers/ajax-a-template.html"> [1]
     [exec] 2017-10-22 08:33:35 URL:http://struts.apache.org/tag-developers/ajax-event-system.html [10990/10990] -> "<https://builds.apache.org/job/Struts-master-JDK7/ws/assembly/target/docs/tag-developers/ajax-event-system.html"> [1]
     [exec] http://struts.apache.org/tag-developers/head-tag.htlm:
     [exec] 2017-10-22 08:33:35 ERROR 404: Not Found.
     [exec] http://struts.apache.org/tag-developers/autocompleter-tag.html:
     [exec] 2017-10-22 08:33:35 ERROR 404: Not Found.
     [exec] http://struts.apache.org/tag-developers/bind-tag.html:
     [exec] 2017-10-22 08:33:35 ERROR 404: Not Found.
     [exec] http://struts.apache.org/tag-developers/datetimepicker-tag.html:
     [exec] 2017-10-22 08:33:35 ERROR 404: Not Found.
     [exec] http://struts.apache.org/tag-developers/tabbed-tag.html:
     [exec] 2017-10-22 08:33:35 ERROR 404: Not Found.
     [exec] http://struts.apache.org/tag-developers/tree-tag.html:
     [exec] 2017-10-22 08:33:35 ERROR 404: Not Found.
     [exec] http://struts.apache.org/tag-developers/treenode-tag.html:
     [exec] 2017-10-22 08:33:35 ERROR 404: Not Found.
     [exec] 2017-10-22 08:33:35 URL:http://struts.apache.org/maven-archetypes/ [22310/22310] -> "<https://builds.apache.org/job/Struts-master-JDK7/ws/assembly/target/docs/maven-archetypes/index.html"> [1]
     [exec] 2017-10-22 08:33:35 URL:http://struts.apache.org/maven-archetypes/struts2-archetype-blank.html [23604/23604] -> "<https://builds.apache.org/job/Struts-master-JDK7/ws/assembly/target/docs/maven-archetypes/struts2-archetype-blank.html"> [1]
     [exec] 2017-10-22 08:33:36 URL:http://struts.apache.org/maven-archetypes/index.html [22310/22310] -> "<https://builds.apache.org/job/Struts-master-JDK7/ws/assembly/target/docs/maven-archetypes/index.html"> [1]
     [exec] 2017-10-22 08:33:36 URL:http://struts.apache.org/plugins/ [10135/10135] -> "<https://builds.apache.org/job/Struts-master-JDK7/ws/assembly/target/docs/plugins/index.html"> [1]
     [exec] 2017-10-22 08:33:36 URL:http://struts.apache.org/plugins/plugins.html [39614/39614] -> "<https://builds.apache.org/job/Struts-master-JDK7/ws/assembly/target/docs/plugins/plugins.html"> [1]
     [exec] http://struts.apache.org/plugins/extending-an-application-with-custom-plugins.html:
     [exec] 2017-10-22 08:33:36 ERROR 404: Not Found.
     [exec] 2017-10-22 08:33:36 URL:http://struts.apache.org/plugins/bean-validation/ [28145/28145] -> "<https://builds.apache.org/job/Struts-master-JDK7/ws/assembly/target/docs/plugins/bean-validation.html"> [1]
     [exec] 2017-10-22 08:33:36 URL:http://struts.apache.org/plugins/cdi/ [40844/40844] -> "<https://builds.apache.org/job/Struts-master-JDK7/ws/assembly/target/docs/plugins/cdi.html"> [1]
     [exec] 2017-10-22 08:33:36 URL:http://struts.apache.org/plugins/codebehind/ [14976/14976] -> "<https://builds.apache.org/job/Struts-master-JDK7/ws/assembly/target/docs/plugins/codebehind.html"> [1]
     [exec] 2017-10-22 08:33:37 URL:http://struts.apache.org/plugins/config-browser/ [9351/9351] -> "<https://builds.apache.org/job/Struts-master-JDK7/ws/assembly/target/docs/plugins/config-browser.html"> [1]
     [exec] 2017-10-22 08:33:37 URL:http://struts.apache.org/plugins/convention/ [80174/80174] -> "<https://builds.apache.org/job/Struts-master-JDK7/ws/assembly/target/docs/plugins/convention.html"> [1]
     [exec] 2017-10-22 08:33:37 URL:http://struts.apache.org/plugins/dwr/ [9572/9572] -> "<https://builds.apache.org/job/Struts-master-JDK7/ws/assembly/target/docs/plugins/dwr.html"> [1]
     [exec] 2017-10-22 08:33:37 URL:http://struts.apache.org/plugins/embedded-jsp/ [11957/11957] -> "<https://builds.apache.org/job/Struts-master-JDK7/ws/assembly/target/docs/plugins/embedded-jsp.html"> [1]
     [exec] 2017-10-22 08:33:37 URL:http://struts.apache.org/plugins/jasperreports/ [13230/13230] -> "<https://builds.apache.org/job/Struts-master-JDK7/ws/assembly/target/docs/plugins/jasperreports.html"> [1]
     [exec] 2017-10-22 08:33:37 URL:http://struts.apache.org/plugins/java-8-support/ [9937/9937] -> "<https://builds.apache.org/job/Struts-master-JDK7/ws/assembly/target/docs/plugins/java-8-support.html"> [1]
     [exec] 2017-10-22 08:33:38 URL:http://struts.apache.org/plugins/javatemplates/ [9724/9724] -> "<https://builds.apache.org/job/Struts-master-JDK7/ws/assembly/target/docs/plugins/javatemplates.html"> [1]
     [exec] 2017-10-22 08:33:38 URL:http://struts.apache.org/plugins/jfreechart/ [15812/15812] -> "<https://builds.apache.org/job/Struts-master-JDK7/ws/assembly/target/docs/plugins/jfreechart.html"> [1]
     [exec] 2017-10-22 08:33:38 URL:http://struts.apache.org/plugins/jsf/ [14912/14912] -> "<https://builds.apache.org/job/Struts-master-JDK7/ws/assembly/target/docs/plugins/jsf.html"> [1]
     [exec] 2017-10-22 08:33:38 URL:http://struts.apache.org/plugins/json/ [59395/59395] -> "<https://builds.apache.org/job/Struts-master-JDK7/ws/assembly/target/docs/plugins/json.html"> [1]
     [exec] 2017-10-22 08:33:38 URL:http://struts.apache.org/plugins/junit/ [21505/21505] -> "<https://builds.apache.org/job/Struts-master-JDK7/ws/assembly/target/docs/plugins/junit.html"> [1]
     [exec] 2017-10-22 08:33:38 URL:http://struts.apache.org/plugins/oval/ [22999/22999] -> "<https://builds.apache.org/job/Struts-master-JDK7/ws/assembly/target/docs/plugins/oval.html"> [1]
     [exec] 2017-10-22 08:33:39 URL:http://struts.apache.org/plugins/osgi/ [30855/30855] -> "<https://builds.apache.org/job/Struts-master-JDK7/ws/assembly/target/docs/plugins/osgi.html"> [1]
     [exec] 2017-10-22 08:33:39 URL:http://struts.apache.org/plugins/plexus/ [10515/10515] -> "<https://builds.apache.org/job/Struts-master-JDK7/ws/assembly/target/docs/plugins/plexus.html"> [1]
     [exec] 2017-10-22 08:33:39 URL:http://struts.apache.org/plugins/portlet/ [20812/20812] -> "<https://builds.apache.org/job/Struts-master-JDK7/ws/assembly/target/docs/plugins/portlet.html"> [1]
     [exec] 2017-10-22 08:33:39 URL:http://struts.apache.org/plugins/portlet-tiles/ [11382/11382] -> "<https://builds.apache.org/job/Struts-master-JDK7/ws/assembly/target/docs/plugins/portlet-tiles.html"> [1]
     [exec] 2017-10-22 08:33:39 URL:http://struts.apache.org/plugins/rest/ [36941/36941] -> "<https://builds.apache.org/job/Struts-master-JDK7/ws/assembly/target/docs/plugins/rest.html"> [1]
     [exec] 2017-10-22 08:33:40 URL:http://struts.apache.org/plugins/sitegraph/ [15104/15104] -> "<https://builds.apache.org/job/Struts-master-JDK7/ws/assembly/target/docs/plugins/sitegraph.html"> [1]
     [exec] 2017-10-22 08:33:40 URL:http://struts.apache.org/plugins/sitemesh/ [26943/26943] -> "<https://builds.apache.org/job/Struts-master-JDK7/ws/assembly/target/docs/plugins/sitemesh.html"> [1]
     [exec] 2017-10-22 08:33:40 URL:http://struts.apache.org/plugins/spring/ [24998/24998] -> "<https://builds.apache.org/job/Struts-master-JDK7/ws/assembly/target/docs/plugins/spring.html"> [1]
     [exec] 2017-10-22 08:33:40 URL:http://struts.apache.org/plugins/struts-1/ [22812/22812] -> "<https://builds.apache.org/job/Struts-master-JDK7/ws/assembly/target/docs/plugins/struts-1.html"> [1]
     [exec] 2017-10-22 08:33:40 URL:http://struts.apache.org/plugins/testng/ [10314/10314] -> "<https://builds.apache.org/job/Struts-master-JDK7/ws/assembly/target/docs/plugins/testng.html"> [1]
     [exec] 2017-10-22 08:33:40 URL:http://struts.apache.org/plugins/tiles/ [19113/19113] -> "<https://builds.apache.org/job/Struts-master-JDK7/ws/assembly/target/docs/plugins/tiles.html"> [1]
     [exec] 2017-10-22 08:33:41 URL:http://struts.apache.org/plugins/tiles-3/ [11765/11765] -> "<https://builds.apache.org/job/Struts-master-JDK7/ws/assembly/target/docs/plugins/tiles-3.html"> [1]
     [exec] 2017-10-22 08:33:41 URL:http://struts.apache.org/plugins/index.html [10135/10135] -> "<https://builds.apache.org/job/Struts-master-JDK7/ws/assembly/target/docs/plugins/index.html"> [1]
     [exec] 2017-10-22 08:33:41 URL:http://struts.apache.org/plugins/plugin-developers.html [10654/10654] -> "<https://builds.apache.org/job/Struts-master-JDK7/ws/assembly/target/docs/plugins/plugin-developers.html"> [1]
     [exec] http://struts.apache.org/plugins/architects-guide.html:
     [exec] 2017-10-22 08:33:41 ERROR 404: Not Found.
     [exec] FINISHED --2017-10-22 08:33:41--
     [exec] Total wall clock time: 34s
     [exec] Downloaded: 340 files, 6.0M in 0.5s (11.0 MB/s)
     [exec] Result: 8
[INFO] Executed tasks
[INFO]
[INFO] >>> maven-source-plugin:3.0.0:jar (attach-sources) > generate-sources @ struts2-assembly >>>
[INFO]
[INFO] <<< maven-source-plugin:3.0.0:jar (attach-sources) < generate-sources @ struts2-assembly <<<
[INFO]
[INFO]
[INFO] --- maven-source-plugin:3.0.0:jar (attach-sources) @ struts2-assembly ---
[INFO]
[INFO] --- maven-site-plugin:3.5.1:attach-descriptor (attach-descriptor) @ struts2-assembly ---
[INFO]
[INFO] --- dependency-maven-plugin:1.0:copy (copy-war) @ struts2-assembly ---
[INFO] Configured Artifact: org.apache.struts:struts2-showcase:null:2.5.14-SNAPSHOT:war
[INFO] Configured Artifact: org.apache.struts:struts2-rest-showcase:null:2.5.14-SNAPSHOT:war
[INFO] Copying <https://builds.apache.org/job/Struts-master-JDK7/ws/apps/showcase/target/struts2-showcase.war> to <https://builds.apache.org/job/Struts-master-JDK7/ws/assembly/target/apps/struts2-showcase.war>
[INFO] Copying <https://builds.apache.org/job/Struts-master-JDK7/ws/apps/rest-showcase/target/struts2-rest-showcase.war> to <https://builds.apache.org/job/Struts-master-JDK7/ws/assembly/target/apps/struts2-rest-showcase.war>
[INFO]
[INFO] --- maven-assembly-plugin:2.6:attached (make-assembly) @ struts2-assembly ---
[INFO] Reading assembly descriptor: src/main/assembly/all.xml
[INFO] Reading assembly descriptor: src/main/assembly/lib.xml
[INFO] Reading assembly descriptor: src/main/assembly/min-lib.xml
[INFO] Reading assembly descriptor: src/main/assembly/apps.xml
[INFO] Reading assembly descriptor: src/main/assembly/src.xml
[INFO] Reading assembly descriptor: src/main/assembly/docs.xml
[INFO] Building zip: <https://builds.apache.org/job/Struts-master-JDK7/ws/assembly/target/assembly/out/struts-2.5.14-SNAPSHOT-all.zip>
[INFO] Building zip: <https://builds.apache.org/job/Struts-master-JDK7/ws/assembly/target/assembly/out/struts-2.5.14-SNAPSHOT-lib.zip>
[INFO] Building zip: <https://builds.apache.org/job/Struts-master-JDK7/ws/assembly/target/assembly/out/struts-2.5.14-SNAPSHOT-min-lib.zip>
[INFO] Building zip: <https://builds.apache.org/job/Struts-master-JDK7/ws/assembly/target/assembly/out/struts-2.5.14-SNAPSHOT-apps.zip>
[INFO] Building zip: <https://builds.apache.org/job/Struts-master-JDK7/ws/assembly/target/assembly/out/struts-2.5.14-SNAPSHOT-src.zip>
[INFO] Building zip: <https://builds.apache.org/job/Struts-master-JDK7/ws/assembly/target/assembly/out/struts-2.5.14-SNAPSHOT-docs.zip>
[INFO]
[INFO] --- apache-rat-plugin:0.11:check (default) @ struts2-assembly ---
[INFO] 51 implicit excludes (use -debug for more details).
[INFO] Exclude: src/main/resources/org/apache/struts2/static/domTT.js
[INFO] Exclude: src/site/resources/tags/**/*.html
[INFO] Exclude: src/main/resources/*LICENSE.txt
[INFO] Exclude: src/test/resources/**/*.txt
[INFO] Exclude: src/main/webapp/**/*.css
[INFO] Exclude: src/main/webapp/**/*.map
[INFO] Exclude: src/main/webapp/**/*.js
[INFO] Exclude: src/main/webapp/**/*.svg
[INFO] Exclude: src/main/webapp/**/*.txt
[INFO] Exclude: src/main/resources/**/sitegraph-usage.txt
[INFO] Exclude: src/main/resources/static/css/**/*.css
[INFO] Exclude: src/main/resources/static/js/**/*.js
[INFO] Exclude: src/main/resources/docs.cfg
[INFO] Exclude: src/main/webapp/fonts/**/*
[INFO] 11 resources included (use -debug for more details)
[INFO] Rat check: Summary of files. Unapproved: 1 unknown: 1 generated: 0 approved: 9 licence.
[INFO] ------------------------------------------------------------------------
[INFO] Reactor Summary:
[INFO]
[INFO] Struts 2 Bill of Materials ......................... SUCCESS [  6.494 s]
[INFO] Struts 2 ........................................... SUCCESS [  7.667 s]
[INFO] Struts 2 Core ...................................... SUCCESS [04:37 min]
[INFO] Struts Plugins ..................................... SUCCESS [  2.258 s]
[INFO] Struts 2 Configuration Browser Plugin .............. SUCCESS [  9.826 s]
[INFO] Struts 2 Sitemesh Plugin ........................... SUCCESS [  6.477 s]
[INFO] Struts 2 Tiles Plugin .............................. SUCCESS [  9.228 s]
[INFO] Struts 2 DWR Plugin ................................ SUCCESS [  5.434 s]
[INFO] Struts 2 Spring Plugin ............................. SUCCESS [  8.187 s]
[INFO] Struts 2 Convention Plugin ......................... SUCCESS [ 15.903 s]
[INFO] Struts 2 JUnit Plugin .............................. SUCCESS [ 15.746 s]
[INFO] Struts 2 JSON Plugin ............................... SUCCESS [ 15.362 s]
[INFO] Struts 2 Bean Validation Plugin .................... SUCCESS [ 10.735 s]
[INFO] Struts 2 Webapps ................................... SUCCESS [  2.364 s]
[INFO] Struts 2 Showcase Webapp ........................... SUCCESS [ 20.983 s]
[INFO] Struts 2 REST Plugin ............................... SUCCESS [ 12.687 s]
[INFO] Struts 2 Rest Showcase Webapp ...................... SUCCESS [  9.605 s]
[INFO] Struts 2 CDI Plugin ................................ SUCCESS [ 10.647 s]
[INFO] Struts 2 Embedded JSP Plugin ....................... SUCCESS [ 21.124 s]
[INFO] Struts 2 GXP Plugin ................................ SUCCESS [  3.884 s]
[INFO] Struts 2 Jasper Reports Plugin ..................... SUCCESS [  4.589 s]
[INFO] Struts 2 Java Templates Plugin ..................... SUCCESS [  7.768 s]
[INFO] Struts 2 JFreeChart Plugin ......................... SUCCESS [  7.663 s]
[INFO] Struts 2 OSGi Plugin ............................... SUCCESS [  6.153 s]
[INFO] Struts 2 OVal Plugin ............................... SUCCESS [  7.571 s]
[INFO] Struts 2 Pell Multipart Plugin ..................... SUCCESS [  2.995 s]
[INFO] Struts 2 Plexus Plugin ............................. SUCCESS [  3.368 s]
[INFO] Struts 2 Portlet Plugin ............................ SUCCESS [ 14.922 s]
[INFO] Struts 2 Portlet Tiles Plugin ...................... SUCCESS [  3.935 s]
[INFO] DEPRECATED: Struts 2 Sitegraph Plugin .............. SUCCESS [  9.078 s]
[INFO] Struts 2 TestNG Plugin ............................. SUCCESS [  9.792 s]
[INFO] Struts OSGi Bundles ................................ SUCCESS [  0.883 s]
[INFO] Struts 2 OSGi Admin Bundle ......................... SUCCESS [  7.259 s]
[INFO] Struts 2 OSGi Demo Bundle .......................... SUCCESS [  6.698 s]
[INFO] Struts 2 Assembly .................................. FAILURE [01:00 min]
[INFO] ------------------------------------------------------------------------
[INFO] BUILD FAILURE
[INFO] ------------------------------------------------------------------------
[INFO] Total time: 10:28 min
[INFO] Finished at: 2017-10-22T08:34:05Z
[INFO] Final Memory: 87M/1616M
[INFO] ------------------------------------------------------------------------
[ERROR] Failed to execute goal org.apache.rat:apache-rat-plugin:0.11:check (default) on project struts2-assembly: Too many files with unapproved license: 1 See RAT report in: <https://builds.apache.org/job/Struts-master-JDK7/ws/assembly/target/rat.txt> -> [Help 1]
[ERROR]
[ERROR] To see the full stack trace of the errors, re-run Maven with the -e switch.
[ERROR] Re-run Maven using the -X switch to enable full debug logging.
[ERROR]
[ERROR] For more information about the errors and possible solutions, please read the following articles:
[ERROR] [Help 1] http://cwiki.apache.org/confluence/display/MAVEN/MojoFailureException
[ERROR]
[ERROR] After correcting the problems, you can resume the build with the command
[ERROR]   mvn <goals> -rf :struts2-assembly
Build step 'Execute shell' marked build as failure
[locks-and-latches] Releasing all the locks
[locks-and-latches] All the locks released
Setting MAVEN_3_LATEST__HOME=/home/jenkins/tools/maven/latest3/

---------------------------------------------------------------------
To unsubscribe, e-mail: [hidden email]
For additional commands, e-mail: [hidden email]

Reply | Threaded
Open this post in threaded view
|

Build failed in Jenkins: Struts-master-JDK7 #40

Apache Jenkins Server-2
See <https://builds.apache.org/job/Struts-master-JDK7/40/display/redirect>

------------------------------------------
[...truncated 4.11 MB...]
     [exec] 2017-10-22 08:53:06 URL:http://struts.apache.org/tag-developers/form-tags.html [23707/23707] -> "<https://builds.apache.org/job/Struts-master-JDK7/ws/assembly/target/docs/tag-developers/form-tags.html"> [1]
     [exec] 2017-10-22 08:53:06 URL:http://struts.apache.org/tag-developers/template-loading.html [12810/12810] -> "<https://builds.apache.org/job/Struts-master-JDK7/ws/assembly/target/docs/tag-developers/template-loading.html"> [1]
     [exec] 2017-10-22 08:53:06 URL:http://struts.apache.org/tag-developers/selecting-template-directory.html [8920/8920] -> "<https://builds.apache.org/job/Struts-master-JDK7/ws/assembly/target/docs/tag-developers/selecting-template-directory.html"> [1]
     [exec] 2017-10-22 08:53:07 URL:http://struts.apache.org/tag-developers/selecting-themes.html [9377/9377] -> "<https://builds.apache.org/job/Struts-master-JDK7/ws/assembly/target/docs/tag-developers/selecting-themes.html"> [1]
     [exec] 2017-10-22 08:53:07 URL:http://struts.apache.org/tag-developers/extending-themes.html [14299/14299] -> "<https://builds.apache.org/job/Struts-master-JDK7/ws/assembly/target/docs/tag-developers/extending-themes.html"> [1]
     [exec] 2017-10-22 08:53:07 URL:http://struts.apache.org/tag-developers/simple-theme.html [10604/10604] -> "<https://builds.apache.org/job/Struts-master-JDK7/ws/assembly/target/docs/tag-developers/simple-theme.html"> [1]
     [exec] 2017-10-22 08:53:07 URL:http://struts.apache.org/tag-developers/xhtml-theme.html [33779/33779] -> "<https://builds.apache.org/job/Struts-master-JDK7/ws/assembly/target/docs/tag-developers/xhtml-theme.html"> [1]
     [exec] 2017-10-22 08:53:07 URL:http://struts.apache.org/tag-developers/css-xhtml-theme.html [23235/23235] -> "<https://builds.apache.org/job/Struts-master-JDK7/ws/assembly/target/docs/tag-developers/css-xhtml-theme.html"> [1]
     [exec] 2017-10-22 08:53:07 URL:http://struts.apache.org/tag-developers/ajax-theme.html [12101/12101] -> "<https://builds.apache.org/job/Struts-master-JDK7/ws/assembly/target/docs/tag-developers/ajax-theme.html"> [1]
     [exec] 2017-10-22 08:53:07 URL:http://struts.apache.org/tag-developers/if-tag.html [10100/10100] -> "<https://builds.apache.org/job/Struts-master-JDK7/ws/assembly/target/docs/tag-developers/if-tag.html"> [1]
     [exec] 2017-10-22 08:53:07 URL:http://struts.apache.org/tag-developers/a-tag.html [32630/32630] -> "<https://builds.apache.org/job/Struts-master-JDK7/ws/assembly/target/docs/tag-developers/a-tag.html"> [1]
     [exec] 2017-10-22 08:53:07 URL:http://struts.apache.org/tag-developers/elseif-tag.html [10083/10083] -> "<https://builds.apache.org/job/Struts-master-JDK7/ws/assembly/target/docs/tag-developers/elseif-tag.html"> [1]
     [exec] 2017-10-22 08:53:07 URL:http://struts.apache.org/tag-developers/action-tag.html [16539/16539] -> "<https://builds.apache.org/job/Struts-master-JDK7/ws/assembly/target/docs/tag-developers/action-tag.html"> [1]
     [exec] 2017-10-22 08:53:07 URL:http://struts.apache.org/tag-developers/else-tag.html [9710/9710] -> "<https://builds.apache.org/job/Struts-master-JDK7/ws/assembly/target/docs/tag-developers/else-tag.html"> [1]
     [exec] 2017-10-22 08:53:08 URL:http://struts.apache.org/tag-developers/bean-tag.html [11924/11924] -> "<https://builds.apache.org/job/Struts-master-JDK7/ws/assembly/target/docs/tag-developers/bean-tag.html"> [1]
     [exec] 2017-10-22 08:53:08 URL:http://struts.apache.org/tag-developers/append-tag.html [14581/14581] -> "<https://builds.apache.org/job/Struts-master-JDK7/ws/assembly/target/docs/tag-developers/append-tag.html"> [1]
     [exec] 2017-10-22 08:53:08 URL:http://struts.apache.org/tag-developers/date-tag.html [13493/13493] -> "<https://builds.apache.org/job/Struts-master-JDK7/ws/assembly/target/docs/tag-developers/date-tag.html"> [1]
     [exec] 2017-10-22 08:53:08 URL:http://struts.apache.org/tag-developers/generator-tag.html [13936/13936] -> "<https://builds.apache.org/job/Struts-master-JDK7/ws/assembly/target/docs/tag-developers/generator-tag.html"> [1]
     [exec] 2017-10-22 08:53:08 URL:http://struts.apache.org/tag-developers/debug-tag.html [7977/7977] -> "<https://builds.apache.org/job/Struts-master-JDK7/ws/assembly/target/docs/tag-developers/debug-tag.html"> [1]
     [exec] 2017-10-22 08:53:08 URL:http://struts.apache.org/tag-developers/iterator-tag.html [20457/20457] -> "<https://builds.apache.org/job/Struts-master-JDK7/ws/assembly/target/docs/tag-developers/iterator-tag.html"> [1]
     [exec] 2017-10-22 08:53:08 URL:http://struts.apache.org/tag-developers/i18n-tag.html [9800/9800] -> "<https://builds.apache.org/job/Struts-master-JDK7/ws/assembly/target/docs/tag-developers/i18n-tag.html"> [1]
     [exec] 2017-10-22 08:53:08 URL:http://struts.apache.org/tag-developers/merge-tag.html [14891/14891] -> "<https://builds.apache.org/job/Struts-master-JDK7/ws/assembly/target/docs/tag-developers/merge-tag.html"> [1]
     [exec] 2017-10-22 08:53:08 URL:http://struts.apache.org/tag-developers/include-tag.html [10364/10364] -> "<https://builds.apache.org/job/Struts-master-JDK7/ws/assembly/target/docs/tag-developers/include-tag.html"> [1]
     [exec] 2017-10-22 08:53:08 URL:http://struts.apache.org/tag-developers/sort-tag.html [11334/11334] -> "<https://builds.apache.org/job/Struts-master-JDK7/ws/assembly/target/docs/tag-developers/sort-tag.html"> [1]
     [exec] 2017-10-22 08:53:08 URL:http://struts.apache.org/tag-developers/param-tag.html [13374/13374] -> "<https://builds.apache.org/job/Struts-master-JDK7/ws/assembly/target/docs/tag-developers/param-tag.html"> [1]
     [exec] 2017-10-22 08:53:08 URL:http://struts.apache.org/tag-developers/subset-tag.html [17689/17689] -> "<https://builds.apache.org/job/Struts-master-JDK7/ws/assembly/target/docs/tag-developers/subset-tag.html"> [1]
     [exec] 2017-10-22 08:53:09 URL:http://struts.apache.org/tag-developers/property-tag.html [11935/11935] -> "<https://builds.apache.org/job/Struts-master-JDK7/ws/assembly/target/docs/tag-developers/property-tag.html"> [1]
     [exec] 2017-10-22 08:53:09 URL:http://struts.apache.org/tag-developers/push-tag.html [13039/13039] -> "<https://builds.apache.org/job/Struts-master-JDK7/ws/assembly/target/docs/tag-developers/push-tag.html"> [1]
     [exec] 2017-10-22 08:53:09 URL:http://struts.apache.org/tag-developers/set-tag.html [11934/11934] -> "<https://builds.apache.org/job/Struts-master-JDK7/ws/assembly/target/docs/tag-developers/set-tag.html"> [1]
     [exec] 2017-10-22 08:53:09 URL:http://struts.apache.org/tag-developers/text-tag.html [13214/13214] -> "<https://builds.apache.org/job/Struts-master-JDK7/ws/assembly/target/docs/tag-developers/text-tag.html"> [1]
     [exec] 2017-10-22 08:53:09 URL:http://struts.apache.org/tag-developers/url-tag.html [16086/16086] -> "<https://builds.apache.org/job/Struts-master-JDK7/ws/assembly/target/docs/tag-developers/url-tag.html"> [1]
     [exec] 2017-10-22 08:53:09 URL:http://struts.apache.org/tag-developers/checkbox-tag.html [25263/25263] -> "<https://builds.apache.org/job/Struts-master-JDK7/ws/assembly/target/docs/tag-developers/checkbox-tag.html"> [1]
     [exec] 2017-10-22 08:53:09 URL:http://struts.apache.org/tag-developers/actionerror-tag.html [24591/24591] -> "<https://builds.apache.org/job/Struts-master-JDK7/ws/assembly/target/docs/tag-developers/actionerror-tag.html"> [1]
     [exec] 2017-10-22 08:53:09 URL:http://struts.apache.org/tag-developers/checkboxlist-tag.html [27519/27519] -> "<https://builds.apache.org/job/Struts-master-JDK7/ws/assembly/target/docs/tag-developers/checkboxlist-tag.html"> [1]
     [exec] 2017-10-22 08:53:09 URL:http://struts.apache.org/tag-developers/actionmessage-tag.html [24590/24590] -> "<https://builds.apache.org/job/Struts-master-JDK7/ws/assembly/target/docs/tag-developers/actionmessage-tag.html"> [1]
     [exec] 2017-10-22 08:53:09 URL:http://struts.apache.org/tag-developers/combobox-tag.html [29411/29411] -> "<https://builds.apache.org/job/Struts-master-JDK7/ws/assembly/target/docs/tag-developers/combobox-tag.html"> [1]
     [exec] 2017-10-22 08:53:09 URL:http://struts.apache.org/tag-developers/component-tag.html [28051/28051] -> "<https://builds.apache.org/job/Struts-master-JDK7/ws/assembly/target/docs/tag-developers/component-tag.html"> [1]
     [exec] 2017-10-22 08:53:09 URL:http://struts.apache.org/tag-developers/datetextfield-tag.html [24693/24693] -> "<https://builds.apache.org/job/Struts-master-JDK7/ws/assembly/target/docs/tag-developers/datetextfield-tag.html"> [1]
     [exec] 2017-10-22 08:53:10 URL:http://struts.apache.org/tag-developers/div-tag.html [24477/24477] -> "<https://builds.apache.org/job/Struts-master-JDK7/ws/assembly/target/docs/tag-developers/div-tag.html"> [1]
     [exec] 2017-10-22 08:53:10 URL:http://struts.apache.org/tag-developers/doubleselect-tag.html [41719/41719] -> "<https://builds.apache.org/job/Struts-master-JDK7/ws/assembly/target/docs/tag-developers/doubleselect-tag.html"> [1]
     [exec] 2017-10-22 08:53:10 URL:http://struts.apache.org/tag-developers/fielderror-tag.html [26066/26066] -> "<https://builds.apache.org/job/Struts-master-JDK7/ws/assembly/target/docs/tag-developers/fielderror-tag.html"> [1]
     [exec] 2017-10-22 08:53:10 URL:http://struts.apache.org/tag-developers/head-tag.html [24280/24280] -> "<https://builds.apache.org/job/Struts-master-JDK7/ws/assembly/target/docs/tag-developers/head-tag.html"> [1]
     [exec] 2017-10-22 08:53:10 URL:http://struts.apache.org/tag-developers/file-tag.html [25097/25097] -> "<https://builds.apache.org/job/Struts-master-JDK7/ws/assembly/target/docs/tag-developers/file-tag.html"> [1]
     [exec] 2017-10-22 08:53:10 URL:http://struts.apache.org/tag-developers/form-tag.html [30292/30292] -> "<https://builds.apache.org/job/Struts-master-JDK7/ws/assembly/target/docs/tag-developers/form-tag.html"> [1]
     [exec] 2017-10-22 08:53:10 URL:http://struts.apache.org/tag-developers/hidden-tag.html [25325/25325] -> "<https://builds.apache.org/job/Struts-master-JDK7/ws/assembly/target/docs/tag-developers/hidden-tag.html"> [1]
     [exec] 2017-10-22 08:53:10 URL:http://struts.apache.org/tag-developers/inputtransferselect-tag.html [32533/32533] -> "<https://builds.apache.org/job/Struts-master-JDK7/ws/assembly/target/docs/tag-developers/inputtransferselect-tag.html"> [1]
     [exec] 2017-10-22 08:53:10 URL:http://struts.apache.org/tag-developers/label-tag.html [24930/24930] -> "<https://builds.apache.org/job/Struts-master-JDK7/ws/assembly/target/docs/tag-developers/label-tag.html"> [1]
     [exec] 2017-10-22 08:53:10 URL:http://struts.apache.org/tag-developers/optiontransferselect-tag.html [51201/51201] -> "<https://builds.apache.org/job/Struts-master-JDK7/ws/assembly/target/docs/tag-developers/optiontransferselect-tag.html"> [1]
     [exec] 2017-10-22 08:53:10 URL:http://struts.apache.org/tag-developers/optgroup-tag.html [11618/11618] -> "<https://builds.apache.org/job/Struts-master-JDK7/ws/assembly/target/docs/tag-developers/optgroup-tag.html"> [1]
     [exec] 2017-10-22 08:53:11 URL:http://struts.apache.org/tag-developers/password-tag.html [26597/26597] -> "<https://builds.apache.org/job/Struts-master-JDK7/ws/assembly/target/docs/tag-developers/password-tag.html"> [1]
     [exec] 2017-10-22 08:53:11 URL:http://struts.apache.org/tag-developers/radio-tag.html [28401/28401] -> "<https://builds.apache.org/job/Struts-master-JDK7/ws/assembly/target/docs/tag-developers/radio-tag.html"> [1]
     [exec] 2017-10-22 08:53:11 URL:http://struts.apache.org/tag-developers/reset-tag.html [26859/26859] -> "<https://builds.apache.org/job/Struts-master-JDK7/ws/assembly/target/docs/tag-developers/reset-tag.html"> [1]
     [exec] 2017-10-22 08:53:11 URL:http://struts.apache.org/tag-developers/select-tag.html [31001/31001] -> "<https://builds.apache.org/job/Struts-master-JDK7/ws/assembly/target/docs/tag-developers/select-tag.html"> [1]
     [exec] 2017-10-22 08:53:11 URL:http://struts.apache.org/tag-developers/submit-tag.html [27256/27256] -> "<https://builds.apache.org/job/Struts-master-JDK7/ws/assembly/target/docs/tag-developers/submit-tag.html"> [1]
     [exec] 2017-10-22 08:53:11 URL:http://struts.apache.org/tag-developers/textarea-tag.html [25611/25611] -> "<https://builds.apache.org/job/Struts-master-JDK7/ws/assembly/target/docs/tag-developers/textarea-tag.html"> [1]
     [exec] 2017-10-22 08:53:11 URL:http://struts.apache.org/tag-developers/textfield-tag.html [26032/26032] -> "<https://builds.apache.org/job/Struts-master-JDK7/ws/assembly/target/docs/tag-developers/textfield-tag.html"> [1]
     [exec] 2017-10-22 08:53:11 URL:http://struts.apache.org/tag-developers/token-tag.html [24345/24345] -> "<https://builds.apache.org/job/Struts-master-JDK7/ws/assembly/target/docs/tag-developers/token-tag.html"> [1]
     [exec] 2017-10-22 08:53:11 URL:http://struts.apache.org/tag-developers/updownselect-tag.html [33059/33059] -> "<https://builds.apache.org/job/Struts-master-JDK7/ws/assembly/target/docs/tag-developers/updownselect-tag.html"> [1]
     [exec] 2017-10-22 08:53:11 URL:http://struts.apache.org/tag-developers/ui-tag-reference.html [10591/10591] -> "<https://builds.apache.org/job/Struts-master-JDK7/ws/assembly/target/docs/tag-developers/ui-tag-reference.html"> [1]
     [exec] http://struts.apache.org/tag-developers/dojo-href-tag.html:
     [exec] 2017-10-22 08:53:11 ERROR 404: Not Found.
     [exec] 2017-10-22 08:53:11 URL:http://struts.apache.org/tag-developers/dojo-autocompleter-tag.html [41761/41761] -> "<https://builds.apache.org/job/Struts-master-JDK7/ws/assembly/target/docs/tag-developers/dojo-autocompleter-tag.html"> [1]
     [exec] 2017-10-22 08:53:12 URL:http://struts.apache.org/tag-developers/dojo-bind-tag.html [25441/25441] -> "<https://builds.apache.org/job/Struts-master-JDK7/ws/assembly/target/docs/tag-developers/dojo-bind-tag.html"> [1]
     [exec] 2017-10-22 08:53:12 URL:http://struts.apache.org/tag-developers/dojo-datetimepicker-tag.html [32471/32471] -> "<https://builds.apache.org/job/Struts-master-JDK7/ws/assembly/target/docs/tag-developers/dojo-datetimepicker-tag.html"> [1]
     [exec] 2017-10-22 08:53:12 URL:http://struts.apache.org/tag-developers/dojo-div-tag.html [37164/37164] -> "<https://builds.apache.org/job/Struts-master-JDK7/ws/assembly/target/docs/tag-developers/dojo-div-tag.html"> [1]
     [exec] 2017-10-22 08:53:12 URL:http://struts.apache.org/tag-developers/dojo-head-tag.html [15783/15783] -> "<https://builds.apache.org/job/Struts-master-JDK7/ws/assembly/target/docs/tag-developers/dojo-head-tag.html"> [1]
     [exec] 2017-10-22 08:53:12 URL:http://struts.apache.org/tag-developers/dojo-submit-tag.html [40428/40428] -> "<https://builds.apache.org/job/Struts-master-JDK7/ws/assembly/target/docs/tag-developers/dojo-submit-tag.html"> [1]
     [exec] 2017-10-22 08:53:12 URL:http://struts.apache.org/tag-developers/dojo-tabbedpanel-tag.html [35876/35876] -> "<https://builds.apache.org/job/Struts-master-JDK7/ws/assembly/target/docs/tag-developers/dojo-tabbedpanel-tag.html"> [1]
     [exec] 2017-10-22 08:53:12 URL:http://struts.apache.org/tag-developers/dojo-textarea-tag.html [24637/24637] -> "<https://builds.apache.org/job/Struts-master-JDK7/ws/assembly/target/docs/tag-developers/dojo-textarea-tag.html"> [1]
     [exec] 2017-10-22 08:53:12 URL:http://struts.apache.org/tag-developers/dojo-tree-tag.html [37392/37392] -> "<https://builds.apache.org/job/Struts-master-JDK7/ws/assembly/target/docs/tag-developers/dojo-tree-tag.html"> [1]
     [exec] 2017-10-22 08:53:13 URL:http://struts.apache.org/tag-developers/dojo-treenode-tag.html [26527/26527] -> "<https://builds.apache.org/job/Struts-master-JDK7/ws/assembly/target/docs/tag-developers/dojo-treenode-tag.html"> [1]
     [exec] 2017-10-22 08:53:13 URL:http://struts.apache.org/tag-developers/access-to-valuestack-from-jsps.html [16373/16373] -> "<https://builds.apache.org/job/Struts-master-JDK7/ws/assembly/target/docs/tag-developers/access-to-valuestack-from-jsps.html"> [1]
     [exec] http://struts.apache.org/tag-developers/tags.html:
     [exec] 2017-10-22 08:53:13 ERROR 404: Not Found.
     [exec] http://struts.apache.org/tag-developers/ogn.html:
     [exec] 2017-10-22 08:53:13 ERROR 404: Not Found.
     [exec] http://struts.apache.org/tag-developers/css-xhtml-theme.xhtml:
     [exec] 2017-10-22 08:53:13 ERROR 404: Not Found.
     [exec] http://struts.apache.org/tag-developers/form-tag.htmk:
     [exec] 2017-10-22 08:53:13 ERROR 404: Not Found.
     [exec] 2017-10-22 08:53:13 URL:http://struts.apache.org/tag-developers/dojo-a-tag.html [37911/37911] -> "<https://builds.apache.org/job/Struts-master-JDK7/ws/assembly/target/docs/tag-developers/dojo-a-tag.html"> [1]
     [exec] 2017-10-22 08:53:13 URL:http://struts.apache.org/tag-developers/ajax-head-template.html [18587/18587] -> "<https://builds.apache.org/job/Struts-master-JDK7/ws/assembly/target/docs/tag-developers/ajax-head-template.html"> [1]
     [exec] 2017-10-22 08:53:13 URL:http://struts.apache.org/tag-developers/ajax-div-template.html [19743/19743] -> "<https://builds.apache.org/job/Struts-master-JDK7/ws/assembly/target/docs/tag-developers/ajax-div-template.html"> [1]
     [exec] 2017-10-22 08:53:13 URL:http://struts.apache.org/tag-developers/ajax-a-template.html [9586/9586] -> "<https://builds.apache.org/job/Struts-master-JDK7/ws/assembly/target/docs/tag-developers/ajax-a-template.html"> [1]
     [exec] 2017-10-22 08:53:13 URL:http://struts.apache.org/tag-developers/ajax-event-system.html [10990/10990] -> "<https://builds.apache.org/job/Struts-master-JDK7/ws/assembly/target/docs/tag-developers/ajax-event-system.html"> [1]
     [exec] http://struts.apache.org/tag-developers/head-tag.htlm:
     [exec] 2017-10-22 08:53:13 ERROR 404: Not Found.
     [exec] http://struts.apache.org/tag-developers/autocompleter-tag.html:
     [exec] 2017-10-22 08:53:14 ERROR 404: Not Found.
     [exec] http://struts.apache.org/tag-developers/bind-tag.html:
     [exec] 2017-10-22 08:53:14 ERROR 404: Not Found.
     [exec] http://struts.apache.org/tag-developers/datetimepicker-tag.html:
     [exec] 2017-10-22 08:53:14 ERROR 404: Not Found.
     [exec] http://struts.apache.org/tag-developers/tabbed-tag.html:
     [exec] 2017-10-22 08:53:14 ERROR 404: Not Found.
     [exec] http://struts.apache.org/tag-developers/tree-tag.html:
     [exec] 2017-10-22 08:53:14 ERROR 404: Not Found.
     [exec] http://struts.apache.org/tag-developers/treenode-tag.html:
     [exec] 2017-10-22 08:53:14 ERROR 404: Not Found.
     [exec] 2017-10-22 08:53:14 URL:http://struts.apache.org/maven-archetypes/ [22310/22310] -> "<https://builds.apache.org/job/Struts-master-JDK7/ws/assembly/target/docs/maven-archetypes/index.html"> [1]
     [exec] 2017-10-22 08:53:14 URL:http://struts.apache.org/maven-archetypes/struts2-archetype-blank.html [23604/23604] -> "<https://builds.apache.org/job/Struts-master-JDK7/ws/assembly/target/docs/maven-archetypes/struts2-archetype-blank.html"> [1]
     [exec] 2017-10-22 08:53:14 URL:http://struts.apache.org/maven-archetypes/index.html [22310/22310] -> "<https://builds.apache.org/job/Struts-master-JDK7/ws/assembly/target/docs/maven-archetypes/index.html"> [1]
     [exec] 2017-10-22 08:53:14 URL:http://struts.apache.org/plugins/ [10135/10135] -> "<https://builds.apache.org/job/Struts-master-JDK7/ws/assembly/target/docs/plugins/index.html"> [1]
     [exec] 2017-10-22 08:53:14 URL:http://struts.apache.org/plugins/plugins.html [39614/39614] -> "<https://builds.apache.org/job/Struts-master-JDK7/ws/assembly/target/docs/plugins/plugins.html"> [1]
     [exec] http://struts.apache.org/plugins/extending-an-application-with-custom-plugins.html:
     [exec] 2017-10-22 08:53:14 ERROR 404: Not Found.
     [exec] 2017-10-22 08:53:15 URL:http://struts.apache.org/plugins/bean-validation/ [28145/28145] -> "<https://builds.apache.org/job/Struts-master-JDK7/ws/assembly/target/docs/plugins/bean-validation.html"> [1]
     [exec] 2017-10-22 08:53:15 URL:http://struts.apache.org/plugins/cdi/ [40844/40844] -> "<https://builds.apache.org/job/Struts-master-JDK7/ws/assembly/target/docs/plugins/cdi.html"> [1]
     [exec] 2017-10-22 08:53:15 URL:http://struts.apache.org/plugins/codebehind/ [14976/14976] -> "<https://builds.apache.org/job/Struts-master-JDK7/ws/assembly/target/docs/plugins/codebehind.html"> [1]
     [exec] 2017-10-22 08:53:15 URL:http://struts.apache.org/plugins/config-browser/ [9351/9351] -> "<https://builds.apache.org/job/Struts-master-JDK7/ws/assembly/target/docs/plugins/config-browser.html"> [1]
     [exec] 2017-10-22 08:53:15 URL:http://struts.apache.org/plugins/convention/ [80174/80174] -> "<https://builds.apache.org/job/Struts-master-JDK7/ws/assembly/target/docs/plugins/convention.html"> [1]
     [exec] 2017-10-22 08:53:16 URL:http://struts.apache.org/plugins/dwr/ [9572/9572] -> "<https://builds.apache.org/job/Struts-master-JDK7/ws/assembly/target/docs/plugins/dwr.html"> [1]
     [exec] 2017-10-22 08:53:16 URL:http://struts.apache.org/plugins/embedded-jsp/ [11957/11957] -> "<https://builds.apache.org/job/Struts-master-JDK7/ws/assembly/target/docs/plugins/embedded-jsp.html"> [1]
     [exec] 2017-10-22 08:53:16 URL:http://struts.apache.org/plugins/jasperreports/ [13230/13230] -> "<https://builds.apache.org/job/Struts-master-JDK7/ws/assembly/target/docs/plugins/jasperreports.html"> [1]
     [exec] 2017-10-22 08:53:16 URL:http://struts.apache.org/plugins/java-8-support/ [9937/9937] -> "<https://builds.apache.org/job/Struts-master-JDK7/ws/assembly/target/docs/plugins/java-8-support.html"> [1]
     [exec] 2017-10-22 08:53:16 URL:http://struts.apache.org/plugins/javatemplates/ [9724/9724] -> "<https://builds.apache.org/job/Struts-master-JDK7/ws/assembly/target/docs/plugins/javatemplates.html"> [1]
     [exec] 2017-10-22 08:53:16 URL:http://struts.apache.org/plugins/jfreechart/ [15812/15812] -> "<https://builds.apache.org/job/Struts-master-JDK7/ws/assembly/target/docs/plugins/jfreechart.html"> [1]
     [exec] 2017-10-22 08:53:17 URL:http://struts.apache.org/plugins/jsf/ [14912/14912] -> "<https://builds.apache.org/job/Struts-master-JDK7/ws/assembly/target/docs/plugins/jsf.html"> [1]
     [exec] 2017-10-22 08:53:17 URL:http://struts.apache.org/plugins/json/ [59395/59395] -> "<https://builds.apache.org/job/Struts-master-JDK7/ws/assembly/target/docs/plugins/json.html"> [1]
     [exec] 2017-10-22 08:53:17 URL:http://struts.apache.org/plugins/junit/ [21505/21505] -> "<https://builds.apache.org/job/Struts-master-JDK7/ws/assembly/target/docs/plugins/junit.html"> [1]
     [exec] 2017-10-22 08:53:17 URL:http://struts.apache.org/plugins/oval/ [22999/22999] -> "<https://builds.apache.org/job/Struts-master-JDK7/ws/assembly/target/docs/plugins/oval.html"> [1]
     [exec] 2017-10-22 08:53:17 URL:http://struts.apache.org/plugins/osgi/ [30855/30855] -> "<https://builds.apache.org/job/Struts-master-JDK7/ws/assembly/target/docs/plugins/osgi.html"> [1]
     [exec] 2017-10-22 08:53:18 URL:http://struts.apache.org/plugins/plexus/ [10515/10515] -> "<https://builds.apache.org/job/Struts-master-JDK7/ws/assembly/target/docs/plugins/plexus.html"> [1]
     [exec] 2017-10-22 08:53:18 URL:http://struts.apache.org/plugins/portlet/ [20812/20812] -> "<https://builds.apache.org/job/Struts-master-JDK7/ws/assembly/target/docs/plugins/portlet.html"> [1]
     [exec] 2017-10-22 08:53:18 URL:http://struts.apache.org/plugins/portlet-tiles/ [11382/11382] -> "<https://builds.apache.org/job/Struts-master-JDK7/ws/assembly/target/docs/plugins/portlet-tiles.html"> [1]
     [exec] 2017-10-22 08:53:18 URL:http://struts.apache.org/plugins/rest/ [36941/36941] -> "<https://builds.apache.org/job/Struts-master-JDK7/ws/assembly/target/docs/plugins/rest.html"> [1]
     [exec] 2017-10-22 08:53:18 URL:http://struts.apache.org/plugins/sitegraph/ [15104/15104] -> "<https://builds.apache.org/job/Struts-master-JDK7/ws/assembly/target/docs/plugins/sitegraph.html"> [1]
     [exec] 2017-10-22 08:53:18 URL:http://struts.apache.org/plugins/sitemesh/ [26943/26943] -> "<https://builds.apache.org/job/Struts-master-JDK7/ws/assembly/target/docs/plugins/sitemesh.html"> [1]
     [exec] 2017-10-22 08:53:19 URL:http://struts.apache.org/plugins/spring/ [24998/24998] -> "<https://builds.apache.org/job/Struts-master-JDK7/ws/assembly/target/docs/plugins/spring.html"> [1]
     [exec] 2017-10-22 08:53:19 URL:http://struts.apache.org/plugins/struts-1/ [22812/22812] -> "<https://builds.apache.org/job/Struts-master-JDK7/ws/assembly/target/docs/plugins/struts-1.html"> [1]
     [exec] 2017-10-22 08:53:19 URL:http://struts.apache.org/plugins/testng/ [10314/10314] -> "<https://builds.apache.org/job/Struts-master-JDK7/ws/assembly/target/docs/plugins/testng.html"> [1]
     [exec] 2017-10-22 08:53:19 URL:http://struts.apache.org/plugins/tiles/ [19113/19113] -> "<https://builds.apache.org/job/Struts-master-JDK7/ws/assembly/target/docs/plugins/tiles.html"> [1]
     [exec] 2017-10-22 08:53:19 URL:http://struts.apache.org/plugins/tiles-3/ [11765/11765] -> "<https://builds.apache.org/job/Struts-master-JDK7/ws/assembly/target/docs/plugins/tiles-3.html"> [1]
     [exec] 2017-10-22 08:53:19 URL:http://struts.apache.org/plugins/index.html [10135/10135] -> "<https://builds.apache.org/job/Struts-master-JDK7/ws/assembly/target/docs/plugins/index.html"> [1]
     [exec] 2017-10-22 08:53:19 URL:http://struts.apache.org/plugins/plugin-developers.html [10654/10654] -> "<https://builds.apache.org/job/Struts-master-JDK7/ws/assembly/target/docs/plugins/plugin-developers.html"> [1]
     [exec] http://struts.apache.org/plugins/architects-guide.html:
     [exec] 2017-10-22 08:53:19 ERROR 404: Not Found.
     [exec] FINISHED --2017-10-22 08:53:19--
     [exec] Total wall clock time: 34s
     [exec] Downloaded: 340 files, 6.0M in 0.5s (11.1 MB/s)
     [exec] Result: 8
[INFO] Executed tasks
[INFO]
[INFO] >>> maven-source-plugin:3.0.0:jar (attach-sources) > generate-sources @ struts2-assembly >>>
[INFO]
[INFO] <<< maven-source-plugin:3.0.0:jar (attach-sources) < generate-sources @ struts2-assembly <<<
[INFO]
[INFO]
[INFO] --- maven-source-plugin:3.0.0:jar (attach-sources) @ struts2-assembly ---
[INFO]
[INFO] --- maven-site-plugin:3.5.1:attach-descriptor (attach-descriptor) @ struts2-assembly ---
[INFO]
[INFO] --- dependency-maven-plugin:1.0:copy (copy-war) @ struts2-assembly ---
[INFO] Configured Artifact: org.apache.struts:struts2-showcase:null:2.5.14-SNAPSHOT:war
[INFO] Configured Artifact: org.apache.struts:struts2-rest-showcase:null:2.5.14-SNAPSHOT:war
[INFO] Copying <https://builds.apache.org/job/Struts-master-JDK7/ws/apps/showcase/target/struts2-showcase.war> to <https://builds.apache.org/job/Struts-master-JDK7/ws/assembly/target/apps/struts2-showcase.war>
[INFO] Copying <https://builds.apache.org/job/Struts-master-JDK7/ws/apps/rest-showcase/target/struts2-rest-showcase.war> to <https://builds.apache.org/job/Struts-master-JDK7/ws/assembly/target/apps/struts2-rest-showcase.war>
[INFO]
[INFO] --- maven-assembly-plugin:2.6:attached (make-assembly) @ struts2-assembly ---
[INFO] Reading assembly descriptor: src/main/assembly/all.xml
[INFO] Reading assembly descriptor: src/main/assembly/lib.xml
[INFO] Reading assembly descriptor: src/main/assembly/min-lib.xml
[INFO] Reading assembly descriptor: src/main/assembly/apps.xml
[INFO] Reading assembly descriptor: src/main/assembly/src.xml
[INFO] Reading assembly descriptor: src/main/assembly/docs.xml
[INFO] Building zip: <https://builds.apache.org/job/Struts-master-JDK7/ws/assembly/target/assembly/out/struts-2.5.14-SNAPSHOT-all.zip>
[INFO] Building zip: <https://builds.apache.org/job/Struts-master-JDK7/ws/assembly/target/assembly/out/struts-2.5.14-SNAPSHOT-lib.zip>
[INFO] Building zip: <https://builds.apache.org/job/Struts-master-JDK7/ws/assembly/target/assembly/out/struts-2.5.14-SNAPSHOT-min-lib.zip>
[INFO] Building zip: <https://builds.apache.org/job/Struts-master-JDK7/ws/assembly/target/assembly/out/struts-2.5.14-SNAPSHOT-apps.zip>
[INFO] Building zip: <https://builds.apache.org/job/Struts-master-JDK7/ws/assembly/target/assembly/out/struts-2.5.14-SNAPSHOT-src.zip>
[INFO] Building zip: <https://builds.apache.org/job/Struts-master-JDK7/ws/assembly/target/assembly/out/struts-2.5.14-SNAPSHOT-docs.zip>
[INFO]
[INFO] --- apache-rat-plugin:0.11:check (default) @ struts2-assembly ---
[INFO] 51 implicit excludes (use -debug for more details).
[INFO] Exclude: src/main/resources/org/apache/struts2/static/domTT.js
[INFO] Exclude: src/site/resources/tags/**/*.html
[INFO] Exclude: src/main/resources/*LICENSE.txt
[INFO] Exclude: src/test/resources/**/*.txt
[INFO] Exclude: src/main/webapp/**/*.css
[INFO] Exclude: src/main/webapp/**/*.map
[INFO] Exclude: src/main/webapp/**/*.js
[INFO] Exclude: src/main/webapp/**/*.svg
[INFO] Exclude: src/main/webapp/**/*.txt
[INFO] Exclude: src/main/resources/**/sitegraph-usage.txt
[INFO] Exclude: src/main/resources/static/css/**/*.css
[INFO] Exclude: src/main/resources/static/js/**/*.js
[INFO] Exclude: src/main/resources/docs.cfg
[INFO] Exclude: src/main/webapp/fonts/**/*
[INFO] 11 resources included (use -debug for more details)
[INFO] Rat check: Summary of files. Unapproved: 1 unknown: 1 generated: 0 approved: 9 licence.
[INFO] ------------------------------------------------------------------------
[INFO] Reactor Summary:
[INFO]
[INFO] Struts 2 Bill of Materials ......................... SUCCESS [  5.995 s]
[INFO] Struts 2 ........................................... SUCCESS [  7.890 s]
[INFO] Struts 2 Core ...................................... SUCCESS [03:38 min]
[INFO] Struts Plugins ..................................... SUCCESS [  1.221 s]
[INFO] Struts 2 Configuration Browser Plugin .............. SUCCESS [  4.761 s]
[INFO] Struts 2 Sitemesh Plugin ........................... SUCCESS [  5.491 s]
[INFO] Struts 2 Tiles Plugin .............................. SUCCESS [  7.167 s]
[INFO] Struts 2 DWR Plugin ................................ SUCCESS [  4.324 s]
[INFO] Struts 2 Spring Plugin ............................. SUCCESS [  7.342 s]
[INFO] Struts 2 Convention Plugin ......................... SUCCESS [ 12.103 s]
[INFO] Struts 2 JUnit Plugin .............................. SUCCESS [ 10.449 s]
[INFO] Struts 2 JSON Plugin ............................... SUCCESS [ 12.995 s]
[INFO] Struts 2 Bean Validation Plugin .................... SUCCESS [  7.963 s]
[INFO] Struts 2 Webapps ................................... SUCCESS [  1.760 s]
[INFO] Struts 2 Showcase Webapp ........................... SUCCESS [ 15.933 s]
[INFO] Struts 2 REST Plugin ............................... SUCCESS [  8.578 s]
[INFO] Struts 2 Rest Showcase Webapp ...................... SUCCESS [  7.905 s]
[INFO] Struts 2 CDI Plugin ................................ SUCCESS [  6.339 s]
[INFO] Struts 2 Embedded JSP Plugin ....................... SUCCESS [ 19.490 s]
[INFO] Struts 2 GXP Plugin ................................ SUCCESS [  5.453 s]
[INFO] Struts 2 Jasper Reports Plugin ..................... SUCCESS [  5.407 s]
[INFO] Struts 2 Java Templates Plugin ..................... SUCCESS [  8.869 s]
[INFO] Struts 2 JFreeChart Plugin ......................... SUCCESS [  8.315 s]
[INFO] Struts 2 OSGi Plugin ............................... SUCCESS [  8.572 s]
[INFO] Struts 2 OVal Plugin ............................... SUCCESS [  8.895 s]
[INFO] Struts 2 Pell Multipart Plugin ..................... SUCCESS [  4.808 s]
[INFO] Struts 2 Plexus Plugin ............................. SUCCESS [  4.257 s]
[INFO] Struts 2 Portlet Plugin ............................ SUCCESS [ 15.255 s]
[INFO] Struts 2 Portlet Tiles Plugin ...................... SUCCESS [  5.477 s]
[INFO] DEPRECATED: Struts 2 Sitegraph Plugin .............. SUCCESS [  7.833 s]
[INFO] Struts 2 TestNG Plugin ............................. SUCCESS [  7.300 s]
[INFO] Struts OSGi Bundles ................................ SUCCESS [  0.813 s]
[INFO] Struts 2 OSGi Admin Bundle ......................... SUCCESS [  6.209 s]
[INFO] Struts 2 OSGi Demo Bundle .......................... SUCCESS [  6.088 s]
[INFO] Struts 2 Assembly .................................. FAILURE [ 53.361 s]
[INFO] ------------------------------------------------------------------------
[INFO] BUILD FAILURE
[INFO] ------------------------------------------------------------------------
[INFO] Total time: 08:47 min
[INFO] Finished at: 2017-10-22T08:53:37Z
[INFO] Final Memory: 82M/1125M
[INFO] ------------------------------------------------------------------------
[ERROR] Failed to execute goal org.apache.rat:apache-rat-plugin:0.11:check (default) on project struts2-assembly: Too many files with unapproved license: 1 See RAT report in: <https://builds.apache.org/job/Struts-master-JDK7/ws/assembly/target/rat.txt> -> [Help 1]
[ERROR]
[ERROR] To see the full stack trace of the errors, re-run Maven with the -e switch.
[ERROR] Re-run Maven using the -X switch to enable full debug logging.
[ERROR]
[ERROR] For more information about the errors and possible solutions, please read the following articles:
[ERROR] [Help 1] http://cwiki.apache.org/confluence/display/MAVEN/MojoFailureException
[ERROR]
[ERROR] After correcting the problems, you can resume the build with the command
[ERROR]   mvn <goals> -rf :struts2-assembly
Build step 'Execute shell' marked build as failure
[locks-and-latches] Releasing all the locks
[locks-and-latches] All the locks released
Setting MAVEN_3_LATEST__HOME=/home/jenkins/tools/maven/latest3/

---------------------------------------------------------------------
To unsubscribe, e-mail: [hidden email]
For additional commands, e-mail: [hidden email]

Reply | Threaded
Open this post in threaded view
|

Jenkins build is back to normal : Struts-master-JDK7 #41

Apache Jenkins Server-2
See <https://builds.apache.org/job/Struts-master-JDK7/41/display/redirect?page=changes>


---------------------------------------------------------------------
To unsubscribe, e-mail: [hidden email]
For additional commands, e-mail: [hidden email]