Build failed in Jenkins: Struts-master-JDK7 #15

classic Classic list List threaded Threaded
1 message Options
Reply | Threaded
Open this post in threaded view
|  
Report Content as Inappropriate

Build failed in Jenkins: Struts-master-JDK7 #15

Apache Jenkins Server-2
See <https://builds.apache.org/job/Struts-master-JDK7/15/display/redirect?page=changes>

Changes:

[amashchenko] Inject Container in constructor of the ObjectFactory

[Lukasz Lenart] Adds new methods and marks current as deprecated

[Lukasz Lenart] Adds an abstract layer to allow easily handle API change

[Lukasz Lenart] Updates flow to handle new API

[Lukasz Lenart] Updates tests

[Lukasz Lenart] Uses proper class as converter

[Lukasz Lenart] WW-4837 Adds a test to proof that Integers are treated as Integers

[Lukasz Lenart] WW-4837 Adds a test to test how Strings are treated

------------------------------------------
[...truncated 286.96 KB...]
Generating <https://builds.apache.org/job/Struts-master-JDK7/ws/core/target/apidocs/org/apache/struts2/interceptor/class-use/NoOpInterceptor.html...>
Generating <https://builds.apache.org/job/Struts-master-JDK7/ws/core/target/apidocs/org/apache/struts2/interceptor/class-use/BackgroundProcess.html...>
Generating <https://builds.apache.org/job/Struts-master-JDK7/ws/core/target/apidocs/org/apache/struts2/interceptor/class-use/ActionMappingParametersInteceptor.html...>
Generating <https://builds.apache.org/job/Struts-master-JDK7/ws/core/target/apidocs/org/apache/struts2/interceptor/class-use/MessageStorePreResultListener.html...>
Generating <https://builds.apache.org/job/Struts-master-JDK7/ws/core/target/apidocs/org/apache/struts2/interceptor/class-use/ServletRequestAware.html...>
Generating <https://builds.apache.org/job/Struts-master-JDK7/ws/core/target/apidocs/org/apache/struts2/interceptor/class-use/ExecuteAndWaitInterceptor.html...>
Generating <https://builds.apache.org/job/Struts-master-JDK7/ws/core/target/apidocs/org/apache/struts2/interceptor/class-use/CookiesAware.html...>
Generating <https://builds.apache.org/job/Struts-master-JDK7/ws/core/target/apidocs/org/apache/struts2/interceptor/validation/class-use/AnnotationValidationInterceptor.html...>
Generating <https://builds.apache.org/job/Struts-master-JDK7/ws/core/target/apidocs/org/apache/struts2/interceptor/validation/class-use/SkipValidation.html...>
Generating <https://builds.apache.org/job/Struts-master-JDK7/ws/core/target/apidocs/org/apache/struts2/interceptor/debugging/class-use/PrettyPrintWriter.html...>
Generating <https://builds.apache.org/job/Struts-master-JDK7/ws/core/target/apidocs/org/apache/struts2/interceptor/debugging/class-use/DebuggingInterceptor.html...>
Generating <https://builds.apache.org/job/Struts-master-JDK7/ws/core/target/apidocs/org/apache/struts2/interceptor/servlet/class-use/ServletPrincipalProxy.html...>
Generating <https://builds.apache.org/job/Struts-master-JDK7/ws/core/target/apidocs/org/apache/struts2/factory/class-use/StrutsActionProxyFactory.html...>
Generating <https://builds.apache.org/job/Struts-master-JDK7/ws/core/target/apidocs/org/apache/struts2/factory/class-use/PrefixBasedActionProxyFactory.html...>
Generating <https://builds.apache.org/job/Struts-master-JDK7/ws/core/target/apidocs/org/apache/struts2/factory/class-use/StrutsActionProxy.html...>
Generating <https://builds.apache.org/job/Struts-master-JDK7/ws/core/target/apidocs/org/apache/struts2/factory/class-use/StrutsResultFactory.html...>
Generating <https://builds.apache.org/job/Struts-master-JDK7/ws/core/target/apidocs/com/opensymphony/xwork2/package-use.html...>
Generating <https://builds.apache.org/job/Struts-master-JDK7/ws/core/target/apidocs/com/opensymphony/xwork2/config/package-use.html...>
Generating <https://builds.apache.org/job/Struts-master-JDK7/ws/core/target/apidocs/com/opensymphony/xwork2/config/entities/package-use.html...>
Generating <https://builds.apache.org/job/Struts-master-JDK7/ws/core/target/apidocs/com/opensymphony/xwork2/config/impl/package-use.html...>
Generating <https://builds.apache.org/job/Struts-master-JDK7/ws/core/target/apidocs/com/opensymphony/xwork2/config/providers/package-use.html...>
Generating <https://builds.apache.org/job/Struts-master-JDK7/ws/core/target/apidocs/com/opensymphony/xwork2/conversion/package-use.html...>
Generating <https://builds.apache.org/job/Struts-master-JDK7/ws/core/target/apidocs/com/opensymphony/xwork2/conversion/annotations/package-use.html...>
Generating <https://builds.apache.org/job/Struts-master-JDK7/ws/core/target/apidocs/com/opensymphony/xwork2/conversion/impl/package-use.html...>
Generating <https://builds.apache.org/job/Struts-master-JDK7/ws/core/target/apidocs/com/opensymphony/xwork2/conversion/metadata/package-use.html...>
Generating <https://builds.apache.org/job/Struts-master-JDK7/ws/core/target/apidocs/com/opensymphony/xwork2/factory/package-use.html...>
Generating <https://builds.apache.org/job/Struts-master-JDK7/ws/core/target/apidocs/com/opensymphony/xwork2/inject/package-use.html...>
Generating <https://builds.apache.org/job/Struts-master-JDK7/ws/core/target/apidocs/com/opensymphony/xwork2/inject/util/package-use.html...>
Generating <https://builds.apache.org/job/Struts-master-JDK7/ws/core/target/apidocs/com/opensymphony/xwork2/interceptor/package-use.html...>
Generating <https://builds.apache.org/job/Struts-master-JDK7/ws/core/target/apidocs/com/opensymphony/xwork2/interceptor/annotations/package-use.html...>
Generating <https://builds.apache.org/job/Struts-master-JDK7/ws/core/target/apidocs/com/opensymphony/xwork2/mock/package-use.html...>
Generating <https://builds.apache.org/job/Struts-master-JDK7/ws/core/target/apidocs/com/opensymphony/xwork2/ognl/package-use.html...>
Generating <https://builds.apache.org/job/Struts-master-JDK7/ws/core/target/apidocs/com/opensymphony/xwork2/ognl/accessor/package-use.html...>
Generating <https://builds.apache.org/job/Struts-master-JDK7/ws/core/target/apidocs/com/opensymphony/xwork2/result/package-use.html...>
Generating <https://builds.apache.org/job/Struts-master-JDK7/ws/core/target/apidocs/com/opensymphony/xwork2/security/package-use.html...>
Generating <https://builds.apache.org/job/Struts-master-JDK7/ws/core/target/apidocs/com/opensymphony/xwork2/spring/package-use.html...>
Generating <https://builds.apache.org/job/Struts-master-JDK7/ws/core/target/apidocs/com/opensymphony/xwork2/spring/interceptor/package-use.html...>
Generating <https://builds.apache.org/job/Struts-master-JDK7/ws/core/target/apidocs/com/opensymphony/xwork2/test/package-use.html...>
Generating <https://builds.apache.org/job/Struts-master-JDK7/ws/core/target/apidocs/com/opensymphony/xwork2/util/package-use.html...>
Generating <https://builds.apache.org/job/Struts-master-JDK7/ws/core/target/apidocs/com/opensymphony/xwork2/util/classloader/package-use.html...>
Generating <https://builds.apache.org/job/Struts-master-JDK7/ws/core/target/apidocs/com/opensymphony/xwork2/util/finder/package-use.html...>
Generating <https://builds.apache.org/job/Struts-master-JDK7/ws/core/target/apidocs/com/opensymphony/xwork2/util/fs/package-use.html...>
Generating <https://builds.apache.org/job/Struts-master-JDK7/ws/core/target/apidocs/com/opensymphony/xwork2/util/location/package-use.html...>
Generating <https://builds.apache.org/job/Struts-master-JDK7/ws/core/target/apidocs/com/opensymphony/xwork2/util/logging/package-use.html...>
Generating <https://builds.apache.org/job/Struts-master-JDK7/ws/core/target/apidocs/com/opensymphony/xwork2/util/logging/commons/package-use.html...>
Generating <https://builds.apache.org/job/Struts-master-JDK7/ws/core/target/apidocs/com/opensymphony/xwork2/util/logging/jdk/package-use.html...>
Generating <https://builds.apache.org/job/Struts-master-JDK7/ws/core/target/apidocs/com/opensymphony/xwork2/util/logging/log4j2/package-use.html...>
Generating <https://builds.apache.org/job/Struts-master-JDK7/ws/core/target/apidocs/com/opensymphony/xwork2/util/logging/slf4j/package-use.html...>
Generating <https://builds.apache.org/job/Struts-master-JDK7/ws/core/target/apidocs/com/opensymphony/xwork2/util/profiling/package-use.html...>
Generating <https://builds.apache.org/job/Struts-master-JDK7/ws/core/target/apidocs/com/opensymphony/xwork2/util/reflection/package-use.html...>
Generating <https://builds.apache.org/job/Struts-master-JDK7/ws/core/target/apidocs/com/opensymphony/xwork2/validator/package-use.html...>
Generating <https://builds.apache.org/job/Struts-master-JDK7/ws/core/target/apidocs/com/opensymphony/xwork2/validator/annotations/package-use.html...>
Generating <https://builds.apache.org/job/Struts-master-JDK7/ws/core/target/apidocs/com/opensymphony/xwork2/validator/validators/package-use.html...>
Generating <https://builds.apache.org/job/Struts-master-JDK7/ws/core/target/apidocs/org/apache/struts2/package-use.html...>
Generating <https://builds.apache.org/job/Struts-master-JDK7/ws/core/target/apidocs/org/apache/struts2/components/package-use.html...>
Generating <https://builds.apache.org/job/Struts-master-JDK7/ws/core/target/apidocs/org/apache/struts2/components/template/package-use.html...>
Generating <https://builds.apache.org/job/Struts-master-JDK7/ws/core/target/apidocs/org/apache/struts2/config/package-use.html...>
Generating <https://builds.apache.org/job/Struts-master-JDK7/ws/core/target/apidocs/org/apache/struts2/conversion/package-use.html...>
Generating <https://builds.apache.org/job/Struts-master-JDK7/ws/core/target/apidocs/org/apache/struts2/dispatcher/package-use.html...>
Generating <https://builds.apache.org/job/Struts-master-JDK7/ws/core/target/apidocs/org/apache/struts2/dispatcher/filter/package-use.html...>
Generating <https://builds.apache.org/job/Struts-master-JDK7/ws/core/target/apidocs/org/apache/struts2/dispatcher/listener/package-use.html...>
Generating <https://builds.apache.org/job/Struts-master-JDK7/ws/core/target/apidocs/org/apache/struts2/dispatcher/mapper/package-use.html...>
Generating <https://builds.apache.org/job/Struts-master-JDK7/ws/core/target/apidocs/org/apache/struts2/dispatcher/multipart/package-use.html...>
Generating <https://builds.apache.org/job/Struts-master-JDK7/ws/core/target/apidocs/org/apache/struts2/dispatcher/servlet/package-use.html...>
Generating <https://builds.apache.org/job/Struts-master-JDK7/ws/core/target/apidocs/org/apache/struts2/factory/package-use.html...>
Generating <https://builds.apache.org/job/Struts-master-JDK7/ws/core/target/apidocs/org/apache/struts2/interceptor/package-use.html...>
Generating <https://builds.apache.org/job/Struts-master-JDK7/ws/core/target/apidocs/org/apache/struts2/interceptor/debugging/package-use.html...>
Generating <https://builds.apache.org/job/Struts-master-JDK7/ws/core/target/apidocs/org/apache/struts2/interceptor/servlet/package-use.html...>
Generating <https://builds.apache.org/job/Struts-master-JDK7/ws/core/target/apidocs/org/apache/struts2/interceptor/validation/package-use.html...>
Generating <https://builds.apache.org/job/Struts-master-JDK7/ws/core/target/apidocs/org/apache/struts2/result/package-use.html...>
Generating <https://builds.apache.org/job/Struts-master-JDK7/ws/core/target/apidocs/org/apache/struts2/util/package-use.html...>
Generating <https://builds.apache.org/job/Struts-master-JDK7/ws/core/target/apidocs/org/apache/struts2/util/fs/package-use.html...>
Generating <https://builds.apache.org/job/Struts-master-JDK7/ws/core/target/apidocs/org/apache/struts2/util/tomcat/buf/package-use.html...>
Generating <https://builds.apache.org/job/Struts-master-JDK7/ws/core/target/apidocs/org/apache/struts2/views/package-use.html...>
Generating <https://builds.apache.org/job/Struts-master-JDK7/ws/core/target/apidocs/org/apache/struts2/views/annotations/package-use.html...>
Generating <https://builds.apache.org/job/Struts-master-JDK7/ws/core/target/apidocs/org/apache/struts2/views/freemarker/package-use.html...>
Generating <https://builds.apache.org/job/Struts-master-JDK7/ws/core/target/apidocs/org/apache/struts2/views/freemarker/tags/package-use.html...>
Generating <https://builds.apache.org/job/Struts-master-JDK7/ws/core/target/apidocs/org/apache/struts2/views/jsp/package-use.html...>
Generating <https://builds.apache.org/job/Struts-master-JDK7/ws/core/target/apidocs/org/apache/struts2/views/jsp/iterator/package-use.html...>
Generating <https://builds.apache.org/job/Struts-master-JDK7/ws/core/target/apidocs/org/apache/struts2/views/jsp/ui/package-use.html...>
Generating <https://builds.apache.org/job/Struts-master-JDK7/ws/core/target/apidocs/org/apache/struts2/views/util/package-use.html...>
Generating <https://builds.apache.org/job/Struts-master-JDK7/ws/core/target/apidocs/org/apache/struts2/views/velocity/package-use.html...>
Generating <https://builds.apache.org/job/Struts-master-JDK7/ws/core/target/apidocs/org/apache/struts2/views/velocity/components/package-use.html...>
Generating <https://builds.apache.org/job/Struts-master-JDK7/ws/core/target/apidocs/org/apache/struts2/views/xslt/package-use.html...>
Building index for all the packages and classes...
Generating <https://builds.apache.org/job/Struts-master-JDK7/ws/core/target/apidocs/overview-tree.html...>
Generating <https://builds.apache.org/job/Struts-master-JDK7/ws/core/target/apidocs/index-all.html...>
Generating <https://builds.apache.org/job/Struts-master-JDK7/ws/core/target/apidocs/deprecated-list.html...>
Building index for all classes...
Generating <https://builds.apache.org/job/Struts-master-JDK7/ws/core/target/apidocs/allclasses-frame.html...>
Generating <https://builds.apache.org/job/Struts-master-JDK7/ws/core/target/apidocs/allclasses-noframe.html...>
Generating <https://builds.apache.org/job/Struts-master-JDK7/ws/core/target/apidocs/index.html...>
Generating <https://builds.apache.org/job/Struts-master-JDK7/ws/core/target/apidocs/overview-summary.html...>
Generating <https://builds.apache.org/job/Struts-master-JDK7/ws/core/target/apidocs/help-doc.html...>
1 warning
[WARNING] Javadoc Warnings
[WARNING] <https://builds.apache.org/job/Struts-master-JDK7/ws/core/src/main/java/org/apache/struts2/dispatcher/multipart/MultiPartRequestWrapper.java>:58: warning - Tag @link: can't find addError(String) in org.apache.struts2.dispatcher.multipart.MultiPartRequestWrapper
[INFO] Building jar: <https://builds.apache.org/job/Struts-master-JDK7/ws/core/target/struts2-core-2.5.13-SNAPSHOT-javadoc.jar>
[INFO]
[INFO] --- maven-remote-resources-plugin:1.5:process (default) @ struts2-core ---
[INFO]
[INFO] --- maven-resources-plugin:2.6:resources (default-resources) @ struts2-core ---
[INFO] Using 'UTF-8' encoding to copy filtered resources.
[INFO] Copying 198 resources
[INFO] Copying 3 resources
[INFO]
[INFO] --- maven-compiler-plugin:3.1:compile (default-compile) @ struts2-core ---
[INFO] Changes detected - recompiling the module!
[INFO] Compiling 761 source files to <https://builds.apache.org/job/Struts-master-JDK7/ws/core/target/classes>
[WARNING] <https://builds.apache.org/job/Struts-master-JDK7/ws/core/src/main/java/com/opensymphony/xwork2/DefaultActionProxy.java>: Some input files use or override a deprecated API.
[WARNING] <https://builds.apache.org/job/Struts-master-JDK7/ws/core/src/main/java/com/opensymphony/xwork2/DefaultActionProxy.java>: Recompile with -Xlint:deprecation for details.
[WARNING] <https://builds.apache.org/job/Struts-master-JDK7/ws/core/src/main/java/org/apache/struts2/views/freemarker/tags/TagModel.java>: Some input files use unchecked or unsafe operations.
[WARNING] <https://builds.apache.org/job/Struts-master-JDK7/ws/core/src/main/java/org/apache/struts2/views/freemarker/tags/TagModel.java>: Recompile with -Xlint:unchecked for details.
[INFO]
[INFO] --- jshint-maven-plugin:1.6.0:lint (default) @ struts2-core ---
[INFO] using jshint version 2.5.6
[INFO] Using configuration file: <https://builds.apache.org/job/Struts-master-JDK7/ws/core/src/main/resources/jshint.conf.js>
[WARNING] Excluding <https://builds.apache.org/job/Struts-master-JDK7/ws/core/src/main/resources/org/apache/struts2/static/domTT.js>
[INFO]   <https://builds.apache.org/job/Struts-master-JDK7/ws/core/src/main/resources/template/css_xhtml/validation.js>
[INFO]   <https://builds.apache.org/job/Struts-master-JDK7/ws/core/src/main/resources/template/xhtml/validation.js>
[INFO]   <https://builds.apache.org/job/Struts-master-JDK7/ws/core/src/main/resources/jshint.conf.js>
[INFO]   <https://builds.apache.org/job/Struts-master-JDK7/ws/core/src/main/resources/org/apache/struts2/static/optiontransferselect.js>
[INFO]   <https://builds.apache.org/job/Struts-master-JDK7/ws/core/src/main/resources/org/apache/struts2/static/inputtransferselect.js>
[INFO]   <https://builds.apache.org/job/Struts-master-JDK7/ws/core/src/main/resources/org/apache/struts2/static/utils.js>
[INFO]   <https://builds.apache.org/job/Struts-master-JDK7/ws/core/src/main/resources/org/apache/struts2/interceptor/debugging/webconsole.js>
[INFO]
[INFO] --- maven-compiler-plugin:3.1:compile (default) @ struts2-core ---
[INFO] Changes detected - recompiling the module!
[INFO] Compiling 761 source files to <https://builds.apache.org/job/Struts-master-JDK7/ws/core/target/classes>
[WARNING] <https://builds.apache.org/job/Struts-master-JDK7/ws/core/src/main/java/com/opensymphony/xwork2/DefaultActionProxy.java>: Some input files use or override a deprecated API.
[WARNING] <https://builds.apache.org/job/Struts-master-JDK7/ws/core/src/main/java/com/opensymphony/xwork2/DefaultActionProxy.java>: Recompile with -Xlint:deprecation for details.
[WARNING] <https://builds.apache.org/job/Struts-master-JDK7/ws/core/src/main/java/org/apache/struts2/views/freemarker/tags/TagModel.java>: Some input files use unchecked or unsafe operations.
[WARNING] <https://builds.apache.org/job/Struts-master-JDK7/ws/core/src/main/java/org/apache/struts2/views/freemarker/tags/TagModel.java>: Recompile with -Xlint:unchecked for details.
[INFO]
[INFO] --- maven-bundle-plugin:2.1.0:manifest (bundle-manifest) @ struts2-core ---
[WARNING] Warning in manifest for org.apache.struts:struts2-core:jar:2.5.13-SNAPSHOT : Superfluous export-package instructions: [com, template.archive, org.apache, template, com.opensymphony, org.apache.struts2.util.tomcat, org]
[INFO]
[INFO] --- maven-resources-plugin:2.6:testResources (default-testResources) @ struts2-core ---
[INFO] Using 'UTF-8' encoding to copy filtered resources.
[INFO] Copying 339 resources
[INFO] Copying 3 resources
[INFO]
[INFO] --- maven-compiler-plugin:3.1:testCompile (default-testCompile) @ struts2-core ---
[INFO] Changes detected - recompiling the module!
[INFO] Compiling 402 source files to <https://builds.apache.org/job/Struts-master-JDK7/ws/core/target/test-classes>
[INFO] -------------------------------------------------------------
[WARNING] COMPILATION WARNING :
[INFO] -------------------------------------------------------------
[WARNING] <https://builds.apache.org/job/Struts-master-JDK7/ws/core/src/test/java/org/apache/struts2/StrutsInternalTestCase.java>: Some input files use or override a deprecated API.
[WARNING] <https://builds.apache.org/job/Struts-master-JDK7/ws/core/src/test/java/org/apache/struts2/StrutsInternalTestCase.java>: Recompile with -Xlint:deprecation for details.
[WARNING] <https://builds.apache.org/job/Struts-master-JDK7/ws/core/src/test/java/org/apache/struts2/components/UIBeanTest.java>: Some input files use unchecked or unsafe operations.
[WARNING] <https://builds.apache.org/job/Struts-master-JDK7/ws/core/src/test/java/org/apache/struts2/components/UIBeanTest.java>: Recompile with -Xlint:unchecked for details.
[INFO] 4 warnings
[INFO] -------------------------------------------------------------
[INFO] -------------------------------------------------------------
[ERROR] COMPILATION ERROR :
[INFO] -------------------------------------------------------------
[ERROR] <https://builds.apache.org/job/Struts-master-JDK7/ws/core/src/test/java/org/apache/struts2/views/jsp/ui/SelectTest.java>:[29,41] package com.sun.xml.internal.bind.v2.util does not exist
[ERROR] <https://builds.apache.org/job/Struts-master-JDK7/ws/core/src/test/java/org/apache/struts2/views/jsp/ui/SelectTest.java>:[29,41] package com.sun.xml.internal.bind.v2.util does not exist
[INFO] 2 errors
[INFO] -------------------------------------------------------------
[INFO] ------------------------------------------------------------------------
[INFO] Reactor Summary:
[INFO]
[INFO] Struts 2 Bill of Materials ......................... SUCCESS [  9.918 s]
[INFO] Struts 2 ........................................... SUCCESS [ 12.228 s]
[INFO] Struts 2 Core ...................................... FAILURE [ 42.565 s]
[INFO] Struts Plugins ..................................... SKIPPED
[INFO] Struts 2 Configuration Browser Plugin .............. SKIPPED
[INFO] Struts 2 Sitemesh Plugin ........................... SKIPPED
[INFO] Struts 2 Tiles Plugin .............................. SKIPPED
[INFO] Struts 2 DWR Plugin ................................ SKIPPED
[INFO] Struts 2 Spring Plugin ............................. SKIPPED
[INFO] Struts 2 Convention Plugin ......................... SKIPPED
[INFO] Struts 2 JUnit Plugin .............................. SKIPPED
[INFO] Struts 2 JSON Plugin ............................... SKIPPED
[INFO] Struts 2 Bean Validation Plugin .................... SKIPPED
[INFO] Struts 2 Webapps ................................... SKIPPED
[INFO] Struts 2 Showcase Webapp ........................... SKIPPED
[INFO] Struts 2 REST Plugin ............................... SKIPPED
[INFO] Struts 2 Rest Showcase Webapp ...................... SKIPPED
[INFO] Struts 2 CDI Plugin ................................ SKIPPED
[INFO] Struts 2 Embedded JSP Plugin ....................... SKIPPED
[INFO] Struts 2 GXP Plugin ................................ SKIPPED
[INFO] Struts 2 Jasper Reports Plugin ..................... SKIPPED
[INFO] Struts 2 Java Templates Plugin ..................... SKIPPED
[INFO] Struts 2 JFreeChart Plugin ......................... SKIPPED
[INFO] Struts 2 OSGi Plugin ............................... SKIPPED
[INFO] Struts 2 OVal Plugin ............................... SKIPPED
[INFO] Struts 2 Pell Multipart Plugin ..................... SKIPPED
[INFO] Struts 2 Plexus Plugin ............................. SKIPPED
[INFO] Struts 2 Portlet Plugin ............................ SKIPPED
[INFO] Struts 2 Portlet Tiles Plugin ...................... SKIPPED
[INFO] DEPRECATED: Struts 2 Sitegraph Plugin .............. SKIPPED
[INFO] Struts 2 TestNG Plugin ............................. SKIPPED
[INFO] Struts OSGi Bundles ................................ SKIPPED
[INFO] Struts 2 OSGi Admin Bundle ......................... SKIPPED
[INFO] Struts 2 OSGi Demo Bundle .......................... SKIPPED
[INFO] Struts 2 Assembly .................................. SKIPPED
[INFO] ------------------------------------------------------------------------
[INFO] BUILD FAILURE
[INFO] ------------------------------------------------------------------------
[INFO] Total time: 01:08 min
[INFO] Finished at: 2017-08-06T06:04:25Z
[INFO] Final Memory: 75M/1904M
[INFO] ------------------------------------------------------------------------
[ERROR] Failed to execute goal org.apache.maven.plugins:maven-compiler-plugin:3.1:testCompile (default-testCompile) on project struts2-core: Compilation failure: Compilation failure:
[ERROR] <https://builds.apache.org/job/Struts-master-JDK7/ws/core/src/test/java/org/apache/struts2/views/jsp/ui/SelectTest.java>:[29,41] package com.sun.xml.internal.bind.v2.util does not exist
[ERROR] <https://builds.apache.org/job/Struts-master-JDK7/ws/core/src/test/java/org/apache/struts2/views/jsp/ui/SelectTest.java>:[29,41] package com.sun.xml.internal.bind.v2.util does not exist
[ERROR] -> [Help 1]
[ERROR]
[ERROR] To see the full stack trace of the errors, re-run Maven with the -e switch.
[ERROR] Re-run Maven using the -X switch to enable full debug logging.
[ERROR]
[ERROR] For more information about the errors and possible solutions, please read the following articles:
[ERROR] [Help 1] http://cwiki.apache.org/confluence/display/MAVEN/MojoFailureException
[ERROR]
[ERROR] After correcting the problems, you can resume the build with the command
[ERROR]   mvn <goals> -rf :struts2-core
Build step 'Execute shell' marked build as failure
[locks-and-latches] Releasing all the locks
[locks-and-latches] All the locks released
ERROR: Step ?JIRA: Update relevant issues? aborted due to exception:
java.lang.ClassNotFoundException: com.atlassian.fugue.Effect
        at jenkins.util.AntClassLoader.findClassInComponents(AntClassLoader.java:1374)
        at jenkins.util.AntClassLoader.findClass(AntClassLoader.java:1327)
        at jenkins.util.AntClassLoader.loadClass(AntClassLoader.java:1080)
        at java.lang.ClassLoader.loadClass(ClassLoader.java:357)
Caused: java.lang.NoClassDefFoundError: com/atlassian/fugue/Effect
        at com.atlassian.httpclient.apache.httpcomponents.DefaultHttpClientFactory.doCreate(DefaultHttpClientFactory.java:68)
        at com.atlassian.httpclient.apache.httpcomponents.DefaultHttpClientFactory.create(DefaultHttpClientFactory.java:35)
        at com.atlassian.jira.rest.client.internal.async.AsynchronousHttpClientFactory.createClient(AsynchronousHttpClientFactory.java:63)
        at com.atlassian.jira.rest.client.internal.async.AsynchronousJiraRestClientFactory.create(AsynchronousJiraRestClientFactory.java:35)
        at com.atlassian.jira.rest.client.internal.async.AsynchronousJiraRestClientFactory.createWithBasicHttpAuthentication(AsynchronousJiraRestClientFactory.java:42)
        at hudson.plugins.jira.JiraSite.createSession(JiraSite.java:280)
        at hudson.plugins.jira.JiraSite.getSession(JiraSite.java:255)
        at hudson.plugins.jira.Updater.perform(Updater.java:95)
        at hudson.plugins.jira.JiraIssueUpdater.perform(JiraIssueUpdater.java:64)
        at hudson.tasks.BuildStepCompatibilityLayer.perform(BuildStepCompatibilityLayer.java:81)
        at hudson.tasks.BuildStepMonitor$3.perform(BuildStepMonitor.java:45)
        at hudson.model.AbstractBuild$AbstractBuildExecution.perform(AbstractBuild.java:735)
        at hudson.model.AbstractBuild$AbstractBuildExecution.performAllBuildSteps(AbstractBuild.java:676)
        at hudson.model.Build$BuildExecution.post2(Build.java:186)
        at hudson.model.AbstractBuild$AbstractBuildExecution.post(AbstractBuild.java:621)
        at hudson.model.Run.execute(Run.java:1760)
        at hudson.model.FreeStyleBuild.run(FreeStyleBuild.java:43)
        at hudson.model.ResourceController.execute(ResourceController.java:97)
        at hudson.model.Executor.run(Executor.java:405)
Setting MAVEN_3_LATEST__HOME=/home/jenkins/tools/maven/latest3/

---------------------------------------------------------------------
To unsubscribe, e-mail: [hidden email]
For additional commands, e-mail: [hidden email]

Loading...