Build failed in Jenkins: Struts-examples-JDK8-master #43

classic Classic list List threaded Threaded
6 messages Options
Reply | Threaded
Open this post in threaded view
|  
Report Content as Inappropriate

Build failed in Jenkins: Struts-examples-JDK8-master #43

Apache Jenkins Server-2
See <https://builds.apache.org/job/Struts-examples-JDK8-master/43/changes>

Changes:

[Lukasz Lenart] Uses the latest snapsho version

[Lukasz Lenart] Updates config to be aligned with SMI

------------------------------------------
[...truncated 70 lines...]
[WARNING]
[WARNING] Some problems were encountered while building the effective model for org.apache.struts:file-upload:war:1.0.0
[WARNING] 'build.plugins.plugin.version' for org.apache.maven.plugins:maven-javadoc-plugin is missing. @ org.apache.struts:struts-examples:1.0.0, <https://builds.apache.org/job/Struts-examples-JDK8-master/ws/pom.xml,> line 105, column 21
[WARNING]
[WARNING] Some problems were encountered while building the effective model for org.apache.struts:form-processing:war:1.0.0
[WARNING] 'build.plugins.plugin.version' for org.apache.maven.plugins:maven-javadoc-plugin is missing. @ org.apache.struts:struts-examples:1.0.0, <https://builds.apache.org/job/Struts-examples-JDK8-master/ws/pom.xml,> line 105, column 21
[WARNING] The expression ${artifactId} is deprecated. Please use ${project.artifactId} instead.
[WARNING]
[WARNING] Some problems were encountered while building the effective model for org.apache.struts:form-tags:war:1.0.0
[WARNING] 'build.plugins.plugin.version' for org.apache.maven.plugins:maven-javadoc-plugin is missing. @ org.apache.struts:struts-examples:1.0.0, <https://builds.apache.org/job/Struts-examples-JDK8-master/ws/pom.xml,> line 105, column 21
[WARNING] The expression ${artifactId} is deprecated. Please use ${project.artifactId} instead.
[WARNING]
[WARNING] Some problems were encountered while building the effective model for org.apache.struts:form-validation:war:1.0.0
[WARNING] 'build.plugins.plugin.version' for org.apache.maven.plugins:maven-javadoc-plugin is missing. @ org.apache.struts:struts-examples:1.0.0, <https://builds.apache.org/job/Struts-examples-JDK8-master/ws/pom.xml,> line 105, column 21
[WARNING] The expression ${artifactId} is deprecated. Please use ${project.artifactId} instead.
[WARNING]
[WARNING] Some problems were encountered while building the effective model for org.apache.struts:form-xml-validation:war:1.0.0
[WARNING] 'build.plugins.plugin.version' for org.apache.maven.plugins:maven-javadoc-plugin is missing. @ org.apache.struts:struts-examples:1.0.0, <https://builds.apache.org/job/Struts-examples-JDK8-master/ws/pom.xml,> line 105, column 21
[WARNING] The expression ${artifactId} is deprecated. Please use ${project.artifactId} instead.
[WARNING]
[WARNING] Some problems were encountered while building the effective model for org.apache.struts:helloworld:war:1.0.0
[WARNING] 'build.plugins.plugin.version' for org.apache.maven.plugins:maven-javadoc-plugin is missing. @ org.apache.struts:struts-examples:1.0.0, <https://builds.apache.org/job/Struts-examples-JDK8-master/ws/pom.xml,> line 105, column 21
[WARNING] The expression ${artifactId} is deprecated. Please use ${project.artifactId} instead.
[WARNING]
[WARNING] Some problems were encountered while building the effective model for org.apache.struts:http-session:war:1.0.0
[WARNING] 'build.plugins.plugin.version' for org.apache.maven.plugins:maven-javadoc-plugin is missing. @ org.apache.struts:struts-examples:1.0.0, <https://builds.apache.org/job/Struts-examples-JDK8-master/ws/pom.xml,> line 105, column 21
[WARNING] The expression ${artifactId} is deprecated. Please use ${project.artifactId} instead.
[WARNING]
[WARNING] Some problems were encountered while building the effective model for org.apache.struts:interceptors:war:1.0.0
[WARNING] 'build.plugins.plugin.version' for org.apache.maven.plugins:maven-javadoc-plugin is missing. @ org.apache.struts:struts-examples:1.0.0, <https://builds.apache.org/job/Struts-examples-JDK8-master/ws/pom.xml,> line 105, column 21
[WARNING] The expression ${artifactId} is deprecated. Please use ${project.artifactId} instead.
[WARNING]
[WARNING] Some problems were encountered while building the effective model for org.demo:json:war:1.0-SNAPSHOT
[WARNING] 'build.plugins.plugin.version' for org.apache.maven.plugins:maven-javadoc-plugin is missing. @ org.apache.struts:struts-examples:1.0.0, <https://builds.apache.org/job/Struts-examples-JDK8-master/ws/pom.xml,> line 105, column 21
[WARNING]
[WARNING] Some problems were encountered while building the effective model for org.apache.struts:mailreader:war:1.0.0
[WARNING] 'build.plugins.plugin.version' for org.apache.maven.plugins:maven-javadoc-plugin is missing. @ org.apache.struts:struts-examples:1.0.0, <https://builds.apache.org/job/Struts-examples-JDK8-master/ws/pom.xml,> line 105, column 21
[WARNING] The expression ${artifactId} is deprecated. Please use ${project.artifactId} instead.
[WARNING]
[WARNING] Some problems were encountered while building the effective model for org.apache.struts:message-resource:war:1.0.0
[WARNING] 'build.plugins.plugin.version' for org.apache.maven.plugins:maven-javadoc-plugin is missing. @ org.apache.struts:struts-examples:1.0.0, <https://builds.apache.org/job/Struts-examples-JDK8-master/ws/pom.xml,> line 105, column 21
[WARNING] The expression ${artifactId} is deprecated. Please use ${project.artifactId} instead.
[WARNING]
[WARNING] Some problems were encountered while building the effective model for org.apache.struts:portlet:war:1.0.0
[WARNING] 'build.plugins.plugin.version' for org.apache.maven.plugins:maven-surefire-plugin is missing. @ org.apache.struts:portlet:[unknown-version], <https://builds.apache.org/job/Struts-examples-JDK8-master/ws/portlet/pom.xml,> line 180, column 21
[WARNING] 'build.plugins.plugin.version' for org.apache.maven.plugins:maven-javadoc-plugin is missing. @ org.apache.struts:struts-examples:1.0.0, <https://builds.apache.org/job/Struts-examples-JDK8-master/ws/pom.xml,> line 105, column 21
[WARNING]
[WARNING] Some problems were encountered while building the effective model for org.apache.struts:preparable-interface:war:1.0.0
[WARNING] 'build.plugins.plugin.version' for org.apache.maven.plugins:maven-javadoc-plugin is missing. @ org.apache.struts:struts-examples:1.0.0, <https://builds.apache.org/job/Struts-examples-JDK8-master/ws/pom.xml,> line 105, column 21
[WARNING] The expression ${artifactId} is deprecated. Please use ${project.artifactId} instead.
[WARNING]
[WARNING] Some problems were encountered while building the effective model for org.apache.struts:restful2actionmapper:war:1.0.0
[WARNING] 'build.plugins.plugin.version' for org.apache.maven.plugins:maven-javadoc-plugin is missing. @ org.apache.struts:struts-examples:1.0.0, <https://builds.apache.org/job/Struts-examples-JDK8-master/ws/pom.xml,> line 105, column 21
[WARNING] The expression ${artifactId} is deprecated. Please use ${project.artifactId} instead.
[WARNING]
[WARNING] Some problems were encountered while building the effective model for org.apache.struts:rest-angular:jar:1.0.0
[WARNING] 'build.plugins.plugin.version' for org.apache.maven.plugins:maven-javadoc-plugin is missing. @ org.apache.struts:struts-examples:1.0.0, <https://builds.apache.org/job/Struts-examples-JDK8-master/ws/pom.xml,> line 105, column 21
[WARNING] 'build.plugins.plugin.version' for com.cj.jshintmojo:jshint-maven-plugin is missing. @ org.apache.struts:rest-angular:[unknown-version], <https://builds.apache.org/job/Struts-examples-JDK8-master/ws/rest-angular/pom.xml,> line 125, column 21
[WARNING] The expression ${artifactId} is deprecated. Please use ${project.artifactId} instead.
[WARNING]
[WARNING] Some problems were encountered while building the effective model for org.apache.struts:spring-struts:war:1.0.0
[WARNING] 'build.plugins.plugin.version' for org.apache.maven.plugins:maven-javadoc-plugin is missing. @ org.apache.struts:struts-examples:1.0.0, <https://builds.apache.org/job/Struts-examples-JDK8-master/ws/pom.xml,> line 105, column 21
[WARNING] The expression ${artifactId} is deprecated. Please use ${project.artifactId} instead.
[WARNING]
[WARNING] Some problems were encountered while building the effective model for org.apache.struts:tiles:war:1.0.0
[WARNING] 'build.plugins.plugin.version' for org.apache.maven.plugins:maven-javadoc-plugin is missing. @ org.apache.struts:struts-examples:1.0.0, <https://builds.apache.org/job/Struts-examples-JDK8-master/ws/pom.xml,> line 105, column 21
[WARNING]
[WARNING] Some problems were encountered while building the effective model for org.apache.struts:themes:war:1.0.0
[WARNING] 'build.plugins.plugin.version' for org.apache.maven.plugins:maven-javadoc-plugin is missing. @ org.apache.struts:struts-examples:1.0.0, <https://builds.apache.org/job/Struts-examples-JDK8-master/ws/pom.xml,> line 105, column 21
[WARNING] The expression ${artifactId} is deprecated. Please use ${project.artifactId} instead.
[WARNING]
[WARNING] Some problems were encountered while building the effective model for org.apache.struts:themes-override:war:1.0.0
[WARNING] 'build.plugins.plugin.version' for org.apache.maven.plugins:maven-javadoc-plugin is missing. @ org.apache.struts:struts-examples:1.0.0, <https://builds.apache.org/job/Struts-examples-JDK8-master/ws/pom.xml,> line 105, column 21
[WARNING]
[WARNING] Some problems were encountered while building the effective model for org.apache.struts:using-tags:war:1.0.0
[WARNING] 'build.plugins.plugin.version' for org.apache.maven.plugins:maven-javadoc-plugin is missing. @ org.apache.struts:struts-examples:1.0.0, <https://builds.apache.org/job/Struts-examples-JDK8-master/ws/pom.xml,> line 105, column 21
[WARNING] The expression ${artifactId} is deprecated. Please use ${project.artifactId} instead.
[WARNING]
[WARNING] Some problems were encountered while building the effective model for org.apache.struts:unit-testing:war:1.0.0
[WARNING] 'build.plugins.plugin.version' for org.apache.maven.plugins:maven-javadoc-plugin is missing. @ org.apache.struts:struts-examples:1.0.0, <https://builds.apache.org/job/Struts-examples-JDK8-master/ws/pom.xml,> line 105, column 21
[WARNING] The expression ${artifactId} is deprecated. Please use ${project.artifactId} instead.
[WARNING]
[WARNING] Some problems were encountered while building the effective model for org.apache.struts:wildcard-method-selection:war:1.0.0
[WARNING] 'build.plugins.plugin.version' for org.apache.maven.plugins:maven-javadoc-plugin is missing. @ org.apache.struts:struts-examples:1.0.0, <https://builds.apache.org/job/Struts-examples-JDK8-master/ws/pom.xml,> line 105, column 21
[WARNING] The expression ${artifactId} is deprecated. Please use ${project.artifactId} instead.
[WARNING]
[WARNING] Some problems were encountered while building the effective model for org.apache.struts:message-store:war:1.0-SNAPSHOT
[WARNING] 'build.plugins.plugin.version' for org.apache.maven.plugins:maven-javadoc-plugin is missing. @ org.apache.struts:struts-examples:1.0.0, <https://builds.apache.org/job/Struts-examples-JDK8-master/ws/pom.xml,> line 105, column 21
[WARNING]
[WARNING] Some problems were encountered while building the effective model for org.apache.struts:type-conversion:war:1.0.0
[WARNING] 'build.plugins.plugin.version' for org.apache.maven.plugins:maven-javadoc-plugin is missing. @ org.apache.struts:struts-examples:1.0.0, <https://builds.apache.org/job/Struts-examples-JDK8-master/ws/pom.xml,> line 105, column 21
[WARNING]
[WARNING] Some problems were encountered while building the effective model for org.apache.struts:wildcard-regex:war:1
[WARNING] 'build.plugins.plugin.version' for org.apache.maven.plugins:maven-javadoc-plugin is missing. @ org.apache.struts:struts-examples:1.0.0, <https://builds.apache.org/job/Struts-examples-JDK8-master/ws/pom.xml,> line 105, column 21
[WARNING]
[WARNING] Some problems were encountered while building the effective model for org.apache.org:unknown-handler:war:1.0.0
[WARNING] 'build.plugins.plugin.version' for org.apache.maven.plugins:maven-javadoc-plugin is missing. @ org.apache.struts:struts-examples:1.0.0, <https://builds.apache.org/job/Struts-examples-JDK8-master/ws/pom.xml,> line 105, column 21
[WARNING]
[WARNING] Some problems were encountered while building the effective model for org.apache.struts:struts-examples:pom:1.0.0
[WARNING] 'build.plugins.plugin.version' for org.apache.maven.plugins:maven-javadoc-plugin is missing. @ line 105, column 21
[WARNING]
[WARNING] It is highly recommended to fix these problems because they threaten the stability of your build.
[WARNING]
[WARNING] For this reason, future Maven versions might no longer support building such malformed projects.
[WARNING]
[INFO] ------------------------------------------------------------------------
[INFO] Reactor Build Order:
[INFO]
[INFO] Struts 2 Examples
[INFO] Annotations with Convention Plugin
[INFO] Basic Struts2 Example
[INFO] Bean Validation
[INFO] Struts 2 Blank Webapp
[INFO] Coding Struts 2 Action
[INFO] Control Tags
[INFO] Debugging Struts
[INFO] Exception handling
[INFO] Exclude Parameters
[INFO] File upload
[INFO] Form Processing
[INFO] Form Tags
[INFO] Form validation
[INFO] XML based form validation
[INFO] Hello World Struts 2 Example Application
[INFO] http-session
[INFO] Struts 2 Interceptors
[INFO] json
[INFO] Struts 2 Mail Reader Webapp
[INFO] Message resource
[INFO] Portlet Webapp
[INFO] Preparable Interface
[INFO] REST to Action Mapper Example Application
[INFO] REST Plugin based application with AngularJS
[INFO] Struts2 with Spring Integration
[INFO] Struts Tiles Example
[INFO] Struts 2 Themes
[INFO] Struts 2 Themes Override
[INFO] Using Struts 2 Tags
[INFO] Unit Testing
[INFO] Wildcard Method Selection
[INFO] Message Store
[INFO] Type Conversion
[INFO] Wildcard RegEx pattern matching
[INFO] Unknown handler
[INFO]                                                                        
[INFO] ------------------------------------------------------------------------
[INFO] Building Struts 2 Examples 1.0.0
[INFO] ------------------------------------------------------------------------
[INFO]                                                                        
[INFO] ------------------------------------------------------------------------
[INFO] Building Annotations with Convention Plugin 1.0.0
[INFO] ------------------------------------------------------------------------
[WARNING] The POM for org.apache.struts:struts2-convention-plugin:jar:2.5.9-SNAPSHOT is missing, no dependency information available
[WARNING] The POM for org.apache.struts:struts2-core:jar:2.5.9-SNAPSHOT is missing, no dependency information available
[INFO] ------------------------------------------------------------------------
[INFO] Reactor Summary:
[INFO]
[INFO] Struts 2 Examples .................................. SUCCESS [  0.402 s]
[INFO] Annotations with Convention Plugin ................. FAILURE [  0.387 s]
[INFO] Basic Struts2 Example .............................. SKIPPED
[INFO] Bean Validation .................................... SKIPPED
[INFO] Struts 2 Blank Webapp .............................. SKIPPED
[INFO] Coding Struts 2 Action ............................. SKIPPED
[INFO] Control Tags ....................................... SKIPPED
[INFO] Debugging Struts ................................... SKIPPED
[INFO] Exception handling ................................. SKIPPED
[INFO] Exclude Parameters ................................. SKIPPED
[INFO] File upload ........................................ SKIPPED
[INFO] Form Processing .................................... SKIPPED
[INFO] Form Tags .......................................... SKIPPED
[INFO] Form validation .................................... SKIPPED
[INFO] XML based form validation .......................... SKIPPED
[INFO] Hello World Struts 2 Example Application ........... SKIPPED
[INFO] http-session ....................................... SKIPPED
[INFO] Struts 2 Interceptors .............................. SKIPPED
[INFO] json ............................................... SKIPPED
[INFO] Struts 2 Mail Reader Webapp ........................ SKIPPED
[INFO] Message resource ................................... SKIPPED
[INFO] Portlet Webapp ..................................... SKIPPED
[INFO] Preparable Interface ............................... SKIPPED
[INFO] REST to Action Mapper Example Application .......... SKIPPED
[INFO] REST Plugin based application with AngularJS ....... SKIPPED
[INFO] Struts2 with Spring Integration .................... SKIPPED
[INFO] Struts Tiles Example ............................... SKIPPED
[INFO] Struts 2 Themes .................................... SKIPPED
[INFO] Struts 2 Themes Override ........................... SKIPPED
[INFO] Using Struts 2 Tags ................................ SKIPPED
[INFO] Unit Testing ....................................... SKIPPED
[INFO] Wildcard Method Selection .......................... SKIPPED
[INFO] Message Store ...................................... SKIPPED
[INFO] Type Conversion .................................... SKIPPED
[INFO] Wildcard RegEx pattern matching .................... SKIPPED
[INFO] Unknown handler .................................... SKIPPED
[INFO] ------------------------------------------------------------------------
[INFO] BUILD FAILURE
[INFO] ------------------------------------------------------------------------
[INFO] Total time: 4.649 s
[INFO] Finished at: 2017-01-02T09:29:38+00:00
[INFO] Final Memory: 14M/197M
[INFO] ------------------------------------------------------------------------
[ERROR] Failed to execute goal on project annotations: Could not resolve dependencies for project org.apache.struts:annotations:war:1.0.0: The following artifacts could not be resolved: org.apache.struts:struts2-convention-plugin:jar:2.5.9-SNAPSHOT, org.apache.struts:struts2-core:jar:2.5.9-SNAPSHOT: Could not find artifact org.apache.struts:struts2-convention-plugin:jar:2.5.9-SNAPSHOT -> [Help 1]
[ERROR]
[ERROR] To see the full stack trace of the errors, re-run Maven with the -e switch.
[ERROR] Re-run Maven using the -X switch to enable full debug logging.
[ERROR]
[ERROR] For more information about the errors and possible solutions, please read the following articles:
[ERROR] [Help 1] http://cwiki.apache.org/confluence/display/MAVEN/DependencyResolutionException
[ERROR]
[ERROR] After correcting the problems, you can resume the build with the command
[ERROR]   mvn <goals> -rf :annotations
[JENKINS] Archiving <https://builds.apache.org/job/Struts-examples-JDK8-master/ws/preparable-interface/pom.xml> to org.apache.struts/preparable-interface/1.0.0/preparable-interface-1.0.0.pom
[JENKINS] Archiving <https://builds.apache.org/job/Struts-examples-JDK8-master/ws/bean-validation/pom.xml> to org.apache.struts/bean-validation/1.0.0/bean-validation-1.0.0.pom
[JENKINS] Archiving <https://builds.apache.org/job/Struts-examples-JDK8-master/ws/debugging-struts/pom.xml> to org.apache.struts/debugging-struts/1.0.0/debugging-struts-1.0.0.pom
[JENKINS] Archiving <https://builds.apache.org/job/Struts-examples-JDK8-master/ws/wildcard-method-selection/pom.xml> to org.apache.struts/wildcard-method-selection/1.0.0/wildcard-method-selection-1.0.0.pom
[JENKINS] Archiving <https://builds.apache.org/job/Struts-examples-JDK8-master/ws/unit-testing/pom.xml> to org.apache.struts/unit-testing/1.0.0/unit-testing-1.0.0.pom
[JENKINS] Archiving <https://builds.apache.org/job/Struts-examples-JDK8-master/ws/http-session/pom.xml> to org.apache.struts/http-session/1.0.0/http-session-1.0.0.pom
[JENKINS] Archiving <https://builds.apache.org/job/Struts-examples-JDK8-master/ws/message-resource/pom.xml> to org.apache.struts/message-resource/1.0.0/message-resource-1.0.0.pom
[JENKINS] Archiving <https://builds.apache.org/job/Struts-examples-JDK8-master/ws/portlet/pom.xml> to org.apache.struts/portlet/1.0.0/portlet-1.0.0.pom
[JENKINS] Archiving <https://builds.apache.org/job/Struts-examples-JDK8-master/ws/wildcard-regex/pom.xml> to org.apache.struts/wildcard-regex/1/wildcard-regex-1.pom
[JENKINS] Archiving <https://builds.apache.org/job/Struts-examples-JDK8-master/ws/form-tags/pom.xml> to org.apache.struts/form-tags/1.0.0/form-tags-1.0.0.pom
[JENKINS] Archiving <https://builds.apache.org/job/Struts-examples-JDK8-master/ws/unknown-handler/pom.xml> to org.apache.org/unknown-handler/1.0.0/unknown-handler-1.0.0.pom
[JENKINS] Archiving <https://builds.apache.org/job/Struts-examples-JDK8-master/ws/helloworld/pom.xml> to org.apache.struts/helloworld/1.0.0/helloworld-1.0.0.pom
[JENKINS] Archiving <https://builds.apache.org/job/Struts-examples-JDK8-master/ws/restful2actionmapper/pom.xml> to org.apache.struts/restful2actionmapper/1.0.0/restful2actionmapper-1.0.0.pom
[JENKINS] Archiving <https://builds.apache.org/job/Struts-examples-JDK8-master/ws/message-store/pom.xml> to org.apache.struts/message-store/1.0-SNAPSHOT/message-store-1.0-SNAPSHOT.pom
[JENKINS] Archiving <https://builds.apache.org/job/Struts-examples-JDK8-master/ws/themes/pom.xml> to org.apache.struts/themes/1.0.0/themes-1.0.0.pom
[JENKINS] Archiving <https://builds.apache.org/job/Struts-examples-JDK8-master/ws/rest-angular/pom.xml> to org.apache.struts/rest-angular/1.0.0/rest-angular-1.0.0.pom
[JENKINS] Archiving <https://builds.apache.org/job/Struts-examples-JDK8-master/ws/exception-handling/pom.xml> to org.apache.struts/exception-handling/1.0.0/exception-handling-1.0.0.pom
[JENKINS] Archiving <https://builds.apache.org/job/Struts-examples-JDK8-master/ws/form-processing/pom.xml> to org.apache.struts/form-processing/1.0.0/form-processing-1.0.0.pom
[JENKINS] Archiving <https://builds.apache.org/job/Struts-examples-JDK8-master/ws/mailreader/pom.xml> to org.apache.struts/mailreader/1.0.0/mailreader-1.0.0.pom
[JENKINS] Archiving <https://builds.apache.org/job/Struts-examples-JDK8-master/ws/type-conversion/pom.xml> to org.apache.struts/type-conversion/1.0.0/type-conversion-1.0.0.pom
[JENKINS] Archiving <https://builds.apache.org/job/Struts-examples-JDK8-master/ws/pom.xml> to org.apache.struts/struts-examples/1.0.0/struts-examples-1.0.0.pom
[JENKINS] Archiving <https://builds.apache.org/job/Struts-examples-JDK8-master/ws/file-upload/pom.xml> to org.apache.struts/file-upload/1.0.0/file-upload-1.0.0.pom
[JENKINS] Archiving <https://builds.apache.org/job/Struts-examples-JDK8-master/ws/blank/pom.xml> to org.apache.struts/blank/1.0.0/blank-1.0.0.pom
[JENKINS] Archiving <https://builds.apache.org/job/Struts-examples-JDK8-master/ws/spring-struts/pom.xml> to org.apache.struts/spring-struts/1.0.0/spring-struts-1.0.0.pom
[JENKINS] Archiving <https://builds.apache.org/job/Struts-examples-JDK8-master/ws/basic-struts/pom.xml> to org.apache.struts/basic-struts/1.0.0/basic-struts-1.0.0.pom
[JENKINS] Archiving <https://builds.apache.org/job/Struts-examples-JDK8-master/ws/themes-override/pom.xml> to org.apache.struts/themes-override/1.0.0/themes-override-1.0.0.pom
[JENKINS] Archiving <https://builds.apache.org/job/Struts-examples-JDK8-master/ws/json/pom.xml> to org.demo/json/1.0-SNAPSHOT/json-1.0-SNAPSHOT.pom
[JENKINS] Archiving <https://builds.apache.org/job/Struts-examples-JDK8-master/ws/interceptors/pom.xml> to org.apache.struts/interceptors/1.0.0/interceptors-1.0.0.pom
[JENKINS] Archiving <https://builds.apache.org/job/Struts-examples-JDK8-master/ws/tiles/pom.xml> to org.apache.struts/tiles/1.0.0/tiles-1.0.0.pom
[JENKINS] Archiving <https://builds.apache.org/job/Struts-examples-JDK8-master/ws/form-xml-validation/pom.xml> to org.apache.struts/form-xml-validation/1.0.0/form-xml-validation-1.0.0.pom
[JENKINS] Archiving <https://builds.apache.org/job/Struts-examples-JDK8-master/ws/exclude-parameters/pom.xml> to org.apache.struts/exclude-parameters/1.0.0/exclude-parameters-1.0.0.pom
[JENKINS] Archiving <https://builds.apache.org/job/Struts-examples-JDK8-master/ws/coding-actions/pom.xml> to org.apache.struts/coding-actions/1.0.0/coding-actions-1.0.0.pom
[JENKINS] Archiving <https://builds.apache.org/job/Struts-examples-JDK8-master/ws/using-tags/pom.xml> to org.apache.struts/using-tags/1.0.0/using-tags-1.0.0.pom
[JENKINS] Archiving <https://builds.apache.org/job/Struts-examples-JDK8-master/ws/control-tags/pom.xml> to org.apache.struts/control-tags/1.0.0/control-tags-1.0.0.pom
[JENKINS] Archiving <https://builds.apache.org/job/Struts-examples-JDK8-master/ws/annotations/pom.xml> to org.apache.struts/annotations/1.0.0/annotations-1.0.0.pom
[JENKINS] Archiving <https://builds.apache.org/job/Struts-examples-JDK8-master/ws/form-validation/pom.xml> to org.apache.struts/form-validation/1.0.0/form-validation-1.0.0.pom
[locks-and-latches] Releasing all the locks
[locks-and-latches] All the locks released
channel stopped

---------------------------------------------------------------------
To unsubscribe, e-mail: [hidden email]
For additional commands, e-mail: [hidden email]

Reply | Threaded
Open this post in threaded view
|  
Report Content as Inappropriate

Build failed in Jenkins: Struts-examples-JDK8-master #44

Apache Jenkins Server-2
See <https://builds.apache.org/job/Struts-examples-JDK8-master/44/changes>

Changes:

[Lukasz Lenart] Cleans up dependencies

------------------------------------------
[...truncated 16 lines...]
Checking out Revision bf1f646fda096b2f21a27023164f949f824a07a2 (refs/remotes/origin/master)
 > git config core.sparsecheckout # timeout=10
 > git checkout -f bf1f646fda096b2f21a27023164f949f824a07a2
 > git rev-list 06ddc54a6a668c8db8dedc1792ae82b4c422079e # timeout=10
[locks-and-latches] Checking to see if we really have the locks
[locks-and-latches] Have all the locks, build can start
Parsing POMs
Modules changed, recalculating dependency graph
Established TCP socket on 46380
maven32-agent.jar already up to date
maven32-interceptor.jar already up to date
maven3-interceptor-commons.jar already up to date
[Struts-examples-JDK8-master] $ /home/jenkins/tools/java/latest1.8/bin/java -Xms128m -Xmx768m -XX:MaxPermSize=256m -XX:PermSize=128m -cp /home/jenkins/jenkins-slave/maven32-agent.jar:/home/jenkins/tools/maven/latest3/boot/plexus-classworlds-2.5.2.jar:/home/jenkins/tools/maven/latest3/conf/logging jenkins.maven3.agent.Maven32Main /home/jenkins/tools/maven/latest3/ /home/jenkins/jenkins-slave/slave.jar /home/jenkins/jenkins-slave/maven32-interceptor.jar /home/jenkins/jenkins-slave/maven3-interceptor-commons.jar 46380
Java HotSpot(TM) 64-Bit Server VM warning: ignoring option MaxPermSize=256m; support was removed in 8.0
Java HotSpot(TM) 64-Bit Server VM warning: ignoring option PermSize=128m; support was removed in 8.0
<===[JENKINS REMOTING CAPACITY]===>   channel started
Executing Maven:  -B -f <https://builds.apache.org/job/Struts-examples-JDK8-master/ws/pom.xml> -Dmaven.repo.local=/home/jenkins/jenkins-slave/maven-repositories/1 package
[INFO] Scanning for projects...
[WARNING]
[WARNING] Some problems were encountered while building the effective model for org.apache.struts:annotations:war:1.0.0
[WARNING] The expression ${artifactId} is deprecated. Please use ${project.artifactId} instead.
[WARNING]
[WARNING] Some problems were encountered while building the effective model for org.apache.struts:basic-struts:war:1.0.0
[WARNING] The expression ${artifactId} is deprecated. Please use ${project.artifactId} instead.
[WARNING]
[WARNING] Some problems were encountered while building the effective model for org.apache.struts:bean-validation:war:1.0.0
[WARNING] The expression ${artifactId} is deprecated. Please use ${project.artifactId} instead.
[WARNING]
[WARNING] Some problems were encountered while building the effective model for org.apache.struts:blank:war:1.0.0
[WARNING] The expression ${artifactId} is deprecated. Please use ${project.artifactId} instead.
[WARNING]
[WARNING] Some problems were encountered while building the effective model for org.apache.struts:coding-actions:war:1.0.0
[WARNING] The expression ${artifactId} is deprecated. Please use ${project.artifactId} instead.
[WARNING]
[WARNING] Some problems were encountered while building the effective model for org.apache.struts:control-tags:war:1.0.0
[WARNING] The expression ${artifactId} is deprecated. Please use ${project.artifactId} instead.
[WARNING]
[WARNING] Some problems were encountered while building the effective model for org.apache.struts:debugging-struts:war:1.0.0
[WARNING] The expression ${artifactId} is deprecated. Please use ${project.artifactId} instead.
[WARNING]
[WARNING] Some problems were encountered while building the effective model for org.apache.struts:exception-handling:war:1.0.0
[WARNING] The expression ${artifactId} is deprecated. Please use ${project.artifactId} instead.
[WARNING]
[WARNING] Some problems were encountered while building the effective model for org.apache.struts:exclude-parameters:war:1.0.0
[WARNING] The expression ${artifactId} is deprecated. Please use ${project.artifactId} instead.
[WARNING]
[WARNING] Some problems were encountered while building the effective model for org.apache.struts:form-processing:war:1.0.0
[WARNING] The expression ${artifactId} is deprecated. Please use ${project.artifactId} instead.
[WARNING]
[WARNING] Some problems were encountered while building the effective model for org.apache.struts:form-tags:war:1.0.0
[WARNING] The expression ${artifactId} is deprecated. Please use ${project.artifactId} instead.
[WARNING]
[WARNING] Some problems were encountered while building the effective model for org.apache.struts:form-validation:war:1.0.0
[WARNING] The expression ${artifactId} is deprecated. Please use ${project.artifactId} instead.
[WARNING]
[WARNING] Some problems were encountered while building the effective model for org.apache.struts:form-xml-validation:war:1.0.0
[WARNING] The expression ${artifactId} is deprecated. Please use ${project.artifactId} instead.
[WARNING]
[WARNING] Some problems were encountered while building the effective model for org.apache.struts:helloworld:war:1.0.0
[WARNING] The expression ${artifactId} is deprecated. Please use ${project.artifactId} instead.
[WARNING]
[WARNING] Some problems were encountered while building the effective model for org.apache.struts:http-session:war:1.0.0
[WARNING] The expression ${artifactId} is deprecated. Please use ${project.artifactId} instead.
[WARNING]
[WARNING] Some problems were encountered while building the effective model for org.apache.struts:interceptors:war:1.0.0
[WARNING] The expression ${artifactId} is deprecated. Please use ${project.artifactId} instead.
[WARNING]
[WARNING] Some problems were encountered while building the effective model for org.apache.struts:mailreader:war:1.0.0
[WARNING] The expression ${artifactId} is deprecated. Please use ${project.artifactId} instead.
[WARNING]
[WARNING] Some problems were encountered while building the effective model for org.apache.struts:message-resource:war:1.0.0
[WARNING] The expression ${artifactId} is deprecated. Please use ${project.artifactId} instead.
[WARNING]
[WARNING] Some problems were encountered while building the effective model for org.apache.struts:portlet:war:1.0.0
[WARNING] 'build.plugins.plugin.version' for org.apache.maven.plugins:maven-surefire-plugin is missing. @ org.apache.struts:portlet:[unknown-version], <https://builds.apache.org/job/Struts-examples-JDK8-master/ws/portlet/pom.xml,> line 180, column 21
[WARNING]
[WARNING] Some problems were encountered while building the effective model for org.apache.struts:preparable-interface:war:1.0.0
[WARNING] The expression ${artifactId} is deprecated. Please use ${project.artifactId} instead.
[WARNING]
[WARNING] Some problems were encountered while building the effective model for org.apache.struts:restful2actionmapper:war:1.0.0
[WARNING] The expression ${artifactId} is deprecated. Please use ${project.artifactId} instead.
[WARNING]
[WARNING] Some problems were encountered while building the effective model for org.apache.struts:rest-angular:jar:1.0.0
[WARNING] 'build.plugins.plugin.version' for com.cj.jshintmojo:jshint-maven-plugin is missing. @ org.apache.struts:rest-angular:[unknown-version], <https://builds.apache.org/job/Struts-examples-JDK8-master/ws/rest-angular/pom.xml,> line 109, column 21
[WARNING] The expression ${artifactId} is deprecated. Please use ${project.artifactId} instead.
[WARNING]
[WARNING] Some problems were encountered while building the effective model for org.apache.struts:spring-struts:war:1.0.0
[WARNING] The expression ${artifactId} is deprecated. Please use ${project.artifactId} instead.
[WARNING]
[WARNING] Some problems were encountered while building the effective model for org.apache.struts:themes:war:1.0.0
[WARNING] The expression ${artifactId} is deprecated. Please use ${project.artifactId} instead.
[WARNING]
[WARNING] Some problems were encountered while building the effective model for org.apache.struts:using-tags:war:1.0.0
[WARNING] The expression ${artifactId} is deprecated. Please use ${project.artifactId} instead.
[WARNING]
[WARNING] Some problems were encountered while building the effective model for org.apache.struts:unit-testing:war:1.0.0
[WARNING] The expression ${artifactId} is deprecated. Please use ${project.artifactId} instead.
[WARNING]
[WARNING] Some problems were encountered while building the effective model for org.apache.struts:wildcard-method-selection:war:1.0.0
[WARNING] The expression ${artifactId} is deprecated. Please use ${project.artifactId} instead.
[WARNING]
[WARNING] It is highly recommended to fix these problems because they threaten the stability of your build.
[WARNING]
[WARNING] For this reason, future Maven versions might no longer support building such malformed projects.
[WARNING]
[INFO] ------------------------------------------------------------------------
[INFO] Reactor Build Order:
[INFO]
[INFO] Struts 2 Examples
[INFO] Annotations with Convention Plugin
[INFO] Basic Struts2 Example
[INFO] Bean Validation
[INFO] Struts 2 Blank Webapp
[INFO] Coding Struts 2 Action
[INFO] Control Tags
[INFO] Debugging Struts
[INFO] Exception handling
[INFO] Exclude Parameters
[INFO] File upload
[INFO] Form Processing
[INFO] Form Tags
[INFO] Form validation
[INFO] XML based form validation
[INFO] Hello World Struts 2 Example Application
[INFO] http-session
[INFO] Struts 2 Interceptors
[INFO] json
[INFO] Struts 2 Mail Reader Webapp
[INFO] Message resource
[INFO] Portlet Webapp
[INFO] Preparable Interface
[INFO] REST to Action Mapper Example Application
[INFO] REST Plugin based application with AngularJS
[INFO] Struts2 with Spring Integration
[INFO] Struts Tiles Example
[INFO] Struts 2 Themes
[INFO] Struts 2 Themes Override
[INFO] Using Struts 2 Tags
[INFO] Unit Testing
[INFO] Wildcard Method Selection
[INFO] Message Store
[INFO] Type Conversion
[INFO] Wildcard RegEx pattern matching
[INFO] Unknown handler
[INFO]                                                                        
[INFO] ------------------------------------------------------------------------
[INFO] Building Struts 2 Examples 1.0.0
[INFO] ------------------------------------------------------------------------
[INFO]                                                                        
[INFO] ------------------------------------------------------------------------
[INFO] Building Annotations with Convention Plugin 1.0.0
[INFO] ------------------------------------------------------------------------
[WARNING] The POM for org.apache.struts:struts2-convention-plugin:jar:2.5.9-SNAPSHOT is missing, no dependency information available
[WARNING] The POM for org.apache.struts:struts2-core:jar:2.5.9-SNAPSHOT is missing, no dependency information available
[INFO] ------------------------------------------------------------------------
[INFO] Reactor Summary:
[INFO]
[INFO] Struts 2 Examples .................................. SUCCESS [  0.185 s]
[INFO] Annotations with Convention Plugin ................. FAILURE [  0.391 s]
[INFO] Basic Struts2 Example .............................. SKIPPED
[INFO] Bean Validation .................................... SKIPPED
[INFO] Struts 2 Blank Webapp .............................. SKIPPED
[INFO] Coding Struts 2 Action ............................. SKIPPED
[INFO] Control Tags ....................................... SKIPPED
[INFO] Debugging Struts ................................... SKIPPED
[INFO] Exception handling ................................. SKIPPED
[INFO] Exclude Parameters ................................. SKIPPED
[INFO] File upload ........................................ SKIPPED
[INFO] Form Processing .................................... SKIPPED
[INFO] Form Tags .......................................... SKIPPED
[INFO] Form validation .................................... SKIPPED
[INFO] XML based form validation .......................... SKIPPED
[INFO] Hello World Struts 2 Example Application ........... SKIPPED
[INFO] http-session ....................................... SKIPPED
[INFO] Struts 2 Interceptors .............................. SKIPPED
[INFO] json ............................................... SKIPPED
[INFO] Struts 2 Mail Reader Webapp ........................ SKIPPED
[INFO] Message resource ................................... SKIPPED
[INFO] Portlet Webapp ..................................... SKIPPED
[INFO] Preparable Interface ............................... SKIPPED
[INFO] REST to Action Mapper Example Application .......... SKIPPED
[INFO] REST Plugin based application with AngularJS ....... SKIPPED
[INFO] Struts2 with Spring Integration .................... SKIPPED
[INFO] Struts Tiles Example ............................... SKIPPED
[INFO] Struts 2 Themes .................................... SKIPPED
[INFO] Struts 2 Themes Override ........................... SKIPPED
[INFO] Using Struts 2 Tags ................................ SKIPPED
[INFO] Unit Testing ....................................... SKIPPED
[INFO] Wildcard Method Selection .......................... SKIPPED
[INFO] Message Store ...................................... SKIPPED
[INFO] Type Conversion .................................... SKIPPED
[INFO] Wildcard RegEx pattern matching .................... SKIPPED
[INFO] Unknown handler .................................... SKIPPED
[INFO] ------------------------------------------------------------------------
[INFO] BUILD FAILURE
[INFO] ------------------------------------------------------------------------
[INFO] Total time: 4.913 s
[INFO] Finished at: 2017-01-02T11:29:45+00:00
[INFO] Final Memory: 12M/192M
[INFO] ------------------------------------------------------------------------
[ERROR] Failed to execute goal on project annotations: Could not resolve dependencies for project org.apache.struts:annotations:war:1.0.0: The following artifacts could not be resolved: org.apache.struts:struts2-convention-plugin:jar:2.5.9-SNAPSHOT, org.apache.struts:struts2-core:jar:2.5.9-SNAPSHOT: Could not find artifact org.apache.struts:struts2-convention-plugin:jar:2.5.9-SNAPSHOT -> [Help 1]
[ERROR]
[ERROR] To see the full stack trace of the errors, re-run Maven with the -e switch.
[ERROR] Re-run Maven using the -X switch to enable full debug logging.
[ERROR]
[ERROR] For more information about the errors and possible solutions, please read the following articles:
[ERROR] [Help 1] http://cwiki.apache.org/confluence/display/MAVEN/DependencyResolutionException
[ERROR]
[ERROR] After correcting the problems, you can resume the build with the command
[ERROR]   mvn <goals> -rf :annotations
[JENKINS] Archiving <https://builds.apache.org/job/Struts-examples-JDK8-master/ws/preparable-interface/pom.xml> to org.apache.struts/preparable-interface/1.0.0/preparable-interface-1.0.0.pom
[JENKINS] Archiving <https://builds.apache.org/job/Struts-examples-JDK8-master/ws/bean-validation/pom.xml> to org.apache.struts/bean-validation/1.0.0/bean-validation-1.0.0.pom
[JENKINS] Archiving <https://builds.apache.org/job/Struts-examples-JDK8-master/ws/debugging-struts/pom.xml> to org.apache.struts/debugging-struts/1.0.0/debugging-struts-1.0.0.pom
[JENKINS] Archiving <https://builds.apache.org/job/Struts-examples-JDK8-master/ws/wildcard-method-selection/pom.xml> to org.apache.struts/wildcard-method-selection/1.0.0/wildcard-method-selection-1.0.0.pom
[JENKINS] Archiving <https://builds.apache.org/job/Struts-examples-JDK8-master/ws/unit-testing/pom.xml> to org.apache.struts/unit-testing/1.0.0/unit-testing-1.0.0.pom
[JENKINS] Archiving <https://builds.apache.org/job/Struts-examples-JDK8-master/ws/http-session/pom.xml> to org.apache.struts/http-session/1.0.0/http-session-1.0.0.pom
[JENKINS] Archiving <https://builds.apache.org/job/Struts-examples-JDK8-master/ws/message-resource/pom.xml> to org.apache.struts/message-resource/1.0.0/message-resource-1.0.0.pom
[JENKINS] Archiving <https://builds.apache.org/job/Struts-examples-JDK8-master/ws/portlet/pom.xml> to org.apache.struts/portlet/1.0.0/portlet-1.0.0.pom
[JENKINS] Archiving <https://builds.apache.org/job/Struts-examples-JDK8-master/ws/wildcard-regex/pom.xml> to org.apache.struts/wildcard-regex/1/wildcard-regex-1.pom
[JENKINS] Archiving <https://builds.apache.org/job/Struts-examples-JDK8-master/ws/form-tags/pom.xml> to org.apache.struts/form-tags/1.0.0/form-tags-1.0.0.pom
[JENKINS] Archiving <https://builds.apache.org/job/Struts-examples-JDK8-master/ws/unknown-handler/pom.xml> to org.apache.org/unknown-handler/1.0.0/unknown-handler-1.0.0.pom
[JENKINS] Archiving <https://builds.apache.org/job/Struts-examples-JDK8-master/ws/helloworld/pom.xml> to org.apache.struts/helloworld/1.0.0/helloworld-1.0.0.pom
[JENKINS] Archiving <https://builds.apache.org/job/Struts-examples-JDK8-master/ws/restful2actionmapper/pom.xml> to org.apache.struts/restful2actionmapper/1.0.0/restful2actionmapper-1.0.0.pom
[JENKINS] Archiving <https://builds.apache.org/job/Struts-examples-JDK8-master/ws/message-store/pom.xml> to org.apache.struts/message-store/1.0-SNAPSHOT/message-store-1.0-SNAPSHOT.pom
[JENKINS] Archiving <https://builds.apache.org/job/Struts-examples-JDK8-master/ws/themes/pom.xml> to org.apache.struts/themes/1.0.0/themes-1.0.0.pom
[JENKINS] Archiving <https://builds.apache.org/job/Struts-examples-JDK8-master/ws/rest-angular/pom.xml> to org.apache.struts/rest-angular/1.0.0/rest-angular-1.0.0.pom
[JENKINS] Archiving <https://builds.apache.org/job/Struts-examples-JDK8-master/ws/exception-handling/pom.xml> to org.apache.struts/exception-handling/1.0.0/exception-handling-1.0.0.pom
[JENKINS] Archiving <https://builds.apache.org/job/Struts-examples-JDK8-master/ws/form-processing/pom.xml> to org.apache.struts/form-processing/1.0.0/form-processing-1.0.0.pom
[JENKINS] Archiving <https://builds.apache.org/job/Struts-examples-JDK8-master/ws/mailreader/pom.xml> to org.apache.struts/mailreader/1.0.0/mailreader-1.0.0.pom
[JENKINS] Archiving <https://builds.apache.org/job/Struts-examples-JDK8-master/ws/type-conversion/pom.xml> to org.apache.struts/type-conversion/1.0.0/type-conversion-1.0.0.pom
[JENKINS] Archiving <https://builds.apache.org/job/Struts-examples-JDK8-master/ws/pom.xml> to org.apache.struts/struts-examples/1.0.0/struts-examples-1.0.0.pom
[JENKINS] Archiving <https://builds.apache.org/job/Struts-examples-JDK8-master/ws/file-upload/pom.xml> to org.apache.struts/file-upload/1.0.0/file-upload-1.0.0.pom
[JENKINS] Archiving <https://builds.apache.org/job/Struts-examples-JDK8-master/ws/blank/pom.xml> to org.apache.struts/blank/1.0.0/blank-1.0.0.pom
[JENKINS] Archiving <https://builds.apache.org/job/Struts-examples-JDK8-master/ws/spring-struts/pom.xml> to org.apache.struts/spring-struts/1.0.0/spring-struts-1.0.0.pom
[JENKINS] Archiving <https://builds.apache.org/job/Struts-examples-JDK8-master/ws/basic-struts/pom.xml> to org.apache.struts/basic-struts/1.0.0/basic-struts-1.0.0.pom
[JENKINS] Archiving <https://builds.apache.org/job/Struts-examples-JDK8-master/ws/themes-override/pom.xml> to org.apache.struts/themes-override/1.0.0/themes-override-1.0.0.pom
[JENKINS] Archiving <https://builds.apache.org/job/Struts-examples-JDK8-master/ws/json/pom.xml> to org.demo/json/1.0-SNAPSHOT/json-1.0-SNAPSHOT.pom
[JENKINS] Archiving <https://builds.apache.org/job/Struts-examples-JDK8-master/ws/interceptors/pom.xml> to org.apache.struts/interceptors/1.0.0/interceptors-1.0.0.pom
[JENKINS] Archiving <https://builds.apache.org/job/Struts-examples-JDK8-master/ws/tiles/pom.xml> to org.apache.struts/tiles/1.0.0/tiles-1.0.0.pom
[JENKINS] Archiving <https://builds.apache.org/job/Struts-examples-JDK8-master/ws/form-xml-validation/pom.xml> to org.apache.struts/form-xml-validation/1.0.0/form-xml-validation-1.0.0.pom
[JENKINS] Archiving <https://builds.apache.org/job/Struts-examples-JDK8-master/ws/exclude-parameters/pom.xml> to org.apache.struts/exclude-parameters/1.0.0/exclude-parameters-1.0.0.pom
[JENKINS] Archiving <https://builds.apache.org/job/Struts-examples-JDK8-master/ws/coding-actions/pom.xml> to org.apache.struts/coding-actions/1.0.0/coding-actions-1.0.0.pom
[JENKINS] Archiving <https://builds.apache.org/job/Struts-examples-JDK8-master/ws/using-tags/pom.xml> to org.apache.struts/using-tags/1.0.0/using-tags-1.0.0.pom
[JENKINS] Archiving <https://builds.apache.org/job/Struts-examples-JDK8-master/ws/control-tags/pom.xml> to org.apache.struts/control-tags/1.0.0/control-tags-1.0.0.pom
[JENKINS] Archiving <https://builds.apache.org/job/Struts-examples-JDK8-master/ws/annotations/pom.xml> to org.apache.struts/annotations/1.0.0/annotations-1.0.0.pom
[JENKINS] Archiving <https://builds.apache.org/job/Struts-examples-JDK8-master/ws/form-validation/pom.xml> to org.apache.struts/form-validation/1.0.0/form-validation-1.0.0.pom
[locks-and-latches] Releasing all the locks
[locks-and-latches] All the locks released
channel stopped

---------------------------------------------------------------------
To unsubscribe, e-mail: [hidden email]
For additional commands, e-mail: [hidden email]

Reply | Threaded
Open this post in threaded view
|  
Report Content as Inappropriate

Build failed in Jenkins: Struts-examples-JDK8-master #45

Apache Jenkins Server-2
See <https://builds.apache.org/job/Struts-examples-JDK8-master/45/display/redirect?page=changes>

Changes:

[Lukasz Lenart] Uses the latest snapshot version

------------------------------------------
[...truncated 1.47 KB...]
Checking out Revision ffa54f379ecda57d1304c9276e8e2699bc3e3eb4 (refs/remotes/origin/master)
 > git config core.sparsecheckout # timeout=10
 > git checkout -f ffa54f379ecda57d1304c9276e8e2699bc3e3eb4
 > git rev-list bf1f646fda096b2f21a27023164f949f824a07a2 # timeout=10
[locks-and-latches] Checking to see if we really have the locks
[locks-and-latches] Have all the locks, build can start
Parsing POMs
Modules changed, recalculating dependency graph
Established TCP socket on 50642
maven33-agent.jar already up to date
maven33-interceptor.jar already up to date
maven3-interceptor-commons.jar already up to date
[Struts-examples-JDK8-master] $ /home/jenkins/tools/java/latest1.8/bin/java -Xms128m -Xmx768m -XX:MaxPermSize=256m -XX:PermSize=128m -cp /home/jenkins/jenkins-slave/maven33-agent.jar:/home/jenkins/tools/maven/latest3/boot/plexus-classworlds-2.5.2.jar:/home/jenkins/tools/maven/latest3/conf/logging jenkins.maven3.agent.Maven33Main /home/jenkins/tools/maven/latest3/ /home/jenkins/jenkins-slave/slave.jar /home/jenkins/jenkins-slave/maven33-interceptor.jar /home/jenkins/jenkins-slave/maven3-interceptor-commons.jar 50642
Java HotSpot(TM) 64-Bit Server VM warning: ignoring option MaxPermSize=256m; support was removed in 8.0
Java HotSpot(TM) 64-Bit Server VM warning: ignoring option PermSize=128m; support was removed in 8.0
<===[JENKINS REMOTING CAPACITY]===>   channel started
Executing Maven:  -B -f <https://builds.apache.org/job/Struts-examples-JDK8-master/ws/pom.xml> -Dmaven.repo.local=/home/jenkins/jenkins-slave/maven-repositories/0 package
[INFO] Scanning for projects...
[WARNING]
[WARNING] Some problems were encountered while building the effective model for org.apache.struts:annotations:war:1.0.0
[WARNING] The expression ${artifactId} is deprecated. Please use ${project.artifactId} instead.
[WARNING]
[WARNING] Some problems were encountered while building the effective model for org.apache.struts:basic-struts:war:1.0.0
[WARNING] The expression ${artifactId} is deprecated. Please use ${project.artifactId} instead.
[WARNING]
[WARNING] Some problems were encountered while building the effective model for org.apache.struts:bean-validation:war:1.0.0
[WARNING] The expression ${artifactId} is deprecated. Please use ${project.artifactId} instead.
[WARNING]
[WARNING] Some problems were encountered while building the effective model for org.apache.struts:blank:war:1.0.0
[WARNING] The expression ${artifactId} is deprecated. Please use ${project.artifactId} instead.
[WARNING]
[WARNING] Some problems were encountered while building the effective model for org.apache.struts:coding-actions:war:1.0.0
[WARNING] The expression ${artifactId} is deprecated. Please use ${project.artifactId} instead.
[WARNING]
[WARNING] Some problems were encountered while building the effective model for org.apache.struts:control-tags:war:1.0.0
[WARNING] The expression ${artifactId} is deprecated. Please use ${project.artifactId} instead.
[WARNING]
[WARNING] Some problems were encountered while building the effective model for org.apache.struts:debugging-struts:war:1.0.0
[WARNING] The expression ${artifactId} is deprecated. Please use ${project.artifactId} instead.
[WARNING]
[WARNING] Some problems were encountered while building the effective model for org.apache.struts:exception-handling:war:1.0.0
[WARNING] The expression ${artifactId} is deprecated. Please use ${project.artifactId} instead.
[WARNING]
[WARNING] Some problems were encountered while building the effective model for org.apache.struts:exclude-parameters:war:1.0.0
[WARNING] The expression ${artifactId} is deprecated. Please use ${project.artifactId} instead.
[WARNING]
[WARNING] Some problems were encountered while building the effective model for org.apache.struts:form-processing:war:1.0.0
[WARNING] The expression ${artifactId} is deprecated. Please use ${project.artifactId} instead.
[WARNING]
[WARNING] Some problems were encountered while building the effective model for org.apache.struts:form-tags:war:1.0.0
[WARNING] The expression ${artifactId} is deprecated. Please use ${project.artifactId} instead.
[WARNING]
[WARNING] Some problems were encountered while building the effective model for org.apache.struts:form-validation:war:1.0.0
[WARNING] The expression ${artifactId} is deprecated. Please use ${project.artifactId} instead.
[WARNING]
[WARNING] Some problems were encountered while building the effective model for org.apache.struts:form-xml-validation:war:1.0.0
[WARNING] The expression ${artifactId} is deprecated. Please use ${project.artifactId} instead.
[WARNING]
[WARNING] Some problems were encountered while building the effective model for org.apache.struts:helloworld:war:1.0.0
[WARNING] The expression ${artifactId} is deprecated. Please use ${project.artifactId} instead.
[WARNING]
[WARNING] Some problems were encountered while building the effective model for org.apache.struts:http-session:war:1.0.0
[WARNING] The expression ${artifactId} is deprecated. Please use ${project.artifactId} instead.
[WARNING]
[WARNING] Some problems were encountered while building the effective model for org.apache.struts:interceptors:war:1.0.0
[WARNING] The expression ${artifactId} is deprecated. Please use ${project.artifactId} instead.
[WARNING]
[WARNING] Some problems were encountered while building the effective model for org.apache.struts:mailreader:war:1.0.0
[WARNING] The expression ${artifactId} is deprecated. Please use ${project.artifactId} instead.
[WARNING]
[WARNING] Some problems were encountered while building the effective model for org.apache.struts:message-resource:war:1.0.0
[WARNING] The expression ${artifactId} is deprecated. Please use ${project.artifactId} instead.
[WARNING]
[WARNING] Some problems were encountered while building the effective model for org.apache.struts:portlet:war:1.0.0
[WARNING] 'build.plugins.plugin.version' for org.apache.maven.plugins:maven-surefire-plugin is missing. @ org.apache.struts:portlet:[unknown-version], <https://builds.apache.org/job/Struts-examples-JDK8-master/ws/portlet/pom.xml,> line 180, column 21
[WARNING]
[WARNING] Some problems were encountered while building the effective model for org.apache.struts:preparable-interface:war:1.0.0
[WARNING] The expression ${artifactId} is deprecated. Please use ${project.artifactId} instead.
[WARNING]
[WARNING] Some problems were encountered while building the effective model for org.apache.struts:restful2actionmapper:war:1.0.0
[WARNING] The expression ${artifactId} is deprecated. Please use ${project.artifactId} instead.
[WARNING]
[WARNING] Some problems were encountered while building the effective model for org.apache.struts:rest-angular:jar:1.0.0
[WARNING] 'build.plugins.plugin.version' for com.cj.jshintmojo:jshint-maven-plugin is missing. @ org.apache.struts:rest-angular:[unknown-version], <https://builds.apache.org/job/Struts-examples-JDK8-master/ws/rest-angular/pom.xml,> line 109, column 21
[WARNING] The expression ${artifactId} is deprecated. Please use ${project.artifactId} instead.
[WARNING]
[WARNING] Some problems were encountered while building the effective model for org.apache.struts:spring-struts:war:1.0.0
[WARNING] The expression ${artifactId} is deprecated. Please use ${project.artifactId} instead.
[WARNING]
[WARNING] Some problems were encountered while building the effective model for org.apache.struts:themes:war:1.0.0
[WARNING] The expression ${artifactId} is deprecated. Please use ${project.artifactId} instead.
[WARNING]
[WARNING] Some problems were encountered while building the effective model for org.apache.struts:using-tags:war:1.0.0
[WARNING] The expression ${artifactId} is deprecated. Please use ${project.artifactId} instead.
[WARNING]
[WARNING] Some problems were encountered while building the effective model for org.apache.struts:unit-testing:war:1.0.0
[WARNING] The expression ${artifactId} is deprecated. Please use ${project.artifactId} instead.
[WARNING]
[WARNING] Some problems were encountered while building the effective model for org.apache.struts:wildcard-method-selection:war:1.0.0
[WARNING] The expression ${artifactId} is deprecated. Please use ${project.artifactId} instead.
[WARNING]
[WARNING] It is highly recommended to fix these problems because they threaten the stability of your build.
[WARNING]
[WARNING] For this reason, future Maven versions might no longer support building such malformed projects.
[WARNING]
[INFO] ------------------------------------------------------------------------
[INFO] Reactor Build Order:
[INFO]
[INFO] Struts 2 Examples
[INFO] Annotations with Convention Plugin
[INFO] Basic Struts2 Example
[INFO] Bean Validation
[INFO] Struts 2 Blank Webapp
[INFO] Coding Struts 2 Action
[INFO] Control Tags
[INFO] Debugging Struts
[INFO] Exception handling
[INFO] Exclude Parameters
[INFO] File upload
[INFO] Form Processing
[INFO] Form Tags
[INFO] Form validation
[INFO] XML based form validation
[INFO] Hello World Struts 2 Example Application
[INFO] http-session
[INFO] Struts 2 Interceptors
[INFO] json
[INFO] Struts 2 Mail Reader Webapp
[INFO] Message resource
[INFO] Portlet Webapp
[INFO] Preparable Interface
[INFO] REST to Action Mapper Example Application
[INFO] REST Plugin based application with AngularJS
[INFO] Struts2 with Spring Integration
[INFO] Struts Tiles Example
[INFO] Struts 2 Themes
[INFO] Struts 2 Themes Override
[INFO] Using Struts 2 Tags
[INFO] Unit Testing
[INFO] Wildcard Method Selection
[INFO] Message Store
[INFO] Type Conversion
[INFO] Wildcard RegEx pattern matching
[INFO] Unknown handler
[INFO]                                                                        
[INFO] ------------------------------------------------------------------------
[INFO] Building Struts 2 Examples 1.0.0
[INFO] ------------------------------------------------------------------------
[INFO]                                                                        
[INFO] ------------------------------------------------------------------------
[INFO] Building Annotations with Convention Plugin 1.0.0
[INFO] ------------------------------------------------------------------------
[WARNING] The POM for org.apache.struts:struts2-convention-plugin:jar:2.5.11-SNAPSHOT is missing, no dependency information available
[WARNING] The POM for org.apache.struts:struts2-core:jar:2.5.11-SNAPSHOT is missing, no dependency information available
[INFO] ------------------------------------------------------------------------
[INFO] Reactor Summary:
[INFO]
[INFO] Struts 2 Examples .................................. SUCCESS [  0.119 s]
[INFO] Annotations with Convention Plugin ................. FAILURE [  0.480 s]
[INFO] Basic Struts2 Example .............................. SKIPPED
[INFO] Bean Validation .................................... SKIPPED
[INFO] Struts 2 Blank Webapp .............................. SKIPPED
[INFO] Coding Struts 2 Action ............................. SKIPPED
[INFO] Control Tags ....................................... SKIPPED
[INFO] Debugging Struts ................................... SKIPPED
[INFO] Exception handling ................................. SKIPPED
[INFO] Exclude Parameters ................................. SKIPPED
[INFO] File upload ........................................ SKIPPED
[INFO] Form Processing .................................... SKIPPED
[INFO] Form Tags .......................................... SKIPPED
[INFO] Form validation .................................... SKIPPED
[INFO] XML based form validation .......................... SKIPPED
[INFO] Hello World Struts 2 Example Application ........... SKIPPED
[INFO] http-session ....................................... SKIPPED
[INFO] Struts 2 Interceptors .............................. SKIPPED
[INFO] json ............................................... SKIPPED
[INFO] Struts 2 Mail Reader Webapp ........................ SKIPPED
[INFO] Message resource ................................... SKIPPED
[INFO] Portlet Webapp ..................................... SKIPPED
[INFO] Preparable Interface ............................... SKIPPED
[INFO] REST to Action Mapper Example Application .......... SKIPPED
[INFO] REST Plugin based application with AngularJS ....... SKIPPED
[INFO] Struts2 with Spring Integration .................... SKIPPED
[INFO] Struts Tiles Example ............................... SKIPPED
[INFO] Struts 2 Themes .................................... SKIPPED
[INFO] Struts 2 Themes Override ........................... SKIPPED
[INFO] Using Struts 2 Tags ................................ SKIPPED
[INFO] Unit Testing ....................................... SKIPPED
[INFO] Wildcard Method Selection .......................... SKIPPED
[INFO] Message Store ...................................... SKIPPED
[INFO] Type Conversion .................................... SKIPPED
[INFO] Wildcard RegEx pattern matching .................... SKIPPED
[INFO] Unknown handler .................................... SKIPPED
[INFO] ------------------------------------------------------------------------
[INFO] BUILD FAILURE
[INFO] ------------------------------------------------------------------------
[INFO] Total time: 4.716 s
[INFO] Finished at: 2017-03-17T09:29:24+00:00
[INFO] Final Memory: 12M/195M
[INFO] ------------------------------------------------------------------------
[ERROR] Failed to execute goal on project annotations: Could not resolve dependencies for project org.apache.struts:annotations:war:1.0.0: The following artifacts could not be resolved: org.apache.struts:struts2-convention-plugin:jar:2.5.11-SNAPSHOT, org.apache.struts:struts2-core:jar:2.5.11-SNAPSHOT: Could not find artifact org.apache.struts:struts2-convention-plugin:jar:2.5.11-SNAPSHOT -> [Help 1]
[ERROR]
[ERROR] To see the full stack trace of the errors, re-run Maven with the -e switch.
[ERROR] Re-run Maven using the -X switch to enable full debug logging.
[ERROR]
[ERROR] For more information about the errors and possible solutions, please read the following articles:
[ERROR] [Help 1] http://cwiki.apache.org/confluence/display/MAVEN/DependencyResolutionException
[ERROR]
[ERROR] After correcting the problems, you can resume the build with the command
[ERROR]   mvn <goals> -rf :annotations
[JENKINS] Archiving <https://builds.apache.org/job/Struts-examples-JDK8-master/ws/preparable-interface/pom.xml> to org.apache.struts/preparable-interface/1.0.0/preparable-interface-1.0.0.pom
[JENKINS] Archiving <https://builds.apache.org/job/Struts-examples-JDK8-master/ws/bean-validation/pom.xml> to org.apache.struts/bean-validation/1.0.0/bean-validation-1.0.0.pom
[JENKINS] Archiving <https://builds.apache.org/job/Struts-examples-JDK8-master/ws/debugging-struts/pom.xml> to org.apache.struts/debugging-struts/1.0.0/debugging-struts-1.0.0.pom
[JENKINS] Archiving <https://builds.apache.org/job/Struts-examples-JDK8-master/ws/wildcard-method-selection/pom.xml> to org.apache.struts/wildcard-method-selection/1.0.0/wildcard-method-selection-1.0.0.pom
[JENKINS] Archiving <https://builds.apache.org/job/Struts-examples-JDK8-master/ws/unit-testing/pom.xml> to org.apache.struts/unit-testing/1.0.0/unit-testing-1.0.0.pom
[JENKINS] Archiving <https://builds.apache.org/job/Struts-examples-JDK8-master/ws/http-session/pom.xml> to org.apache.struts/http-session/1.0.0/http-session-1.0.0.pom
[JENKINS] Archiving <https://builds.apache.org/job/Struts-examples-JDK8-master/ws/message-resource/pom.xml> to org.apache.struts/message-resource/1.0.0/message-resource-1.0.0.pom
[JENKINS] Archiving <https://builds.apache.org/job/Struts-examples-JDK8-master/ws/portlet/pom.xml> to org.apache.struts/portlet/1.0.0/portlet-1.0.0.pom
[JENKINS] Archiving <https://builds.apache.org/job/Struts-examples-JDK8-master/ws/wildcard-regex/pom.xml> to org.apache.struts/wildcard-regex/1/wildcard-regex-1.pom
[JENKINS] Archiving <https://builds.apache.org/job/Struts-examples-JDK8-master/ws/form-tags/pom.xml> to org.apache.struts/form-tags/1.0.0/form-tags-1.0.0.pom
[JENKINS] Archiving <https://builds.apache.org/job/Struts-examples-JDK8-master/ws/unknown-handler/pom.xml> to org.apache.org/unknown-handler/1.0.0/unknown-handler-1.0.0.pom
[JENKINS] Archiving <https://builds.apache.org/job/Struts-examples-JDK8-master/ws/helloworld/pom.xml> to org.apache.struts/helloworld/1.0.0/helloworld-1.0.0.pom
[JENKINS] Archiving <https://builds.apache.org/job/Struts-examples-JDK8-master/ws/restful2actionmapper/pom.xml> to org.apache.struts/restful2actionmapper/1.0.0/restful2actionmapper-1.0.0.pom
[JENKINS] Archiving <https://builds.apache.org/job/Struts-examples-JDK8-master/ws/message-store/pom.xml> to org.apache.struts/message-store/1.0-SNAPSHOT/message-store-1.0-SNAPSHOT.pom
[JENKINS] Archiving <https://builds.apache.org/job/Struts-examples-JDK8-master/ws/themes/pom.xml> to org.apache.struts/themes/1.0.0/themes-1.0.0.pom
[JENKINS] Archiving <https://builds.apache.org/job/Struts-examples-JDK8-master/ws/rest-angular/pom.xml> to org.apache.struts/rest-angular/1.0.0/rest-angular-1.0.0.pom
[JENKINS] Archiving <https://builds.apache.org/job/Struts-examples-JDK8-master/ws/exception-handling/pom.xml> to org.apache.struts/exception-handling/1.0.0/exception-handling-1.0.0.pom
[JENKINS] Archiving <https://builds.apache.org/job/Struts-examples-JDK8-master/ws/form-processing/pom.xml> to org.apache.struts/form-processing/1.0.0/form-processing-1.0.0.pom
[JENKINS] Archiving <https://builds.apache.org/job/Struts-examples-JDK8-master/ws/mailreader/pom.xml> to org.apache.struts/mailreader/1.0.0/mailreader-1.0.0.pom
[JENKINS] Archiving <https://builds.apache.org/job/Struts-examples-JDK8-master/ws/type-conversion/pom.xml> to org.apache.struts/type-conversion/1.0.0/type-conversion-1.0.0.pom
[JENKINS] Archiving <https://builds.apache.org/job/Struts-examples-JDK8-master/ws/pom.xml> to org.apache.struts/struts-examples/1.0.0/struts-examples-1.0.0.pom
[JENKINS] Archiving <https://builds.apache.org/job/Struts-examples-JDK8-master/ws/file-upload/pom.xml> to org.apache.struts/file-upload/1.0.0/file-upload-1.0.0.pom
[JENKINS] Archiving <https://builds.apache.org/job/Struts-examples-JDK8-master/ws/blank/pom.xml> to org.apache.struts/blank/1.0.0/blank-1.0.0.pom
[JENKINS] Archiving <https://builds.apache.org/job/Struts-examples-JDK8-master/ws/spring-struts/pom.xml> to org.apache.struts/spring-struts/1.0.0/spring-struts-1.0.0.pom
[JENKINS] Archiving <https://builds.apache.org/job/Struts-examples-JDK8-master/ws/basic-struts/pom.xml> to org.apache.struts/basic-struts/1.0.0/basic-struts-1.0.0.pom
[JENKINS] Archiving <https://builds.apache.org/job/Struts-examples-JDK8-master/ws/themes-override/pom.xml> to org.apache.struts/themes-override/1.0.0/themes-override-1.0.0.pom
[JENKINS] Archiving <https://builds.apache.org/job/Struts-examples-JDK8-master/ws/json/pom.xml> to org.demo/json/1.0-SNAPSHOT/json-1.0-SNAPSHOT.pom
[JENKINS] Archiving <https://builds.apache.org/job/Struts-examples-JDK8-master/ws/interceptors/pom.xml> to org.apache.struts/interceptors/1.0.0/interceptors-1.0.0.pom
[JENKINS] Archiving <https://builds.apache.org/job/Struts-examples-JDK8-master/ws/tiles/pom.xml> to org.apache.struts/tiles/1.0.0/tiles-1.0.0.pom
[JENKINS] Archiving <https://builds.apache.org/job/Struts-examples-JDK8-master/ws/form-xml-validation/pom.xml> to org.apache.struts/form-xml-validation/1.0.0/form-xml-validation-1.0.0.pom
[JENKINS] Archiving <https://builds.apache.org/job/Struts-examples-JDK8-master/ws/exclude-parameters/pom.xml> to org.apache.struts/exclude-parameters/1.0.0/exclude-parameters-1.0.0.pom
[JENKINS] Archiving <https://builds.apache.org/job/Struts-examples-JDK8-master/ws/coding-actions/pom.xml> to org.apache.struts/coding-actions/1.0.0/coding-actions-1.0.0.pom
[JENKINS] Archiving <https://builds.apache.org/job/Struts-examples-JDK8-master/ws/using-tags/pom.xml> to org.apache.struts/using-tags/1.0.0/using-tags-1.0.0.pom
[JENKINS] Archiving <https://builds.apache.org/job/Struts-examples-JDK8-master/ws/control-tags/pom.xml> to org.apache.struts/control-tags/1.0.0/control-tags-1.0.0.pom
[JENKINS] Archiving <https://builds.apache.org/job/Struts-examples-JDK8-master/ws/annotations/pom.xml> to org.apache.struts/annotations/1.0.0/annotations-1.0.0.pom
[JENKINS] Archiving <https://builds.apache.org/job/Struts-examples-JDK8-master/ws/form-validation/pom.xml> to org.apache.struts/form-validation/1.0.0/form-validation-1.0.0.pom
[locks-and-latches] Releasing all the locks
[locks-and-latches] All the locks released
channel stopped

---------------------------------------------------------------------
To unsubscribe, e-mail: [hidden email]
For additional commands, e-mail: [hidden email]

Reply | Threaded
Open this post in threaded view
|  
Report Content as Inappropriate

Build failed in Jenkins: Struts-examples-JDK8-master #46

Apache Jenkins Server-2
See <https://builds.apache.org/job/Struts-examples-JDK8-master/46/display/redirect?page=changes>

Changes:

[Lukasz Lenart] Adds new example with custom TextProvider

[Lukasz Lenart] Adds example with custom TextProvider

------------------------------------------
[...truncated 1.93 KB...]
Modules changed, recalculating dependency graph
Established TCP socket on 38979
maven33-agent.jar already up to date
maven33-interceptor.jar already up to date
maven3-interceptor-commons.jar already up to date
[Struts-examples-JDK8-master] $ /home/jenkins/tools/java/latest1.8/bin/java -Xms128m -Xmx768m -XX:MaxPermSize=256m -XX:PermSize=128m -cp /home/jenkins/jenkins-slave/maven33-agent.jar:/home/jenkins/tools/maven/latest3/boot/plexus-classworlds-2.5.2.jar:/home/jenkins/tools/maven/latest3/conf/logging jenkins.maven3.agent.Maven33Main /home/jenkins/tools/maven/latest3/ /home/jenkins/jenkins-slave/slave.jar /home/jenkins/jenkins-slave/maven33-interceptor.jar /home/jenkins/jenkins-slave/maven3-interceptor-commons.jar 38979
Java HotSpot(TM) 64-Bit Server VM warning: ignoring option MaxPermSize=256m; support was removed in 8.0
Java HotSpot(TM) 64-Bit Server VM warning: ignoring option PermSize=128m; support was removed in 8.0
<===[JENKINS REMOTING CAPACITY]===>   channel started
Executing Maven:  -B -f <https://builds.apache.org/job/Struts-examples-JDK8-master/ws/pom.xml> -Dmaven.repo.local=/home/jenkins/jenkins-slave/maven-repositories/0 package
[INFO] Scanning for projects...
[WARNING]
[WARNING] Some problems were encountered while building the effective model for org.apache.struts:annotations:war:1.0.0
[WARNING] The expression ${artifactId} is deprecated. Please use ${project.artifactId} instead.
[WARNING]
[WARNING] Some problems were encountered while building the effective model for org.apache.struts:basic-struts:war:1.0.0
[WARNING] The expression ${artifactId} is deprecated. Please use ${project.artifactId} instead.
[WARNING]
[WARNING] Some problems were encountered while building the effective model for org.apache.struts:bean-validation:war:1.0.0
[WARNING] The expression ${artifactId} is deprecated. Please use ${project.artifactId} instead.
[WARNING]
[WARNING] Some problems were encountered while building the effective model for org.apache.struts:blank:war:1.0.0
[WARNING] The expression ${artifactId} is deprecated. Please use ${project.artifactId} instead.
[WARNING]
[WARNING] Some problems were encountered while building the effective model for org.apache.struts:coding-actions:war:1.0.0
[WARNING] The expression ${artifactId} is deprecated. Please use ${project.artifactId} instead.
[WARNING]
[WARNING] Some problems were encountered while building the effective model for org.apache.struts:control-tags:war:1.0.0
[WARNING] The expression ${artifactId} is deprecated. Please use ${project.artifactId} instead.
[WARNING]
[WARNING] Some problems were encountered while building the effective model for org.apache.struts:debugging-struts:war:1.0.0
[WARNING] The expression ${artifactId} is deprecated. Please use ${project.artifactId} instead.
[WARNING]
[WARNING] Some problems were encountered while building the effective model for org.apache.struts:exception-handling:war:1.0.0
[WARNING] The expression ${artifactId} is deprecated. Please use ${project.artifactId} instead.
[WARNING]
[WARNING] Some problems were encountered while building the effective model for org.apache.struts:exclude-parameters:war:1.0.0
[WARNING] The expression ${artifactId} is deprecated. Please use ${project.artifactId} instead.
[WARNING]
[WARNING] Some problems were encountered while building the effective model for org.apache.struts:form-processing:war:1.0.0
[WARNING] The expression ${artifactId} is deprecated. Please use ${project.artifactId} instead.
[WARNING]
[WARNING] Some problems were encountered while building the effective model for org.apache.struts:form-tags:war:1.0.0
[WARNING] The expression ${artifactId} is deprecated. Please use ${project.artifactId} instead.
[WARNING]
[WARNING] Some problems were encountered while building the effective model for org.apache.struts:form-validation:war:1.0.0
[WARNING] The expression ${artifactId} is deprecated. Please use ${project.artifactId} instead.
[WARNING]
[WARNING] Some problems were encountered while building the effective model for org.apache.struts:form-xml-validation:war:1.0.0
[WARNING] The expression ${artifactId} is deprecated. Please use ${project.artifactId} instead.
[WARNING]
[WARNING] Some problems were encountered while building the effective model for org.apache.struts:helloworld:war:1.0.0
[WARNING] The expression ${artifactId} is deprecated. Please use ${project.artifactId} instead.
[WARNING]
[WARNING] Some problems were encountered while building the effective model for org.apache.struts:http-session:war:1.0.0
[WARNING] The expression ${artifactId} is deprecated. Please use ${project.artifactId} instead.
[WARNING]
[WARNING] Some problems were encountered while building the effective model for org.apache.struts:interceptors:war:1.0.0
[WARNING] The expression ${artifactId} is deprecated. Please use ${project.artifactId} instead.
[WARNING]
[WARNING] Some problems were encountered while building the effective model for org.apache.struts:mailreader:war:1.0.0
[WARNING] The expression ${artifactId} is deprecated. Please use ${project.artifactId} instead.
[WARNING]
[WARNING] Some problems were encountered while building the effective model for org.apache.struts:message-resource:war:1.0.0
[WARNING] The expression ${artifactId} is deprecated. Please use ${project.artifactId} instead.
[WARNING]
[WARNING] Some problems were encountered while building the effective model for org.apache.struts:portlet:war:1.0.0
[WARNING] 'build.plugins.plugin.version' for org.apache.maven.plugins:maven-surefire-plugin is missing. @ org.apache.struts:portlet:[unknown-version], <https://builds.apache.org/job/Struts-examples-JDK8-master/ws/portlet/pom.xml,> line 180, column 21
[WARNING]
[WARNING] Some problems were encountered while building the effective model for org.apache.struts:preparable-interface:war:1.0.0
[WARNING] The expression ${artifactId} is deprecated. Please use ${project.artifactId} instead.
[WARNING]
[WARNING] Some problems were encountered while building the effective model for org.apache.struts:restful2actionmapper:war:1.0.0
[WARNING] The expression ${artifactId} is deprecated. Please use ${project.artifactId} instead.
[WARNING]
[WARNING] Some problems were encountered while building the effective model for org.apache.struts:rest-angular:jar:1.0.0
[WARNING] 'build.plugins.plugin.version' for com.cj.jshintmojo:jshint-maven-plugin is missing. @ org.apache.struts:rest-angular:[unknown-version], <https://builds.apache.org/job/Struts-examples-JDK8-master/ws/rest-angular/pom.xml,> line 109, column 21
[WARNING] The expression ${artifactId} is deprecated. Please use ${project.artifactId} instead.
[WARNING]
[WARNING] Some problems were encountered while building the effective model for org.apache.struts:spring-struts:war:1.0.0
[WARNING] The expression ${artifactId} is deprecated. Please use ${project.artifactId} instead.
[WARNING]
[WARNING] Some problems were encountered while building the effective model for org.apache.struts:text-provider:war:1.0.0
[WARNING] The expression ${artifactId} is deprecated. Please use ${project.artifactId} instead.
[WARNING]
[WARNING] Some problems were encountered while building the effective model for org.apache.struts:themes:war:1.0.0
[WARNING] The expression ${artifactId} is deprecated. Please use ${project.artifactId} instead.
[WARNING]
[WARNING] Some problems were encountered while building the effective model for org.apache.struts:unit-testing:war:1.0.0
[WARNING] The expression ${artifactId} is deprecated. Please use ${project.artifactId} instead.
[WARNING]
[WARNING] Some problems were encountered while building the effective model for org.apache.struts:using-tags:war:1.0.0
[WARNING] The expression ${artifactId} is deprecated. Please use ${project.artifactId} instead.
[WARNING]
[WARNING] Some problems were encountered while building the effective model for org.apache.struts:wildcard-method-selection:war:1.0.0
[WARNING] The expression ${artifactId} is deprecated. Please use ${project.artifactId} instead.
[WARNING]
[WARNING] It is highly recommended to fix these problems because they threaten the stability of your build.
[WARNING]
[WARNING] For this reason, future Maven versions might no longer support building such malformed projects.
[WARNING]
[INFO] ------------------------------------------------------------------------
[INFO] Reactor Build Order:
[INFO]
[INFO] Struts 2 Examples
[INFO] Annotations with Convention Plugin
[INFO] Basic Struts2 Example
[INFO] Bean Validation
[INFO] Struts 2 Blank Webapp
[INFO] Coding Struts 2 Action
[INFO] Control Tags
[INFO] Debugging Struts
[INFO] Exception handling
[INFO] Exclude Parameters
[INFO] File upload
[INFO] Form Processing
[INFO] Form Tags
[INFO] Form validation
[INFO] XML based form validation
[INFO] Hello World Struts 2 Example Application
[INFO] http-session
[INFO] Struts 2 Interceptors
[INFO] json
[INFO] Struts 2 Mail Reader Webapp
[INFO] Message resource
[INFO] Message Store
[INFO] Portlet Webapp
[INFO] Preparable Interface
[INFO] REST to Action Mapper Example Application
[INFO] REST Plugin based application with AngularJS
[INFO] Struts2 with Spring Integration
[INFO] Custom TextProvider
[INFO] Struts Tiles Example
[INFO] Struts 2 Themes
[INFO] Struts 2 Themes Override
[INFO] Type Conversion
[INFO] Unit Testing
[INFO] Using Struts 2 Tags
[INFO] Wildcard Method Selection
[INFO] Wildcard RegEx pattern matching
[INFO] Unknown handler
[INFO]                                                                        
[INFO] ------------------------------------------------------------------------
[INFO] Building Struts 2 Examples 1.0.0
[INFO] ------------------------------------------------------------------------
[INFO]                                                                        
[INFO] ------------------------------------------------------------------------
[INFO] Building Annotations with Convention Plugin 1.0.0
[INFO] ------------------------------------------------------------------------
[WARNING] The POM for org.apache.struts:struts2-convention-plugin:jar:2.5.11-SNAPSHOT is missing, no dependency information available
[WARNING] The POM for org.apache.struts:struts2-core:jar:2.5.11-SNAPSHOT is missing, no dependency information available
[INFO] ------------------------------------------------------------------------
[INFO] Reactor Summary:
[INFO]
[INFO] Struts 2 Examples .................................. SUCCESS [  0.391 s]
[INFO] Annotations with Convention Plugin ................. FAILURE [  0.376 s]
[INFO] Basic Struts2 Example .............................. SKIPPED
[INFO] Bean Validation .................................... SKIPPED
[INFO] Struts 2 Blank Webapp .............................. SKIPPED
[INFO] Coding Struts 2 Action ............................. SKIPPED
[INFO] Control Tags ....................................... SKIPPED
[INFO] Debugging Struts ................................... SKIPPED
[INFO] Exception handling ................................. SKIPPED
[INFO] Exclude Parameters ................................. SKIPPED
[INFO] File upload ........................................ SKIPPED
[INFO] Form Processing .................................... SKIPPED
[INFO] Form Tags .......................................... SKIPPED
[INFO] Form validation .................................... SKIPPED
[INFO] XML based form validation .......................... SKIPPED
[INFO] Hello World Struts 2 Example Application ........... SKIPPED
[INFO] http-session ....................................... SKIPPED
[INFO] Struts 2 Interceptors .............................. SKIPPED
[INFO] json ............................................... SKIPPED
[INFO] Struts 2 Mail Reader Webapp ........................ SKIPPED
[INFO] Message resource ................................... SKIPPED
[INFO] Message Store ...................................... SKIPPED
[INFO] Portlet Webapp ..................................... SKIPPED
[INFO] Preparable Interface ............................... SKIPPED
[INFO] REST to Action Mapper Example Application .......... SKIPPED
[INFO] REST Plugin based application with AngularJS ....... SKIPPED
[INFO] Struts2 with Spring Integration .................... SKIPPED
[INFO] Custom TextProvider ................................ SKIPPED
[INFO] Struts Tiles Example ............................... SKIPPED
[INFO] Struts 2 Themes .................................... SKIPPED
[INFO] Struts 2 Themes Override ........................... SKIPPED
[INFO] Type Conversion .................................... SKIPPED
[INFO] Unit Testing ....................................... SKIPPED
[INFO] Using Struts 2 Tags ................................ SKIPPED
[INFO] Wildcard Method Selection .......................... SKIPPED
[INFO] Wildcard RegEx pattern matching .................... SKIPPED
[INFO] Unknown handler .................................... SKIPPED
[INFO] ------------------------------------------------------------------------
[INFO] BUILD FAILURE
[INFO] ------------------------------------------------------------------------
[INFO] Total time: 6.366 s
[INFO] Finished at: 2017-03-24T09:38:40+00:00
[INFO] Final Memory: 12M/196M
[INFO] ------------------------------------------------------------------------
[ERROR] Failed to execute goal on project annotations: Could not resolve dependencies for project org.apache.struts:annotations:war:1.0.0: The following artifacts could not be resolved: org.apache.struts:struts2-convention-plugin:jar:2.5.11-SNAPSHOT, org.apache.struts:struts2-core:jar:2.5.11-SNAPSHOT: Could not find artifact org.apache.struts:struts2-convention-plugin:jar:2.5.11-SNAPSHOT -> [Help 1]
[ERROR]
[ERROR] To see the full stack trace of the errors, re-run Maven with the -e switch.
[ERROR] Re-run Maven using the -X switch to enable full debug logging.
[ERROR]
[ERROR] For more information about the errors and possible solutions, please read the following articles:
[ERROR] [Help 1] http://cwiki.apache.org/confluence/display/MAVEN/DependencyResolutionException
[ERROR]
[ERROR] After correcting the problems, you can resume the build with the command
[ERROR]   mvn <goals> -rf :annotations
[JENKINS] Archiving <https://builds.apache.org/job/Struts-examples-JDK8-master/ws/preparable-interface/pom.xml> to org.apache.struts/preparable-interface/1.0.0/preparable-interface-1.0.0.pom
[JENKINS] Archiving <https://builds.apache.org/job/Struts-examples-JDK8-master/ws/bean-validation/pom.xml> to org.apache.struts/bean-validation/1.0.0/bean-validation-1.0.0.pom
[JENKINS] Archiving <https://builds.apache.org/job/Struts-examples-JDK8-master/ws/debugging-struts/pom.xml> to org.apache.struts/debugging-struts/1.0.0/debugging-struts-1.0.0.pom
[JENKINS] Archiving <https://builds.apache.org/job/Struts-examples-JDK8-master/ws/wildcard-method-selection/pom.xml> to org.apache.struts/wildcard-method-selection/1.0.0/wildcard-method-selection-1.0.0.pom
[JENKINS] Archiving <https://builds.apache.org/job/Struts-examples-JDK8-master/ws/unit-testing/pom.xml> to org.apache.struts/unit-testing/1.0.0/unit-testing-1.0.0.pom
[JENKINS] Archiving <https://builds.apache.org/job/Struts-examples-JDK8-master/ws/http-session/pom.xml> to org.apache.struts/http-session/1.0.0/http-session-1.0.0.pom
[JENKINS] Archiving <https://builds.apache.org/job/Struts-examples-JDK8-master/ws/message-resource/pom.xml> to org.apache.struts/message-resource/1.0.0/message-resource-1.0.0.pom
[JENKINS] Archiving <https://builds.apache.org/job/Struts-examples-JDK8-master/ws/portlet/pom.xml> to org.apache.struts/portlet/1.0.0/portlet-1.0.0.pom
[JENKINS] Archiving <https://builds.apache.org/job/Struts-examples-JDK8-master/ws/wildcard-regex/pom.xml> to org.apache.struts/wildcard-regex/1/wildcard-regex-1.pom
[JENKINS] Archiving <https://builds.apache.org/job/Struts-examples-JDK8-master/ws/form-tags/pom.xml> to org.apache.struts/form-tags/1.0.0/form-tags-1.0.0.pom
[JENKINS] Archiving <https://builds.apache.org/job/Struts-examples-JDK8-master/ws/unknown-handler/pom.xml> to org.apache.org/unknown-handler/1.0.0/unknown-handler-1.0.0.pom
[JENKINS] Archiving <https://builds.apache.org/job/Struts-examples-JDK8-master/ws/helloworld/pom.xml> to org.apache.struts/helloworld/1.0.0/helloworld-1.0.0.pom
[JENKINS] Archiving <https://builds.apache.org/job/Struts-examples-JDK8-master/ws/restful2actionmapper/pom.xml> to org.apache.struts/restful2actionmapper/1.0.0/restful2actionmapper-1.0.0.pom
[JENKINS] Archiving <https://builds.apache.org/job/Struts-examples-JDK8-master/ws/message-store/pom.xml> to org.apache.struts/message-store/1.0-SNAPSHOT/message-store-1.0-SNAPSHOT.pom
[JENKINS] Archiving <https://builds.apache.org/job/Struts-examples-JDK8-master/ws/themes/pom.xml> to org.apache.struts/themes/1.0.0/themes-1.0.0.pom
[JENKINS] Archiving <https://builds.apache.org/job/Struts-examples-JDK8-master/ws/rest-angular/pom.xml> to org.apache.struts/rest-angular/1.0.0/rest-angular-1.0.0.pom
[JENKINS] Archiving <https://builds.apache.org/job/Struts-examples-JDK8-master/ws/exception-handling/pom.xml> to org.apache.struts/exception-handling/1.0.0/exception-handling-1.0.0.pom
[JENKINS] Archiving <https://builds.apache.org/job/Struts-examples-JDK8-master/ws/form-processing/pom.xml> to org.apache.struts/form-processing/1.0.0/form-processing-1.0.0.pom
[JENKINS] Archiving <https://builds.apache.org/job/Struts-examples-JDK8-master/ws/mailreader/pom.xml> to org.apache.struts/mailreader/1.0.0/mailreader-1.0.0.pom
[JENKINS] Archiving <https://builds.apache.org/job/Struts-examples-JDK8-master/ws/text-provider/pom.xml> to org.apache.struts/text-provider/1.0.0/text-provider-1.0.0.pom
No prior successful build to compare, so performing full copy of artifacts
[JENKINS] Archiving <https://builds.apache.org/job/Struts-examples-JDK8-master/ws/type-conversion/pom.xml> to org.apache.struts/type-conversion/1.0.0/type-conversion-1.0.0.pom
[JENKINS] Archiving <https://builds.apache.org/job/Struts-examples-JDK8-master/ws/pom.xml> to org.apache.struts/struts-examples/1.0.0/struts-examples-1.0.0.pom
[JENKINS] Archiving <https://builds.apache.org/job/Struts-examples-JDK8-master/ws/file-upload/pom.xml> to org.apache.struts/file-upload/1.0.0/file-upload-1.0.0.pom
[JENKINS] Archiving <https://builds.apache.org/job/Struts-examples-JDK8-master/ws/blank/pom.xml> to org.apache.struts/blank/1.0.0/blank-1.0.0.pom
[JENKINS] Archiving <https://builds.apache.org/job/Struts-examples-JDK8-master/ws/spring-struts/pom.xml> to org.apache.struts/spring-struts/1.0.0/spring-struts-1.0.0.pom
[JENKINS] Archiving <https://builds.apache.org/job/Struts-examples-JDK8-master/ws/basic-struts/pom.xml> to org.apache.struts/basic-struts/1.0.0/basic-struts-1.0.0.pom
[JENKINS] Archiving <https://builds.apache.org/job/Struts-examples-JDK8-master/ws/themes-override/pom.xml> to org.apache.struts/themes-override/1.0.0/themes-override-1.0.0.pom
[JENKINS] Archiving <https://builds.apache.org/job/Struts-examples-JDK8-master/ws/json/pom.xml> to org.demo/json/1.0-SNAPSHOT/json-1.0-SNAPSHOT.pom
[JENKINS] Archiving <https://builds.apache.org/job/Struts-examples-JDK8-master/ws/interceptors/pom.xml> to org.apache.struts/interceptors/1.0.0/interceptors-1.0.0.pom
[JENKINS] Archiving <https://builds.apache.org/job/Struts-examples-JDK8-master/ws/tiles/pom.xml> to org.apache.struts/tiles/1.0.0/tiles-1.0.0.pom
[JENKINS] Archiving <https://builds.apache.org/job/Struts-examples-JDK8-master/ws/form-xml-validation/pom.xml> to org.apache.struts/form-xml-validation/1.0.0/form-xml-validation-1.0.0.pom
[JENKINS] Archiving <https://builds.apache.org/job/Struts-examples-JDK8-master/ws/exclude-parameters/pom.xml> to org.apache.struts/exclude-parameters/1.0.0/exclude-parameters-1.0.0.pom
[JENKINS] Archiving <https://builds.apache.org/job/Struts-examples-JDK8-master/ws/coding-actions/pom.xml> to org.apache.struts/coding-actions/1.0.0/coding-actions-1.0.0.pom
[JENKINS] Archiving <https://builds.apache.org/job/Struts-examples-JDK8-master/ws/using-tags/pom.xml> to org.apache.struts/using-tags/1.0.0/using-tags-1.0.0.pom
[JENKINS] Archiving <https://builds.apache.org/job/Struts-examples-JDK8-master/ws/control-tags/pom.xml> to org.apache.struts/control-tags/1.0.0/control-tags-1.0.0.pom
[JENKINS] Archiving <https://builds.apache.org/job/Struts-examples-JDK8-master/ws/annotations/pom.xml> to org.apache.struts/annotations/1.0.0/annotations-1.0.0.pom
[JENKINS] Archiving <https://builds.apache.org/job/Struts-examples-JDK8-master/ws/form-validation/pom.xml> to org.apache.struts/form-validation/1.0.0/form-validation-1.0.0.pom
[locks-and-latches] Releasing all the locks
[locks-and-latches] All the locks released
channel stopped

---------------------------------------------------------------------
To unsubscribe, e-mail: [hidden email]
For additional commands, e-mail: [hidden email]

Reply | Threaded
Open this post in threaded view
|  
Report Content as Inappropriate

Build failed in Jenkins: Struts-examples-JDK8-master #47

Apache Jenkins Server-2
See <https://builds.apache.org/job/Struts-examples-JDK8-master/47/display/redirect?page=changes>

Changes:

[Lukasz Lenart] Adds new example app

[Lukasz Lenart] Adds action chaining example

------------------------------------------
[...truncated 402.26 KB...]
[INFO]
[INFO] --- minify-maven-plugin:1.7.4:minify (application-minify) @ rest-angular ---
[INFO] Starting CSS task:
[INFO] Starting JavaScript task:
[INFO] Processing source file [app.js].
[INFO] Processing source file [config.js].
[INFO] Processing source file [AppController.js].
[INFO] Processing source file [DataService.js].
[INFO] Processing source file [OrderAddController.js].
[INFO] Processing source file [OrderDetailController.js].
[INFO] Processing source file [OrderEditController.js].
[INFO] Processing source file [OrdersController.js].
[INFO] Creating the merged file [application.js].
[INFO] Creating the minified file [application.min.js].
[INFO] Uncompressed size: 14649 bytes.
[INFO] Compressed size: 3425 bytes minified (1192 bytes gzipped).
[INFO]
[INFO]                                                                        
[INFO] ------------------------------------------------------------------------
[INFO] Building Struts2 with Spring Integration 1.0.0
[INFO] ------------------------------------------------------------------------
[INFO]
[INFO] --- maven-resources-plugin:2.6:resources (default-resources) @ spring-struts ---
[INFO] Using 'UTF-8' encoding to copy filtered resources.
[INFO] Copying 3 resources
[INFO]
[INFO] --- maven-compiler-plugin:3.3:compile (default-compile) @ spring-struts ---
[INFO] Changes detected - recompiling the module!
[INFO] Compiling 5 source files to <https://builds.apache.org/job/Struts-examples-JDK8-master/ws/spring-struts/target/classes>
[INFO]
[INFO] --- maven-resources-plugin:2.6:testResources (default-testResources) @ spring-struts ---
[INFO] Using 'UTF-8' encoding to copy filtered resources.
[INFO] skip non existing resourceDirectory <https://builds.apache.org/job/Struts-examples-JDK8-master/ws/spring-struts/src/test/resources>
[INFO]
[INFO] --- maven-compiler-plugin:3.3:testCompile (default-testCompile) @ spring-struts ---
[INFO] No sources to compile
[INFO]
[INFO] --- maven-surefire-plugin:2.12.4:test (default-test) @ spring-struts ---
[INFO] No tests to run.
[JENKINS] Recording test results
[INFO]
[INFO] --- maven-war-plugin:2.2:war (default-war) @ spring-struts ---
[INFO] Packaging webapp
[INFO] Assembling webapp [spring-struts] in [<https://builds.apache.org/job/Struts-examples-JDK8-master/ws/spring-struts/target/spring-struts]>
[INFO] Processing war project
[INFO] Copying webapp resources [<https://builds.apache.org/job/Struts-examples-JDK8-master/ws/spring-struts/src/main/webapp]>
[INFO] Webapp assembled in [49 msecs]
[INFO] Building war: <https://builds.apache.org/job/Struts-examples-JDK8-master/ws/spring-struts/target/spring-struts.war>
[INFO] WEB-INF/web.xml already added, skipping
[INFO]                                                                        
[INFO] ------------------------------------------------------------------------
[INFO] Building Custom TextProvider 1.0.0
[INFO] ------------------------------------------------------------------------
[INFO]
[INFO] --- maven-resources-plugin:2.6:resources (default-resources) @ text-provider ---
[INFO] Using 'UTF-8' encoding to copy filtered resources.
[INFO] Copying 3 resources
[INFO]
[INFO] --- maven-compiler-plugin:3.3:compile (default-compile) @ text-provider ---
[INFO] Changes detected - recompiling the module!
[INFO] Compiling 5 source files to <https://builds.apache.org/job/Struts-examples-JDK8-master/ws/text-provider/target/classes>
[INFO] -------------------------------------------------------------
[ERROR] COMPILATION ERROR :
[INFO] -------------------------------------------------------------
[ERROR] <https://builds.apache.org/job/Struts-examples-JDK8-master/ws/text-provider/src/main/java/org/apache/struts_example/MyTextProviderFactory.java>:[3,31] cannot find symbol
  symbol:   class StrutsTextProviderFactory
  location: package com.opensymphony.xwork2
[ERROR] <https://builds.apache.org/job/Struts-examples-JDK8-master/ws/text-provider/src/main/java/org/apache/struts_example/MyTextProviderFactory.java>:[8,44] cannot find symbol
  symbol: class StrutsTextProviderFactory
[ERROR] <https://builds.apache.org/job/Struts-examples-JDK8-master/ws/text-provider/src/main/java/org/apache/struts_example/MyTextTextProvider.java>:[4,31] cannot find symbol
  symbol:   class LocalizedTextProvider
  location: package com.opensymphony.xwork2
[ERROR] <https://builds.apache.org/job/Struts-examples-JDK8-master/ws/text-provider/src/main/java/org/apache/struts_example/MyTextTextProvider.java>:[13,69] cannot find symbol
  symbol:   class LocalizedTextProvider
  location: class org.apache.struts_example.MyTextTextProvider
[ERROR] <https://builds.apache.org/job/Struts-examples-JDK8-master/ws/text-provider/src/main/java/org/apache/struts_example/MyTextTextProvider.java>:[17,79] cannot find symbol
  symbol:   class LocalizedTextProvider
  location: class org.apache.struts_example.MyTextTextProvider
[INFO] 5 errors
[INFO] -------------------------------------------------------------
[INFO] ------------------------------------------------------------------------
[INFO] Reactor Summary:
[INFO]
[INFO] Struts 2 Examples .................................. SUCCESS [  0.555 s]
[INFO] Action chaining .................................... SUCCESS [  7.758 s]
[INFO] Annotations with Convention Plugin ................. SUCCESS [  2.839 s]
[INFO] Basic Struts2 Example .............................. SUCCESS [  2.281 s]
[INFO] Bean Validation .................................... SUCCESS [  2.341 s]
[INFO] Struts 2 Blank Webapp .............................. SUCCESS [ 39.154 s]
[INFO] Coding Struts 2 Action ............................. SUCCESS [  1.809 s]
[INFO] Control Tags ....................................... SUCCESS [  2.130 s]
[INFO] Debugging Struts ................................... SUCCESS [  1.868 s]
[INFO] Exception handling ................................. SUCCESS [  1.341 s]
[INFO] Exclude Parameters ................................. SUCCESS [  1.533 s]
[INFO] File upload ........................................ SUCCESS [  1.652 s]
[INFO] Form Processing .................................... SUCCESS [  2.019 s]
[INFO] Form Tags .......................................... SUCCESS [  2.015 s]
[INFO] Form validation .................................... SUCCESS [  2.377 s]
[INFO] XML based form validation .......................... SUCCESS [  2.026 s]
[INFO] Hello World Struts 2 Example Application ........... SUCCESS [  1.979 s]
[INFO] http-session ....................................... SUCCESS [  1.813 s]
[INFO] Struts 2 Interceptors .............................. SUCCESS [  1.290 s]
[INFO] json ............................................... SUCCESS [  1.834 s]
[INFO] Struts 2 Mail Reader Webapp ........................ SUCCESS [  2.367 s]
[INFO] Message resource ................................... SUCCESS [  2.261 s]
[INFO] Message Store ...................................... SUCCESS [  1.705 s]
[INFO] Portlet Webapp ..................................... SUCCESS [  6.507 s]
[INFO] Preparable Interface ............................... SUCCESS [  3.136 s]
[INFO] REST to Action Mapper Example Application .......... SUCCESS [  1.669 s]
[INFO] REST Plugin based application with AngularJS ....... SUCCESS [ 11.091 s]
[INFO] Struts2 with Spring Integration .................... SUCCESS [  2.141 s]
[INFO] Custom TextProvider ................................ FAILURE [  0.864 s]
[INFO] Struts Tiles Example ............................... SKIPPED
[INFO] Struts 2 Themes .................................... SKIPPED
[INFO] Struts 2 Themes Override ........................... SKIPPED
[INFO] Type Conversion .................................... SKIPPED
[INFO] Unit Testing ....................................... SKIPPED
[INFO] Using Struts 2 Tags ................................ SKIPPED
[INFO] Wildcard Method Selection .......................... SKIPPED
[INFO] Wildcard RegEx pattern matching .................... SKIPPED
[INFO] Unknown handler .................................... SKIPPED
[INFO] ------------------------------------------------------------------------
[INFO] BUILD FAILURE
[INFO] ------------------------------------------------------------------------
[INFO] Total time: 02:49 min
[INFO] Finished at: 2017-03-28T09:32:15+00:00
[INFO] Final Memory: 55M/331M
[INFO] ------------------------------------------------------------------------
Waiting for Jenkins to finish collecting data
[ERROR] Failed to execute goal org.apache.maven.plugins:maven-compiler-plugin:3.3:compile (default-compile) on project text-provider: Compilation failure: Compilation failure:
[ERROR] <https://builds.apache.org/job/Struts-examples-JDK8-master/ws/text-provider/src/main/java/org/apache/struts_example/MyTextProviderFactory.java>:[3,31] cannot find symbol
[ERROR] symbol:   class StrutsTextProviderFactory
[ERROR] location: package com.opensymphony.xwork2
[ERROR] <https://builds.apache.org/job/Struts-examples-JDK8-master/ws/text-provider/src/main/java/org/apache/struts_example/MyTextProviderFactory.java>:[8,44] cannot find symbol
[ERROR] symbol: class StrutsTextProviderFactory
[ERROR] <https://builds.apache.org/job/Struts-examples-JDK8-master/ws/text-provider/src/main/java/org/apache/struts_example/MyTextTextProvider.java>:[4,31] cannot find symbol
[ERROR] symbol:   class LocalizedTextProvider
[ERROR] location: package com.opensymphony.xwork2
[ERROR] <https://builds.apache.org/job/Struts-examples-JDK8-master/ws/text-provider/src/main/java/org/apache/struts_example/MyTextTextProvider.java>:[13,69] cannot find symbol
[ERROR] symbol:   class LocalizedTextProvider
[ERROR] location: class org.apache.struts_example.MyTextTextProvider
[ERROR] <https://builds.apache.org/job/Struts-examples-JDK8-master/ws/text-provider/src/main/java/org/apache/struts_example/MyTextTextProvider.java>:[17,79] cannot find symbol
[ERROR] symbol:   class LocalizedTextProvider
[ERROR] location: class org.apache.struts_example.MyTextTextProvider
[ERROR] -> [Help 1]
[ERROR]
[ERROR] To see the full stack trace of the errors, re-run Maven with the -e switch.
[ERROR] Re-run Maven using the -X switch to enable full debug logging.
[ERROR]
[ERROR] For more information about the errors and possible solutions, please read the following articles:
[ERROR] [Help 1] http://cwiki.apache.org/confluence/display/MAVEN/MojoFailureException
[ERROR]
[ERROR] After correcting the problems, you can resume the build with the command
[ERROR]   mvn <goals> -rf :text-provider
[JENKINS] Archiving <https://builds.apache.org/job/Struts-examples-JDK8-master/ws/preparable-interface/pom.xml> to org.apache.struts/preparable-interface/1.0.0/preparable-interface-1.0.0.pom
[JENKINS] Archiving <https://builds.apache.org/job/Struts-examples-JDK8-master/ws/preparable-interface/target/preparable-interface.war> to org.apache.struts/preparable-interface/1.0.0/preparable-interface-1.0.0.war
Compressed 4.19 MB of artifacts by 59.0% relative to #42
[JENKINS] Archiving <https://builds.apache.org/job/Struts-examples-JDK8-master/ws/bean-validation/pom.xml> to org.apache.struts/bean-validation/1.0.0/bean-validation-1.0.0.pom
[JENKINS] Archiving <https://builds.apache.org/job/Struts-examples-JDK8-master/ws/bean-validation/target/bean-validation.war> to org.apache.struts/bean-validation/1.0.0/bean-validation-1.0.0.war
Compressed 5.43 MB of artifacts by 63.9% relative to #42
[JENKINS] Archiving <https://builds.apache.org/job/Struts-examples-JDK8-master/ws/debugging-struts/pom.xml> to org.apache.struts/debugging-struts/1.0.0/debugging-struts-1.0.0.pom
[JENKINS] Archiving <https://builds.apache.org/job/Struts-examples-JDK8-master/ws/debugging-struts/target/debugging-struts.war> to org.apache.struts/debugging-struts/1.0.0/debugging-struts-1.0.0.war
Compressed 4.23 MB of artifacts by 58.4% relative to #42
[JENKINS] Archiving <https://builds.apache.org/job/Struts-examples-JDK8-master/ws/wildcard-method-selection/pom.xml> to org.apache.struts/wildcard-method-selection/1.0.0/wildcard-method-selection-1.0.0.pom
[JENKINS] Archiving <https://builds.apache.org/job/Struts-examples-JDK8-master/ws/unit-testing/pom.xml> to org.apache.struts/unit-testing/1.0.0/unit-testing-1.0.0.pom
[JENKINS] Archiving <https://builds.apache.org/job/Struts-examples-JDK8-master/ws/http-session/pom.xml> to org.apache.struts/http-session/1.0.0/http-session-1.0.0.pom
[JENKINS] Archiving <https://builds.apache.org/job/Struts-examples-JDK8-master/ws/http-session/target/http-session.war> to org.apache.struts/http-session/1.0.0/http-session-1.0.0.war
Compressed 4.18 MB of artifacts by 59.0% relative to #42
[JENKINS] Archiving <https://builds.apache.org/job/Struts-examples-JDK8-master/ws/message-resource/pom.xml> to org.apache.struts/message-resource/1.0.0/message-resource-1.0.0.pom
[JENKINS] Archiving <https://builds.apache.org/job/Struts-examples-JDK8-master/ws/message-resource/target/message-resource.war> to org.apache.struts/message-resource/1.0.0/message-resource-1.0.0.war
Compressed 4.19 MB of artifacts by 59.0% relative to #42
[JENKINS] Archiving <https://builds.apache.org/job/Struts-examples-JDK8-master/ws/portlet/pom.xml> to org.apache.struts/portlet/1.0.0/portlet-1.0.0.pom
[JENKINS] Archiving <https://builds.apache.org/job/Struts-examples-JDK8-master/ws/portlet/target/portlet-1.0.0.war> to org.apache.struts/portlet/1.0.0/portlet-1.0.0.war
Compressed 11.80 MB of artifacts by 73.9% relative to #42
[JENKINS] Archiving <https://builds.apache.org/job/Struts-examples-JDK8-master/ws/wildcard-regex/pom.xml> to org.apache.struts/wildcard-regex/1/wildcard-regex-1.pom
[JENKINS] Archiving <https://builds.apache.org/job/Struts-examples-JDK8-master/ws/form-tags/pom.xml> to org.apache.struts/form-tags/1.0.0/form-tags-1.0.0.pom
[JENKINS] Archiving <https://builds.apache.org/job/Struts-examples-JDK8-master/ws/form-tags/target/form-tags.war> to org.apache.struts/form-tags/1.0.0/form-tags-1.0.0.war
Compressed 4.18 MB of artifacts by 59.0% relative to #42
[JENKINS] Archiving <https://builds.apache.org/job/Struts-examples-JDK8-master/ws/unknown-handler/pom.xml> to org.apache.org/unknown-handler/1.0.0/unknown-handler-1.0.0.pom
[JENKINS] Archiving <https://builds.apache.org/job/Struts-examples-JDK8-master/ws/helloworld/pom.xml> to org.apache.struts/helloworld/1.0.0/helloworld-1.0.0.pom
[JENKINS] Archiving <https://builds.apache.org/job/Struts-examples-JDK8-master/ws/helloworld/target/hello-world.war> to org.apache.struts/helloworld/1.0.0/helloworld-1.0.0.war
Compressed 4.18 MB of artifacts by 59.1% relative to #42
[JENKINS] Archiving <https://builds.apache.org/job/Struts-examples-JDK8-master/ws/restful2actionmapper/pom.xml> to org.apache.struts/restful2actionmapper/1.0.0/restful2actionmapper-1.0.0.pom
[JENKINS] Archiving <https://builds.apache.org/job/Struts-examples-JDK8-master/ws/restful2actionmapper/target/reststyleactionmapper.war> to org.apache.struts/restful2actionmapper/1.0.0/restful2actionmapper-1.0.0.war
Compressed 4.18 MB of artifacts by 59.1% relative to #42
[JENKINS] Archiving <https://builds.apache.org/job/Struts-examples-JDK8-master/ws/message-store/pom.xml> to org.apache.struts/message-store/1.0-SNAPSHOT/message-store-1.0-SNAPSHOT.pom
[JENKINS] Archiving <https://builds.apache.org/job/Struts-examples-JDK8-master/ws/message-store/target/message-store-1.0-SNAPSHOT.war> to org.apache.struts/message-store/1.0-SNAPSHOT/message-store-1.0-SNAPSHOT.war
Compressed 4.18 MB of artifacts by 59.1% relative to #42
[JENKINS] Archiving <https://builds.apache.org/job/Struts-examples-JDK8-master/ws/themes/pom.xml> to org.apache.struts/themes/1.0.0/themes-1.0.0.pom
[JENKINS] Archiving <https://builds.apache.org/job/Struts-examples-JDK8-master/ws/action-chaining/pom.xml> to org.apache.struts/action-chaining/1.0-SNAPSHOT/action-chaining-1.0-SNAPSHOT.pom
[JENKINS] Archiving <https://builds.apache.org/job/Struts-examples-JDK8-master/ws/action-chaining/target/action-chaining-1.0-SNAPSHOT.war> to org.apache.struts/action-chaining/1.0-SNAPSHOT/action-chaining-1.0-SNAPSHOT.war
No prior successful build to compare, so performing full copy of artifacts
[JENKINS] Archiving <https://builds.apache.org/job/Struts-examples-JDK8-master/ws/rest-angular/pom.xml> to org.apache.struts/rest-angular/1.0.0/rest-angular-1.0.0.pom
[JENKINS] Archiving <https://builds.apache.org/job/Struts-examples-JDK8-master/ws/rest-angular/target/rest-angular-1.0.0.jar> to org.apache.struts/rest-angular/1.0.0/rest-angular-1.0.0.jar
[JENKINS] Archiving <https://builds.apache.org/job/Struts-examples-JDK8-master/ws/exception-handling/pom.xml> to org.apache.struts/exception-handling/1.0.0/exception-handling-1.0.0.pom
[JENKINS] Archiving <https://builds.apache.org/job/Struts-examples-JDK8-master/ws/exception-handling/target/exception-handling.war> to org.apache.struts/exception-handling/1.0.0/exception-handling-1.0.0.war
Compressed 4.19 MB of artifacts by 59.0% relative to #42
[JENKINS] Archiving <https://builds.apache.org/job/Struts-examples-JDK8-master/ws/form-processing/pom.xml> to org.apache.struts/form-processing/1.0.0/form-processing-1.0.0.pom
[JENKINS] Archiving <https://builds.apache.org/job/Struts-examples-JDK8-master/ws/form-processing/target/form-processing.war> to org.apache.struts/form-processing/1.0.0/form-processing-1.0.0.war
Compressed 4.18 MB of artifacts by 59.0% relative to #42
[JENKINS] Archiving <https://builds.apache.org/job/Struts-examples-JDK8-master/ws/mailreader/pom.xml> to org.apache.struts/mailreader/1.0.0/mailreader-1.0.0.pom
[JENKINS] Archiving <https://builds.apache.org/job/Struts-examples-JDK8-master/ws/mailreader/target/mailreader-1.0.0.war> to org.apache.struts/mailreader/1.0.0/mailreader-1.0.0.war
Compressed 4.73 MB of artifacts by 58.1% relative to #42
[JENKINS] Archiving <https://builds.apache.org/job/Struts-examples-JDK8-master/ws/text-provider/pom.xml> to org.apache.struts/text-provider/1.0.0/text-provider-1.0.0.pom
No prior successful build to compare, so performing full copy of artifacts
[JENKINS] Archiving <https://builds.apache.org/job/Struts-examples-JDK8-master/ws/type-conversion/pom.xml> to org.apache.struts/type-conversion/1.0.0/type-conversion-1.0.0.pom
[JENKINS] Archiving <https://builds.apache.org/job/Struts-examples-JDK8-master/ws/pom.xml> to org.apache.struts/struts-examples/1.0.0/struts-examples-1.0.0.pom
[JENKINS] Archiving <https://builds.apache.org/job/Struts-examples-JDK8-master/ws/file-upload/pom.xml> to org.apache.struts/file-upload/1.0.0/file-upload-1.0.0.pom
[JENKINS] Archiving <https://builds.apache.org/job/Struts-examples-JDK8-master/ws/file-upload/target/file-upload-1.0.0.war> to org.apache.struts/file-upload/1.0.0/file-upload-1.0.0.war
Compressed 4.18 MB of artifacts by 59.1% relative to #42
[JENKINS] Archiving <https://builds.apache.org/job/Struts-examples-JDK8-master/ws/blank/pom.xml> to org.apache.struts/blank/1.0.0/blank-1.0.0.pom
[JENKINS] Archiving <https://builds.apache.org/job/Struts-examples-JDK8-master/ws/blank/target/blank-1.0.0.war> to org.apache.struts/blank/1.0.0/blank-1.0.0.war
Compressed 4.19 MB of artifacts by 58.9% relative to #42
[JENKINS] Archiving <https://builds.apache.org/job/Struts-examples-JDK8-master/ws/spring-struts/pom.xml> to org.apache.struts/spring-struts/1.0.0/spring-struts-1.0.0.pom
[JENKINS] Archiving <https://builds.apache.org/job/Struts-examples-JDK8-master/ws/spring-struts/target/spring-struts.war> to org.apache.struts/spring-struts/1.0.0/spring-struts-1.0.0.war
Compressed 7.71 MB of artifacts by 73.8% relative to #42
[JENKINS] Archiving <https://builds.apache.org/job/Struts-examples-JDK8-master/ws/basic-struts/pom.xml> to org.apache.struts/basic-struts/1.0.0/basic-struts-1.0.0.pom
[JENKINS] Archiving <https://builds.apache.org/job/Struts-examples-JDK8-master/ws/basic-struts/target/basic-struts.war> to org.apache.struts/basic-struts/1.0.0/basic-struts-1.0.0.war
Compressed 4.18 MB of artifacts by 58.4% relative to #42
[JENKINS] Archiving <https://builds.apache.org/job/Struts-examples-JDK8-master/ws/themes-override/pom.xml> to org.apache.struts/themes-override/1.0.0/themes-override-1.0.0.pom
[JENKINS] Archiving <https://builds.apache.org/job/Struts-examples-JDK8-master/ws/json/pom.xml> to org.demo/json/1.0-SNAPSHOT/json-1.0-SNAPSHOT.pom
[JENKINS] Archiving <https://builds.apache.org/job/Struts-examples-JDK8-master/ws/json/target/json-1.0-SNAPSHOT.war> to org.demo/json/1.0-SNAPSHOT/json-1.0-SNAPSHOT.war
Compressed 4.29 MB of artifacts by 57.6% relative to #42
[JENKINS] Archiving <https://builds.apache.org/job/Struts-examples-JDK8-master/ws/interceptors/pom.xml> to org.apache.struts/interceptors/1.0.0/interceptors-1.0.0.pom
[JENKINS] Archiving <https://builds.apache.org/job/Struts-examples-JDK8-master/ws/interceptors/target/interceptors.war> to org.apache.struts/interceptors/1.0.0/interceptors-1.0.0.war
Compressed 4.18 MB of artifacts by 59.0% relative to #42
[JENKINS] Archiving <https://builds.apache.org/job/Struts-examples-JDK8-master/ws/tiles/pom.xml> to org.apache.struts/tiles/1.0.0/tiles-1.0.0.pom
[JENKINS] Archiving <https://builds.apache.org/job/Struts-examples-JDK8-master/ws/form-xml-validation/pom.xml> to org.apache.struts/form-xml-validation/1.0.0/form-xml-validation-1.0.0.pom
[JENKINS] Archiving <https://builds.apache.org/job/Struts-examples-JDK8-master/ws/form-xml-validation/target/form-xml-validation.war> to org.apache.struts/form-xml-validation/1.0.0/form-xml-validation-1.0.0.war
Compressed 4.19 MB of artifacts by 59.0% relative to #42
[JENKINS] Archiving <https://builds.apache.org/job/Struts-examples-JDK8-master/ws/exclude-parameters/pom.xml> to org.apache.struts/exclude-parameters/1.0.0/exclude-parameters-1.0.0.pom
[JENKINS] Archiving <https://builds.apache.org/job/Struts-examples-JDK8-master/ws/exclude-parameters/target/exclude-parameters.war> to org.apache.struts/exclude-parameters/1.0.0/exclude-parameters-1.0.0.war
Compressed 4.19 MB of artifacts by 59.0% relative to #42
[JENKINS] Archiving <https://builds.apache.org/job/Struts-examples-JDK8-master/ws/coding-actions/pom.xml> to org.apache.struts/coding-actions/1.0.0/coding-actions-1.0.0.pom
[JENKINS] Archiving <https://builds.apache.org/job/Struts-examples-JDK8-master/ws/coding-actions/target/coding-actions.war> to org.apache.struts/coding-actions/1.0.0/coding-actions-1.0.0.war
Compressed 4.18 MB of artifacts by 59.1% relative to #42
[JENKINS] Archiving <https://builds.apache.org/job/Struts-examples-JDK8-master/ws/using-tags/pom.xml> to org.apache.struts/using-tags/1.0.0/using-tags-1.0.0.pom
[JENKINS] Archiving <https://builds.apache.org/job/Struts-examples-JDK8-master/ws/control-tags/pom.xml> to org.apache.struts/control-tags/1.0.0/control-tags-1.0.0.pom
[JENKINS] Archiving <https://builds.apache.org/job/Struts-examples-JDK8-master/ws/control-tags/target/control-tags.war> to org.apache.struts/control-tags/1.0.0/control-tags-1.0.0.war
Compressed 4.19 MB of artifacts by 59.0% relative to #42
[JENKINS] Archiving <https://builds.apache.org/job/Struts-examples-JDK8-master/ws/annotations/pom.xml> to org.apache.struts/annotations/1.0.0/annotations-1.0.0.pom
[JENKINS] Archiving <https://builds.apache.org/job/Struts-examples-JDK8-master/ws/annotations/target/annotations.war> to org.apache.struts/annotations/1.0.0/annotations-1.0.0.war
Compressed 4.37 MB of artifacts by 57.2% relative to #42
[JENKINS] Archiving <https://builds.apache.org/job/Struts-examples-JDK8-master/ws/form-validation/pom.xml> to org.apache.struts/form-validation/1.0.0/form-validation-1.0.0.pom
[JENKINS] Archiving <https://builds.apache.org/job/Struts-examples-JDK8-master/ws/form-validation/target/form_validation.war> to org.apache.struts/form-validation/1.0.0/form-validation-1.0.0.war
Compressed 4.18 MB of artifacts by 59.0% relative to #42
[locks-and-latches] Releasing all the locks
[locks-and-latches] All the locks released
channel stopped

---------------------------------------------------------------------
To unsubscribe, e-mail: [hidden email]
For additional commands, e-mail: [hidden email]

Reply | Threaded
Open this post in threaded view
|  
Report Content as Inappropriate

Jenkins build is back to normal : Struts-examples-JDK8-master #48

Apache Jenkins Server-2
See <https://builds.apache.org/job/Struts-examples-JDK8-master/48/display/redirect?page=changes>


---------------------------------------------------------------------
To unsubscribe, e-mail: [hidden email]
For additional commands, e-mail: [hidden email]

Loading...