Build failed in Jenkins: Struts-archetypes-JDK7-master #9

classic Classic list List threaded Threaded
5 messages Options
Reply | Threaded
Open this post in threaded view
|

Build failed in Jenkins: Struts-archetypes-JDK7-master #9

Apache Jenkins Server-2
See <https://builds.apache.org/job/Struts-archetypes-JDK7-master/9/display/redirect?page=changes>

Changes:

[lukaszlenart] Supports Struts 2.5.14.1

[lukaszlenart] [maven-release-plugin] prepare release STRUTS_ARCHETYPES_2_5_14

[lukaszlenart] [maven-release-plugin] rollback the release of STRUTS_ARCHETYPES_2_5_14

[lukaszlenart] Uses proper urls for SCM

------------------------------------------
Started by an SCM change
[EnvInject] - Loading node environment variables.
Building remotely on H33 (ubuntu xenial) in workspace <https://builds.apache.org/job/Struts-archetypes-JDK7-master/ws/>
Cloning the remote Git repository
Cloning repository https://gitbox.apache.org/repos/asf/struts-archetypes.git
 > git init <https://builds.apache.org/job/Struts-archetypes-JDK7-master/ws/> # timeout=10
Fetching upstream changes from https://gitbox.apache.org/repos/asf/struts-archetypes.git
 > git --version # timeout=10
 > git fetch --tags --progress https://gitbox.apache.org/repos/asf/struts-archetypes.git +refs/heads/*:refs/remotes/origin/*
 > git config remote.origin.url https://gitbox.apache.org/repos/asf/struts-archetypes.git # timeout=10
 > git config --add remote.origin.fetch +refs/heads/*:refs/remotes/origin/* # timeout=10
 > git config remote.origin.url https://gitbox.apache.org/repos/asf/struts-archetypes.git # timeout=10
Cleaning workspace
 > git rev-parse --verify HEAD # timeout=10
No valid HEAD. Skipping the resetting
 > git clean -fdx # timeout=10
Fetching upstream changes from https://gitbox.apache.org/repos/asf/struts-archetypes.git
 > git fetch --tags --progress https://gitbox.apache.org/repos/asf/struts-archetypes.git +refs/heads/*:refs/remotes/origin/*
 > git rev-parse refs/remotes/origin/master^{commit} # timeout=10
 > git rev-parse refs/remotes/origin/refs/heads/master^{commit} # timeout=10
Checking out Revision ed21791ce109bccdf6db2eb599f01ba835250d0b (refs/remotes/origin/master)
 > git config core.sparsecheckout # timeout=10
 > git checkout -f ed21791ce109bccdf6db2eb599f01ba835250d0b
Commit message: "Uses proper urls for SCM"
 > git rev-list ff5299fb0cac2f3ff02e96cf1fa487f3eb210f2d # timeout=10
[locks-and-latches] Checking to see if we really have the locks
[locks-and-latches] Have all the locks, build can start
Parsing POMs
Downloaded artifact http://repo.maven.apache.org/maven2/org/apache/struts/struts-master/10/struts-master-10.pom
Established TCP socket on 41524
maven35-agent.jar already up to date
maven35-interceptor.jar already up to date
maven3-interceptor-commons.jar already up to date
[Struts-archetypes-JDK7-master] $ /home/jenkins/tools/java/latest1.7/bin/java -Xms128m -Xmx768m -XX:MaxPermSize=256m -XX:PermSize=128m -cp /home/jenkins/jenkins-slave/maven35-agent.jar:/home/jenkins/tools/maven/latest3/boot/plexus-classworlds-2.5.2.jar:/home/jenkins/tools/maven/latest3/conf/logging jenkins.maven3.agent.Maven35Main /home/jenkins/tools/maven/latest3/ /home/jenkins/jenkins-slave/slave.jar /home/jenkins/jenkins-slave/maven35-interceptor.jar /home/jenkins/jenkins-slave/maven3-interceptor-commons.jar 41524
Exception in thread "main" java.lang.UnsupportedClassVersionError: hudson/remoting/Launcher : Unsupported major.minor version 52.0
        at java.lang.ClassLoader.defineClass1(Native Method)
        at java.lang.ClassLoader.defineClass(ClassLoader.java:800)
        at java.security.SecureClassLoader.defineClass(SecureClassLoader.java:142)
        at java.net.URLClassLoader.defineClass(URLClassLoader.java:449)
        at java.net.URLClassLoader.access$100(URLClassLoader.java:71)
        at java.net.URLClassLoader$1.run(URLClassLoader.java:361)
        at java.net.URLClassLoader$1.run(URLClassLoader.java:355)
        at java.security.AccessController.doPrivileged(Native Method)
        at java.net.URLClassLoader.findClass(URLClassLoader.java:354)
        at org.codehaus.plexus.classworlds.realm.ClassRealm.loadClassFromSelf(ClassRealm.java:401)
        at org.codehaus.plexus.classworlds.strategy.SelfFirstStrategy.loadClass(SelfFirstStrategy.java:42)
        at org.codehaus.plexus.classworlds.realm.ClassRealm.unsynchronizedLoadClass(ClassRealm.java:271)
        at org.codehaus.plexus.classworlds.realm.ClassRealm.loadClass(ClassRealm.java:247)
        at org.codehaus.plexus.classworlds.realm.ClassRealm.loadClass(ClassRealm.java:239)
        at jenkins.maven3.agent.Maven35Main.main(Maven35Main.java:133)
        at jenkins.maven3.agent.Maven35Main.main(Maven35Main.java:64)
[locks-and-latches] Releasing all the locks
[locks-and-latches] All the locks released
ERROR: Failed to parse POMs
java.io.EOFException: unexpected stream termination
        at hudson.remoting.ChannelBuilder.negotiate(ChannelBuilder.java:408)
        at hudson.remoting.ChannelBuilder.build(ChannelBuilder.java:353)
        at hudson.slaves.Channels.forProcess(Channels.java:115)
        at hudson.maven.AbstractMavenProcessFactory.newProcess(AbstractMavenProcessFactory.java:294)
        at hudson.maven.ProcessCache.get(ProcessCache.java:236)
        at hudson.maven.MavenModuleSetBuild$MavenModuleSetBuildExecution.doRun(MavenModuleSetBuild.java:804)
        at hudson.model.AbstractBuild$AbstractBuildExecution.run(AbstractBuild.java:504)
        at hudson.model.Run.execute(Run.java:1724)
        at hudson.maven.MavenModuleSetBuild.run(MavenModuleSetBuild.java:543)
        at hudson.model.ResourceController.execute(ResourceController.java:97)
        at hudson.model.Executor.run(Executor.java:421)

---------------------------------------------------------------------
To unsubscribe, e-mail: [hidden email]
For additional commands, e-mail: [hidden email]

Reply | Threaded
Open this post in threaded view
|

Build failed in Jenkins: Struts-archetypes-JDK7-master #10

Apache Jenkins Server-2
See <https://builds.apache.org/job/Struts-archetypes-JDK7-master/10/display/redirect?page=changes>

Changes:

[lukaszlenart] [maven-release-plugin] prepare release STRUTS_ARCHETYPES_2_5_14

------------------------------------------
Started by an SCM change
[EnvInject] - Loading node environment variables.
Building remotely on H33 (ubuntu xenial) in workspace <https://builds.apache.org/job/Struts-archetypes-JDK7-master/ws/>
 > git rev-parse --is-inside-work-tree # timeout=10
Fetching changes from the remote Git repository
 > git config remote.origin.url https://gitbox.apache.org/repos/asf/struts-archetypes.git # timeout=10
Cleaning workspace
 > git rev-parse --verify HEAD # timeout=10
Resetting working tree
 > git reset --hard # timeout=10
 > git clean -fdx # timeout=10
Fetching upstream changes from https://gitbox.apache.org/repos/asf/struts-archetypes.git
 > git --version # timeout=10
 > git fetch --tags --progress https://gitbox.apache.org/repos/asf/struts-archetypes.git +refs/heads/*:refs/remotes/origin/*
 > git rev-parse refs/remotes/origin/master^{commit} # timeout=10
 > git rev-parse refs/remotes/origin/refs/heads/master^{commit} # timeout=10
Checking out Revision 5dbc79b4d4b0073d49ee1c2f2a48bb7383853e62 (refs/remotes/origin/master)
 > git config core.sparsecheckout # timeout=10
 > git checkout -f 5dbc79b4d4b0073d49ee1c2f2a48bb7383853e62
Commit message: "[maven-release-plugin] prepare release STRUTS_ARCHETYPES_2_5_14"
 > git rev-list ed21791ce109bccdf6db2eb599f01ba835250d0b # timeout=10
[locks-and-latches] Checking to see if we really have the locks
[locks-and-latches] Have all the locks, build can start
Parsing POMs
Modules changed, recalculating dependency graph
Established TCP socket on 39121
maven35-agent.jar already up to date
maven35-interceptor.jar already up to date
maven3-interceptor-commons.jar already up to date
[Struts-archetypes-JDK7-master] $ /home/jenkins/tools/java/latest1.7/bin/java -Xms128m -Xmx768m -XX:MaxPermSize=256m -XX:PermSize=128m -cp /home/jenkins/jenkins-slave/maven35-agent.jar:/home/jenkins/tools/maven/latest3/boot/plexus-classworlds-2.5.2.jar:/home/jenkins/tools/maven/latest3/conf/logging jenkins.maven3.agent.Maven35Main /home/jenkins/tools/maven/latest3/ /home/jenkins/jenkins-slave/slave.jar /home/jenkins/jenkins-slave/maven35-interceptor.jar /home/jenkins/jenkins-slave/maven3-interceptor-commons.jar 39121
Exception in thread "main" java.lang.UnsupportedClassVersionError: hudson/remoting/Launcher : Unsupported major.minor version 52.0
        at java.lang.ClassLoader.defineClass1(Native Method)
        at java.lang.ClassLoader.defineClass(ClassLoader.java:800)
        at java.security.SecureClassLoader.defineClass(SecureClassLoader.java:142)
        at java.net.URLClassLoader.defineClass(URLClassLoader.java:449)
        at java.net.URLClassLoader.access$100(URLClassLoader.java:71)
        at java.net.URLClassLoader$1.run(URLClassLoader.java:361)
        at java.net.URLClassLoader$1.run(URLClassLoader.java:355)
        at java.security.AccessController.doPrivileged(Native Method)
        at java.net.URLClassLoader.findClass(URLClassLoader.java:354)
        at org.codehaus.plexus.classworlds.realm.ClassRealm.loadClassFromSelf(ClassRealm.java:401)
        at org.codehaus.plexus.classworlds.strategy.SelfFirstStrategy.loadClass(SelfFirstStrategy.java:42)
        at org.codehaus.plexus.classworlds.realm.ClassRealm.unsynchronizedLoadClass(ClassRealm.java:271)
        at org.codehaus.plexus.classworlds.realm.ClassRealm.loadClass(ClassRealm.java:247)
        at org.codehaus.plexus.classworlds.realm.ClassRealm.loadClass(ClassRealm.java:239)
        at jenkins.maven3.agent.Maven35Main.main(Maven35Main.java:133)
        at jenkins.maven3.agent.Maven35Main.main(Maven35Main.java:64)
[locks-and-latches] Releasing all the locks
[locks-and-latches] All the locks released
ERROR: Failed to parse POMs
java.io.EOFException: unexpected stream termination
        at hudson.remoting.ChannelBuilder.negotiate(ChannelBuilder.java:408)
        at hudson.remoting.ChannelBuilder.build(ChannelBuilder.java:353)
        at hudson.slaves.Channels.forProcess(Channels.java:115)
        at hudson.maven.AbstractMavenProcessFactory.newProcess(AbstractMavenProcessFactory.java:294)
        at hudson.maven.ProcessCache.get(ProcessCache.java:236)
        at hudson.maven.MavenModuleSetBuild$MavenModuleSetBuildExecution.doRun(MavenModuleSetBuild.java:804)
        at hudson.model.AbstractBuild$AbstractBuildExecution.run(AbstractBuild.java:504)
        at hudson.model.Run.execute(Run.java:1724)
        at hudson.maven.MavenModuleSetBuild.run(MavenModuleSetBuild.java:543)
        at hudson.model.ResourceController.execute(ResourceController.java:97)
        at hudson.model.Executor.run(Executor.java:421)

---------------------------------------------------------------------
To unsubscribe, e-mail: [hidden email]
For additional commands, e-mail: [hidden email]

Reply | Threaded
Open this post in threaded view
|

Build failed in Jenkins: Struts-archetypes-JDK7-master #11

Apache Jenkins Server-2
See <https://builds.apache.org/job/Struts-archetypes-JDK7-master/11/display/redirect?page=changes>

Changes:

[lukaszlenart] [maven-release-plugin] prepare for next development iteration

------------------------------------------
Started by an SCM change
[EnvInject] - Loading node environment variables.
Building remotely on H33 (ubuntu xenial) in workspace <https://builds.apache.org/job/Struts-archetypes-JDK7-master/ws/>
 > git rev-parse --is-inside-work-tree # timeout=10
Fetching changes from the remote Git repository
 > git config remote.origin.url https://gitbox.apache.org/repos/asf/struts-archetypes.git # timeout=10
Cleaning workspace
 > git rev-parse --verify HEAD # timeout=10
Resetting working tree
 > git reset --hard # timeout=10
 > git clean -fdx # timeout=10
Fetching upstream changes from https://gitbox.apache.org/repos/asf/struts-archetypes.git
 > git --version # timeout=10
 > git fetch --tags --progress https://gitbox.apache.org/repos/asf/struts-archetypes.git +refs/heads/*:refs/remotes/origin/*
 > git rev-parse refs/remotes/origin/master^{commit} # timeout=10
 > git rev-parse refs/remotes/origin/refs/heads/master^{commit} # timeout=10
Checking out Revision 2ad0d347bd22f5ea93e8b9c1de130c8c5d0f3de6 (refs/remotes/origin/master)
 > git config core.sparsecheckout # timeout=10
 > git checkout -f 2ad0d347bd22f5ea93e8b9c1de130c8c5d0f3de6
Commit message: "[maven-release-plugin] prepare for next development iteration"
 > git rev-list 5dbc79b4d4b0073d49ee1c2f2a48bb7383853e62 # timeout=10
[locks-and-latches] Checking to see if we really have the locks
[locks-and-latches] Have all the locks, build can start
Parsing POMs
Modules changed, recalculating dependency graph
Established TCP socket on 37772
maven35-agent.jar already up to date
maven35-interceptor.jar already up to date
maven3-interceptor-commons.jar already up to date
[Struts-archetypes-JDK7-master] $ /home/jenkins/tools/java/latest1.7/bin/java -Xms128m -Xmx768m -XX:MaxPermSize=256m -XX:PermSize=128m -cp /home/jenkins/jenkins-slave/maven35-agent.jar:/home/jenkins/tools/maven/latest3/boot/plexus-classworlds-2.5.2.jar:/home/jenkins/tools/maven/latest3/conf/logging jenkins.maven3.agent.Maven35Main /home/jenkins/tools/maven/latest3/ /home/jenkins/jenkins-slave/slave.jar /home/jenkins/jenkins-slave/maven35-interceptor.jar /home/jenkins/jenkins-slave/maven3-interceptor-commons.jar 37772
Exception in thread "main" java.lang.UnsupportedClassVersionError: hudson/remoting/Launcher : Unsupported major.minor version 52.0
        at java.lang.ClassLoader.defineClass1(Native Method)
        at java.lang.ClassLoader.defineClass(ClassLoader.java:800)
        at java.security.SecureClassLoader.defineClass(SecureClassLoader.java:142)
        at java.net.URLClassLoader.defineClass(URLClassLoader.java:449)
        at java.net.URLClassLoader.access$100(URLClassLoader.java:71)
        at java.net.URLClassLoader$1.run(URLClassLoader.java:361)
        at java.net.URLClassLoader$1.run(URLClassLoader.java:355)
        at java.security.AccessController.doPrivileged(Native Method)
        at java.net.URLClassLoader.findClass(URLClassLoader.java:354)
        at org.codehaus.plexus.classworlds.realm.ClassRealm.loadClassFromSelf(ClassRealm.java:401)
        at org.codehaus.plexus.classworlds.strategy.SelfFirstStrategy.loadClass(SelfFirstStrategy.java:42)
        at org.codehaus.plexus.classworlds.realm.ClassRealm.unsynchronizedLoadClass(ClassRealm.java:271)
        at org.codehaus.plexus.classworlds.realm.ClassRealm.loadClass(ClassRealm.java:247)
        at org.codehaus.plexus.classworlds.realm.ClassRealm.loadClass(ClassRealm.java:239)
        at jenkins.maven3.agent.Maven35Main.main(Maven35Main.java:133)
        at jenkins.maven3.agent.Maven35Main.main(Maven35Main.java:64)
[locks-and-latches] Releasing all the locks
[locks-and-latches] All the locks released
ERROR: Failed to parse POMs
java.io.EOFException: unexpected stream termination
        at hudson.remoting.ChannelBuilder.negotiate(ChannelBuilder.java:408)
        at hudson.remoting.ChannelBuilder.build(ChannelBuilder.java:353)
        at hudson.slaves.Channels.forProcess(Channels.java:115)
        at hudson.maven.AbstractMavenProcessFactory.newProcess(AbstractMavenProcessFactory.java:294)
        at hudson.maven.ProcessCache.get(ProcessCache.java:236)
        at hudson.maven.MavenModuleSetBuild$MavenModuleSetBuildExecution.doRun(MavenModuleSetBuild.java:804)
        at hudson.model.AbstractBuild$AbstractBuildExecution.run(AbstractBuild.java:504)
        at hudson.model.Run.execute(Run.java:1724)
        at hudson.maven.MavenModuleSetBuild.run(MavenModuleSetBuild.java:543)
        at hudson.model.ResourceController.execute(ResourceController.java:97)
        at hudson.model.Executor.run(Executor.java:421)

---------------------------------------------------------------------
To unsubscribe, e-mail: [hidden email]
For additional commands, e-mail: [hidden email]

Reply | Threaded
Open this post in threaded view
|

Build failed in Jenkins: Struts-archetypes-JDK7-master #12

Apache Jenkins Server-2
See <https://builds.apache.org/job/Struts-archetypes-JDK7-master/12/display/redirect>

------------------------------------------
Started by user lukaszlenart
[EnvInject] - Loading node environment variables.
Building remotely on H33 (ubuntu xenial) in workspace <https://builds.apache.org/job/Struts-archetypes-JDK7-master/ws/>
 > git rev-parse --is-inside-work-tree # timeout=10
Fetching changes from the remote Git repository
 > git config remote.origin.url https://gitbox.apache.org/repos/asf/struts-archetypes.git # timeout=10
Cleaning workspace
 > git rev-parse --verify HEAD # timeout=10
Resetting working tree
 > git reset --hard # timeout=10
 > git clean -fdx # timeout=10
Fetching upstream changes from https://gitbox.apache.org/repos/asf/struts-archetypes.git
 > git --version # timeout=10
 > git fetch --tags --progress https://gitbox.apache.org/repos/asf/struts-archetypes.git +refs/heads/*:refs/remotes/origin/*
 > git rev-parse refs/remotes/origin/master^{commit} # timeout=10
 > git rev-parse refs/remotes/origin/refs/heads/master^{commit} # timeout=10
Checking out Revision 2ad0d347bd22f5ea93e8b9c1de130c8c5d0f3de6 (refs/remotes/origin/master)
 > git config core.sparsecheckout # timeout=10
 > git checkout -f 2ad0d347bd22f5ea93e8b9c1de130c8c5d0f3de6
Commit message: "[maven-release-plugin] prepare for next development iteration"
 > git rev-list 2ad0d347bd22f5ea93e8b9c1de130c8c5d0f3de6 # timeout=10
[locks-and-latches] Checking to see if we really have the locks
[locks-and-latches] Have all the locks, build can start
Parsing POMs
Established TCP socket on 38532
maven32-agent.jar already up to date
maven32-interceptor.jar already up to date
maven3-interceptor-commons.jar already up to date
[Struts-archetypes-JDK7-master] $ /home/jenkins/tools/java/latest1.7/bin/java -Xms128m -Xmx768m -XX:MaxPermSize=256m -XX:PermSize=128m -cp /home/jenkins/jenkins-slave/maven32-agent.jar:/home/jenkins/tools/maven/apache-maven-3.2.5/boot/plexus-classworlds-2.5.2.jar:/home/jenkins/tools/maven/apache-maven-3.2.5/conf/logging jenkins.maven3.agent.Maven32Main /home/jenkins/tools/maven/apache-maven-3.2.5 /home/jenkins/jenkins-slave/slave.jar /home/jenkins/jenkins-slave/maven32-interceptor.jar /home/jenkins/jenkins-slave/maven3-interceptor-commons.jar 38532
Exception in thread "main" java.lang.UnsupportedClassVersionError: hudson/remoting/Launcher : Unsupported major.minor version 52.0
        at java.lang.ClassLoader.defineClass1(Native Method)
        at java.lang.ClassLoader.defineClass(ClassLoader.java:800)
        at java.security.SecureClassLoader.defineClass(SecureClassLoader.java:142)
        at java.net.URLClassLoader.defineClass(URLClassLoader.java:449)
        at java.net.URLClassLoader.access$100(URLClassLoader.java:71)
        at java.net.URLClassLoader$1.run(URLClassLoader.java:361)
        at java.net.URLClassLoader$1.run(URLClassLoader.java:355)
        at java.security.AccessController.doPrivileged(Native Method)
        at java.net.URLClassLoader.findClass(URLClassLoader.java:354)
        at org.codehaus.plexus.classworlds.realm.ClassRealm.loadClassFromSelf(ClassRealm.java:401)
        at org.codehaus.plexus.classworlds.strategy.SelfFirstStrategy.loadClass(SelfFirstStrategy.java:42)
        at org.codehaus.plexus.classworlds.realm.ClassRealm.unsynchronizedLoadClass(ClassRealm.java:271)
        at org.codehaus.plexus.classworlds.realm.ClassRealm.loadClass(ClassRealm.java:247)
        at org.codehaus.plexus.classworlds.realm.ClassRealm.loadClass(ClassRealm.java:239)
        at jenkins.maven3.agent.Maven32Main.main(Maven32Main.java:143)
        at jenkins.maven3.agent.Maven32Main.main(Maven32Main.java:74)
[locks-and-latches] Releasing all the locks
[locks-and-latches] All the locks released
ERROR: Failed to parse POMs
java.io.EOFException: unexpected stream termination
        at hudson.remoting.ChannelBuilder.negotiate(ChannelBuilder.java:408)
        at hudson.remoting.ChannelBuilder.build(ChannelBuilder.java:353)
        at hudson.slaves.Channels.forProcess(Channels.java:115)
        at hudson.maven.AbstractMavenProcessFactory.newProcess(AbstractMavenProcessFactory.java:294)
        at hudson.maven.ProcessCache.get(ProcessCache.java:236)
        at hudson.maven.MavenModuleSetBuild$MavenModuleSetBuildExecution.doRun(MavenModuleSetBuild.java:804)
        at hudson.model.AbstractBuild$AbstractBuildExecution.run(AbstractBuild.java:504)
        at hudson.model.Run.execute(Run.java:1724)
        at hudson.maven.MavenModuleSetBuild.run(MavenModuleSetBuild.java:543)
        at hudson.model.ResourceController.execute(ResourceController.java:97)
        at hudson.model.Executor.run(Executor.java:421)

---------------------------------------------------------------------
To unsubscribe, e-mail: [hidden email]
For additional commands, e-mail: [hidden email]

Reply | Threaded
Open this post in threaded view
|

Jenkins build is back to normal : Struts-archetypes-JDK7-master #13

Apache Jenkins Server-2
See <https://builds.apache.org/job/Struts-archetypes-JDK7-master/13/display/redirect>


---------------------------------------------------------------------
To unsubscribe, e-mail: [hidden email]
For additional commands, e-mail: [hidden email]