Build failed in Jenkins: Struts-JDK9-master #1

classic Classic list List threaded Threaded
94 messages Options
12345
Reply | Threaded
Open this post in threaded view
|

Build failed in Jenkins: Struts-JDK9-master #1

Apache Jenkins Server-2
See <https://builds.apache.org/job/Struts-JDK9-master/1/>

------------------------------------------
Started by user Lukasz Lenart
[EnvInject] - Loading node environment variables.
ERROR: SEVERE ERROR occurs
org.jenkinsci.lib.envinject.EnvInjectException: hudson.remoting.ChannelClosedException: channel is already closed
        at org.jenkinsci.plugins.envinject.service.EnvironmentVariablesNodeLoader.gatherEnvironmentVariablesNode(EnvironmentVariablesNodeLoader.java:75)
        at org.jenkinsci.plugins.envinject.EnvInjectListener.loadEnvironmentVariablesNode(EnvInjectListener.java:81)
        at org.jenkinsci.plugins.envinject.EnvInjectListener.setUpEnvironment(EnvInjectListener.java:39)
        at hudson.model.AbstractBuild$AbstractBuildExecution.createLauncher(AbstractBuild.java:572)
        at hudson.model.AbstractBuild$AbstractBuildExecution.run(AbstractBuild.java:492)
        at hudson.model.Run.execute(Run.java:1738)
        at hudson.maven.MavenModuleSetBuild.run(MavenModuleSetBuild.java:531)
        at hudson.model.ResourceController.execute(ResourceController.java:98)
        at hudson.model.Executor.run(Executor.java:410)
Caused by: hudson.remoting.ChannelClosedException: channel is already closed
        at hudson.remoting.Channel.send(Channel.java:578)
        at hudson.remoting.Request.call(Request.java:130)
        at hudson.remoting.Channel.call(Channel.java:780)
        at hudson.FilePath.act(FilePath.java:1074)
        at org.jenkinsci.plugins.envinject.service.EnvironmentVariablesNodeLoader.gatherEnvironmentVariablesNode(EnvironmentVariablesNodeLoader.java:44)
        ... 8 more
Caused by: java.io.IOException
        at hudson.remoting.Channel.close(Channel.java:1163)
        at hudson.slaves.ChannelPinger$1.onDead(ChannelPinger.java:118)
        at hudson.remoting.PingThread.ping(PingThread.java:126)
        at hudson.remoting.PingThread.run(PingThread.java:85)
Caused by: java.util.concurrent.TimeoutException: Ping started at 1470458374150 hasn't completed by 1470458614150
        ... 2 more
[EnvInject] - [ERROR] - SEVERE ERROR occurs: channel is already closed

---------------------------------------------------------------------
To unsubscribe, e-mail: [hidden email]
For additional commands, e-mail: [hidden email]

Reply | Threaded
Open this post in threaded view
|

Build failed in Jenkins: Struts-JDK9-master #2

Apache Jenkins Server-2
See <https://builds.apache.org/job/Struts-JDK9-master/2/>

------------------------------------------
Started by an SCM change
[EnvInject] - Loading node environment variables.
ERROR: SEVERE ERROR occurs
org.jenkinsci.lib.envinject.EnvInjectException: hudson.remoting.ChannelClosedException: channel is already closed
        at org.jenkinsci.plugins.envinject.service.EnvironmentVariablesNodeLoader.gatherEnvironmentVariablesNode(EnvironmentVariablesNodeLoader.java:75)
        at org.jenkinsci.plugins.envinject.EnvInjectListener.loadEnvironmentVariablesNode(EnvInjectListener.java:81)
        at org.jenkinsci.plugins.envinject.EnvInjectListener.setUpEnvironment(EnvInjectListener.java:39)
        at hudson.model.AbstractBuild$AbstractBuildExecution.createLauncher(AbstractBuild.java:572)
        at hudson.model.AbstractBuild$AbstractBuildExecution.run(AbstractBuild.java:492)
        at hudson.model.Run.execute(Run.java:1738)
        at hudson.maven.MavenModuleSetBuild.run(MavenModuleSetBuild.java:531)
        at hudson.model.ResourceController.execute(ResourceController.java:98)
        at hudson.model.Executor.run(Executor.java:410)
Caused by: hudson.remoting.ChannelClosedException: channel is already closed
        at hudson.remoting.Channel.send(Channel.java:578)
        at hudson.remoting.Request.call(Request.java:130)
        at hudson.remoting.Channel.call(Channel.java:780)
        at hudson.FilePath.act(FilePath.java:1074)
        at org.jenkinsci.plugins.envinject.service.EnvironmentVariablesNodeLoader.gatherEnvironmentVariablesNode(EnvironmentVariablesNodeLoader.java:44)
        ... 8 more
Caused by: java.io.IOException
        at hudson.remoting.Channel.close(Channel.java:1163)
        at hudson.slaves.ChannelPinger$1.onDead(ChannelPinger.java:118)
        at hudson.remoting.PingThread.ping(PingThread.java:126)
        at hudson.remoting.PingThread.run(PingThread.java:85)
Caused by: java.util.concurrent.TimeoutException: Ping started at 1470458374150 hasn't completed by 1470458614150
        ... 2 more
[EnvInject] - [ERROR] - SEVERE ERROR occurs: channel is already closed

---------------------------------------------------------------------
To unsubscribe, e-mail: [hidden email]
For additional commands, e-mail: [hidden email]

Reply | Threaded
Open this post in threaded view
|

Build failed in Jenkins: Struts-JDK9-master #3

Apache Jenkins Server-2
See <https://builds.apache.org/job/Struts-JDK9-master/3/>

------------------------------------------
Started by an SCM change
[EnvInject] - Loading node environment variables.
Building remotely on ubuntu3 (Ubuntu ubuntu legacy-ubuntu) in workspace <https://builds.apache.org/job/Struts-JDK9-master/ws/>
Cloning the remote Git repository
Cloning repository http://git.apache.org/struts.git
 > git init <https://builds.apache.org/job/Struts-JDK9-master/ws/> # timeout=10
Fetching upstream changes from http://git.apache.org/struts.git
 > git --version # timeout=10
 > git -c core.askpass=true fetch --tags --progress http://git.apache.org/struts.git +refs/heads/*:refs/remotes/origin/*
 > git config remote.origin.url http://git.apache.org/struts.git # timeout=10
 > git config --add remote.origin.fetch +refs/heads/*:refs/remotes/origin/* # timeout=10
 > git config remote.origin.url http://git.apache.org/struts.git # timeout=10
Fetching upstream changes from http://git.apache.org/struts.git
 > git -c core.askpass=true fetch --tags --progress http://git.apache.org/struts.git +refs/heads/*:refs/remotes/origin/*
 > git rev-parse refs/remotes/origin/master^{commit} # timeout=10
 > git rev-parse refs/remotes/origin/origin/master^{commit} # timeout=10
Checking out Revision ef9c66118ede16f3ff239ea864641d5bdadeecae (refs/remotes/origin/master)
 > git config core.sparsecheckout # timeout=10
 > git checkout -f ef9c66118ede16f3ff239ea864641d5bdadeecae
First time build. Skipping changelog.
[locks-and-latches] Checking to see if we really have the locks
[locks-and-latches] Have all the locks, build can start
Parsing POMs
Discovered a new module org.apache.struts:struts2-parent Struts 2
Discovered a new module org.apache.struts:struts2-bom Struts 2 Bill of Materials
Discovered a new module org.apache.struts:struts2-core Struts 2 Core
Discovered a new module org.apache.struts:struts2-apps Struts 2 Webapps
Discovered a new module org.apache.struts:struts2-showcase Struts 2 Showcase Webapp
Discovered a new module org.apache.struts:struts2-rest-showcase Struts 2 Rest Showcase Webapp
Discovered a new module org.apache.struts:struts2-plugins Struts Plugins
Discovered a new module org.apache.struts:struts2-bean-validation-plugin Struts 2 Bean Validation Plugin
Discovered a new module org.apache.struts:struts2-cdi-plugin Struts 2 CDI Plugin
Discovered a new module org.apache.struts:struts2-config-browser-plugin Struts 2 Configuration Browser Plugin
Discovered a new module org.apache.struts:struts2-convention-plugin Struts 2 Convention Plugin
Discovered a new module org.apache.struts:struts2-dwr-plugin Struts 2 DWR Plugin
Discovered a new module org.apache.struts:struts2-embeddedjsp-plugin Struts 2 Embedded JSP Plugin
Discovered a new module org.apache.struts:struts2-gxp-plugin Struts 2 GXP Plugin
Discovered a new module org.apache.struts:struts2-jasperreports-plugin Struts 2 Jasper Reports Plugin
Discovered a new module org.apache.struts:struts2-javatemplates-plugin Struts 2 Java Templates Plugin
Discovered a new module org.apache.struts:struts2-jfreechart-plugin Struts 2 JFreeChart Plugin
Discovered a new module org.apache.struts:struts2-json-plugin Struts 2 JSON Plugin
Discovered a new module org.apache.struts:struts2-junit-plugin Struts 2 JUnit Plugin
Discovered a new module org.apache.struts:struts2-osgi-plugin Struts 2 OSGi Plugin
Discovered a new module org.apache.struts:struts2-oval-plugin Struts 2 OVal Plugin
Discovered a new module org.apache.struts:struts2-pell-multipart-plugin Struts 2 Pell Multipart Plugin
Discovered a new module org.apache.struts:struts2-plexus-plugin Struts 2 Plexus Plugin
Discovered a new module org.apache.struts:struts2-portlet-plugin Struts 2 Portlet Plugin
Discovered a new module org.apache.struts:struts2-portlet-tiles-plugin Struts 2 Portlet Tiles Plugin
Discovered a new module org.apache.struts:struts2-rest-plugin Struts 2 REST Plugin
Discovered a new module org.apache.struts:struts2-sitegraph-plugin Struts 2 Sitegraph Plugin
Discovered a new module org.apache.struts:struts2-sitemesh-plugin Struts 2 Sitemesh Plugin
Discovered a new module org.apache.struts:struts2-spring-plugin Struts 2 Spring Plugin
Discovered a new module org.apache.struts:struts2-testng-plugin Struts 2 TestNG Plugin
Discovered a new module org.apache.struts:struts2-tiles-plugin Struts 2 Tiles Plugin
Discovered a new module org.apache.struts:struts2-osgi-bundles Struts OSGi Bundles
Discovered a new module org.apache.struts:struts2-osgi-admin-bundle Struts 2 OSGi Admin Bundle
Discovered a new module org.apache.struts:struts2-osgi-demo-bundle Struts 2 OSGi Demo Bundle
Discovered a new module org.apache.struts:struts2-assembly Struts 2 Assembly
Modules changed, recalculating dependency graph
Established TCP socket on 52418
maven32-agent.jar already up to date
maven32-interceptor.jar already up to date
maven3-interceptor-commons.jar already up to date
[Struts-JDK9-master] $ /home/jenkins/tools/java/jdk-9-ea-b128/bin/java -Xms128m -Xmx768m -XX:MaxPermSize=256m -XX:PermSize=128m -cp /home/jenkins/jenkins-slave/maven32-agent.jar:/home/jenkins/tools/maven/latest3/boot/plexus-classworlds-2.5.1.jar:/home/jenkins/tools/maven/latest3/conf/logging jenkins.maven3.agent.Maven32Main /home/jenkins/tools/maven/latest3/ /x1/jenkins/jenkins-slave/slave.jar /home/jenkins/jenkins-slave/maven32-interceptor.jar /home/jenkins/jenkins-slave/maven3-interceptor-commons.jar 52418
[locks-and-latches] Releasing all the locks
[locks-and-latches] All the locks released
ERROR: Failed to parse POMs
java.io.IOException: Cannot run program "/home/jenkins/tools/java/jdk-9-ea-b128/bin/java" (in directory "<https://builds.apache.org/job/Struts-JDK9-master/ws/")>: error=2, No such file or directory
        at java.lang.ProcessBuilder.start(ProcessBuilder.java:1041)
        at hudson.Proc$LocalProc.<init>(Proc.java:244)
        at hudson.Proc$LocalProc.<init>(Proc.java:216)
        at hudson.Launcher$LocalLauncher.launch(Launcher.java:815)
        at hudson.Launcher$ProcStarter.start(Launcher.java:381)
        at hudson.Launcher$RemoteLaunchCallable.call(Launcher.java:1148)
        at hudson.Launcher$RemoteLaunchCallable.call(Launcher.java:1113)
        at hudson.remoting.UserRequest.perform(UserRequest.java:120)
        at hudson.remoting.UserRequest.perform(UserRequest.java:48)
        at hudson.remoting.Request$2.run(Request.java:326)
        at hudson.remoting.InterceptingExecutorService$1.call(InterceptingExecutorService.java:68)
        at java.util.concurrent.FutureTask.run(FutureTask.java:262)
        at java.util.concurrent.ThreadPoolExecutor.runWorker(ThreadPoolExecutor.java:1145)
        at java.util.concurrent.ThreadPoolExecutor$Worker.run(ThreadPoolExecutor.java:615)
        at java.lang.Thread.run(Thread.java:745)
        at ......remote call to ubuntu3(Native Method)
        at hudson.remoting.Channel.attachCallSiteStackTrace(Channel.java:1416)
        at hudson.remoting.UserResponse.retrieve(UserRequest.java:220)
        at hudson.remoting.Channel.call(Channel.java:781)
        at hudson.Launcher$RemoteLauncher.launch(Launcher.java:928)
        at hudson.Launcher$ProcStarter.start(Launcher.java:381)
        at hudson.maven.AbstractMavenProcessFactory.newProcess(AbstractMavenProcessFactory.java:281)
        at hudson.maven.ProcessCache.get(ProcessCache.java:236)
        at hudson.maven.MavenModuleSetBuild$MavenModuleSetBuildExecution.doRun(MavenModuleSetBuild.java:778)
        at hudson.model.AbstractBuild$AbstractBuildExecution.run(AbstractBuild.java:534)
        at hudson.model.Run.execute(Run.java:1738)
        at hudson.maven.MavenModuleSetBuild.run(MavenModuleSetBuild.java:531)
        at hudson.model.ResourceController.execute(ResourceController.java:98)
        at hudson.model.Executor.run(Executor.java:410)
Caused by: java.io.IOException: error=2, No such file or directory
        at java.lang.UNIXProcess.forkAndExec(Native Method)
        at java.lang.UNIXProcess.<init>(UNIXProcess.java:186)
        at java.lang.ProcessImpl.start(ProcessImpl.java:130)
        at java.lang.ProcessBuilder.start(ProcessBuilder.java:1022)
        at hudson.Proc$LocalProc.<init>(Proc.java:244)
        at hudson.Proc$LocalProc.<init>(Proc.java:216)
        at hudson.Launcher$LocalLauncher.launch(Launcher.java:815)
        at hudson.Launcher$ProcStarter.start(Launcher.java:381)
        at hudson.Launcher$RemoteLaunchCallable.call(Launcher.java:1148)
        at hudson.Launcher$RemoteLaunchCallable.call(Launcher.java:1113)
        at hudson.remoting.UserRequest.perform(UserRequest.java:120)
        at hudson.remoting.UserRequest.perform(UserRequest.java:48)
        at hudson.remoting.Request$2.run(Request.java:326)
        at hudson.remoting.InterceptingExecutorService$1.call(InterceptingExecutorService.java:68)
        at java.util.concurrent.FutureTask.run(FutureTask.java:262)
        at java.util.concurrent.ThreadPoolExecutor.runWorker(ThreadPoolExecutor.java:1145)
        at java.util.concurrent.ThreadPoolExecutor$Worker.run(ThreadPoolExecutor.java:615)
        at java.lang.Thread.run(Thread.java:745)

---------------------------------------------------------------------
To unsubscribe, e-mail: [hidden email]
For additional commands, e-mail: [hidden email]

Reply | Threaded
Open this post in threaded view
|

Build failed in Jenkins: Struts-JDK9-master #4

Apache Jenkins Server-2
See <https://builds.apache.org/job/Struts-JDK9-master/4/>

------------------------------------------
Started by user Lukasz Lenart
[EnvInject] - Loading node environment variables.
Building remotely on ubuntu-ppc64le (ppc64le) in workspace <https://builds.apache.org/job/Struts-JDK9-master/ws/>
Cloning the remote Git repository
Cloning repository http://git.apache.org/struts.git
 > git init <https://builds.apache.org/job/Struts-JDK9-master/ws/> # timeout=10
Fetching upstream changes from http://git.apache.org/struts.git
 > git --version # timeout=10
 > git -c core.askpass=true fetch --tags --progress http://git.apache.org/struts.git +refs/heads/*:refs/remotes/origin/*
 > git config remote.origin.url http://git.apache.org/struts.git # timeout=10
 > git config --add remote.origin.fetch +refs/heads/*:refs/remotes/origin/* # timeout=10
 > git config remote.origin.url http://git.apache.org/struts.git # timeout=10
Fetching upstream changes from http://git.apache.org/struts.git
 > git -c core.askpass=true fetch --tags --progress http://git.apache.org/struts.git +refs/heads/*:refs/remotes/origin/*
 > git rev-parse refs/remotes/origin/master^{commit} # timeout=10
 > git rev-parse refs/remotes/origin/origin/master^{commit} # timeout=10
Checking out Revision ef9c66118ede16f3ff239ea864641d5bdadeecae (refs/remotes/origin/master)
 > git config core.sparsecheckout # timeout=10
 > git checkout -f ef9c66118ede16f3ff239ea864641d5bdadeecae
 > git rev-list ef9c66118ede16f3ff239ea864641d5bdadeecae # timeout=10
ERROR: Maven Home /home/jenkins/tools/maven/latest3 doesn’t exist


---------------------------------------------------------------------
To unsubscribe, e-mail: [hidden email]
For additional commands, e-mail: [hidden email]

Reply | Threaded
Open this post in threaded view
|

Build failed in Jenkins: Struts-JDK9-master #5

Apache Jenkins Server-2
See <https://builds.apache.org/job/Struts-JDK9-master/5/>

------------------------------------------
Started by user Lukasz Lenart
[EnvInject] - Loading node environment variables.
Building remotely on ubuntu-4 (docker Ubuntu ubuntu4 ubuntu yahoo-not-h2) in workspace <https://builds.apache.org/job/Struts-JDK9-master/ws/>
Cloning the remote Git repository
Cloning repository http://git.apache.org/struts.git
 > git init <https://builds.apache.org/job/Struts-JDK9-master/ws/> # timeout=10
Fetching upstream changes from http://git.apache.org/struts.git
 > git --version # timeout=10
 > git -c core.askpass=true fetch --tags --progress http://git.apache.org/struts.git +refs/heads/*:refs/remotes/origin/*
 > git config remote.origin.url http://git.apache.org/struts.git # timeout=10
 > git config --add remote.origin.fetch +refs/heads/*:refs/remotes/origin/* # timeout=10
 > git config remote.origin.url http://git.apache.org/struts.git # timeout=10
Fetching upstream changes from http://git.apache.org/struts.git
 > git -c core.askpass=true fetch --tags --progress http://git.apache.org/struts.git +refs/heads/*:refs/remotes/origin/*
 > git rev-parse refs/remotes/origin/master^{commit} # timeout=10
 > git rev-parse refs/remotes/origin/origin/master^{commit} # timeout=10
Checking out Revision ef9c66118ede16f3ff239ea864641d5bdadeecae (refs/remotes/origin/master)
 > git config core.sparsecheckout # timeout=10
 > git checkout -f ef9c66118ede16f3ff239ea864641d5bdadeecae
 > git rev-list ef9c66118ede16f3ff239ea864641d5bdadeecae # timeout=10
[locks-and-latches] Checking to see if we really have the locks
[locks-and-latches] Have all the locks, build can start
Parsing POMs
Established TCP socket on 60930
maven32-agent.jar already up to date
maven32-interceptor.jar already up to date
maven3-interceptor-commons.jar already up to date
[Struts-JDK9-master] $ /home/jenkins/tools/java/jdk-9-ea-b128/bin/java -Xms128m -Xmx768m -XX:MaxPermSize=256m -XX:PermSize=128m -cp /home/jenkins/jenkins-slave/maven32-agent.jar:/home/jenkins/tools/maven/latest3/boot/plexus-classworlds-2.5.2.jar:/home/jenkins/tools/maven/latest3/conf/logging jenkins.maven3.agent.Maven32Main /home/jenkins/tools/maven/latest3/ /home/jenkins/jenkins-slave/slave.jar /home/jenkins/jenkins-slave/maven32-interceptor.jar /home/jenkins/jenkins-slave/maven3-interceptor-commons.jar 60930
Unrecognized VM option 'MaxPermSize=256m'
Error: Could not create the Java Virtual Machine.
Error: A fatal exception has occurred. Program will exit.
[locks-and-latches] Releasing all the locks
[locks-and-latches] All the locks released
ERROR: Failed to launch Maven. Exit code = 1


---------------------------------------------------------------------
To unsubscribe, e-mail: [hidden email]
For additional commands, e-mail: [hidden email]

Reply | Threaded
Open this post in threaded view
|

Build failed in Jenkins: Struts-JDK9-master #6

Apache Jenkins Server-2
See <https://builds.apache.org/job/Struts-JDK9-master/6/>

------------------------------------------
[...truncated 14388 lines...]
[INFO] --- maven-compiler-plugin:3.3:compile (default-compile) @ struts2-rest-plugin ---
[INFO] Changes detected - recompiling the module!
[INFO] Compiling 17 source files to <https://builds.apache.org/job/Struts-JDK9-master/ws/plugins/rest/target/classes>
[INFO]
[INFO] --- maven-bundle-plugin:2.1.0:manifest (bundle-manifest) @ struts2-rest-plugin ---
[WARNING] Warning in manifest for org.apache.struts:struts2-rest-plugin:jar:2.5.3-SNAPSHOT : Superfluous export-package instructions: [org.apache.struts2, org, org.apache]
[INFO]
[INFO] --- maven-resources-plugin:2.6:testResources (default-testResources) @ struts2-rest-plugin ---
[INFO] Using 'UTF-8' encoding to copy filtered resources.
[INFO] skip non existing resourceDirectory <https://builds.apache.org/job/Struts-JDK9-master/ws/plugins/rest/src/test/resources>
[INFO] Copying 3 resources
[INFO]
[INFO] --- maven-compiler-plugin:3.3:testCompile (default-testCompile) @ struts2-rest-plugin ---
[INFO] Changes detected - recompiling the module!
[INFO] Compiling 9 source files to <https://builds.apache.org/job/Struts-JDK9-master/ws/plugins/rest/target/test-classes>
[INFO] <https://builds.apache.org/job/Struts-JDK9-master/ws/plugins/rest/src/test/java/org/apache/struts2/rest/DefaultContentTypeHandlerManagerTest.java>: Some input files use unchecked or unsafe operations.
[INFO] <https://builds.apache.org/job/Struts-JDK9-master/ws/plugins/rest/src/test/java/org/apache/struts2/rest/DefaultContentTypeHandlerManagerTest.java>: Recompile with -Xlint:unchecked for details.
[INFO]
[INFO] --- maven-surefire-plugin:2.19.1:test (default-test) @ struts2-rest-plugin ---

-------------------------------------------------------
 T E S T S
-------------------------------------------------------
Running org.apache.struts2.rest.RestActionMapperTest
ERROR StatusLogger Log4j2 could not find a logging implementation. Please add log4j-core to the classpath. Using SimpleLogger to log to the console...
Tests run: 26, Failures: 0, Errors: 0, Skipped: 0, Time elapsed: 0.701 sec - in org.apache.struts2.rest.RestActionMapperTest
Running org.apache.struts2.rest.handler.JsonLibHandlerTest
Tests run: 5, Failures: 0, Errors: 0, Skipped: 0, Time elapsed: 0.285 sec - in org.apache.struts2.rest.handler.JsonLibHandlerTest
Running org.apache.struts2.rest.handler.JacksonLibHandlerTest
Tests run: 6, Failures: 0, Errors: 0, Skipped: 0, Time elapsed: 0.373 sec - in org.apache.struts2.rest.handler.JacksonLibHandlerTest
Running org.apache.struts2.rest.RestWorkflowInterceptorTest
Tests run: 1, Failures: 0, Errors: 0, Skipped: 0, Time elapsed: 0.044 sec - in org.apache.struts2.rest.RestWorkflowInterceptorTest
Running org.apache.struts2.rest.ContentTypeHandlerManagerTest
Tests run: 5, Failures: 0, Errors: 0, Skipped: 0, Time elapsed: 0.037 sec - in org.apache.struts2.rest.ContentTypeHandlerManagerTest
Running org.apache.struts2.rest.DefaultHttpHeadersTest
Tests run: 15, Failures: 0, Errors: 0, Skipped: 0, Time elapsed: 0.016 sec - in org.apache.struts2.rest.DefaultHttpHeadersTest
Running org.apache.struts2.rest.RestActionInvocationTest
Tests run: 6, Failures: 0, Errors: 0, Skipped: 0, Time elapsed: 0.502 sec - in org.apache.struts2.rest.RestActionInvocationTest
Running org.apache.struts2.rest.DefaultContentTypeHandlerManagerTest
Tests run: 5, Failures: 0, Errors: 0, Skipped: 0, Time elapsed: 0.068 sec - in org.apache.struts2.rest.DefaultContentTypeHandlerManagerTest

Results :

Tests run: 69, Failures: 0, Errors: 0, Skipped: 0

[JENKINS] Recording test results
[INFO]
[INFO] --- maven-jar-plugin:2.5:jar (default-jar) @ struts2-rest-plugin ---
[INFO] Building jar: <https://builds.apache.org/job/Struts-JDK9-master/ws/plugins/rest/target/struts2-rest-plugin-2.5.3-SNAPSHOT.jar>
[INFO]
[INFO] >>> maven-source-plugin:2.3:jar (attach-sources) > generate-sources @ struts2-rest-plugin >>>
[WARNING] Failed to getClass for org.apache.maven.plugin.source.SourceJarMojo
[INFO]
[INFO] <<< maven-source-plugin:2.3:jar (attach-sources) < generate-sources @ struts2-rest-plugin <<<
[INFO]
[INFO] --- maven-source-plugin:2.3:jar (attach-sources) @ struts2-rest-plugin ---
[INFO] Building jar: <https://builds.apache.org/job/Struts-JDK9-master/ws/plugins/rest/target/struts2-rest-plugin-2.5.3-SNAPSHOT-sources.jar>
[INFO]
[INFO] --- maven-site-plugin:3.4:attach-descriptor (attach-descriptor) @ struts2-rest-plugin ---
[INFO]                                                                        
[INFO] ------------------------------------------------------------------------
[INFO] Building Struts 2 Rest Showcase Webapp 2.5.3-SNAPSHOT
[INFO] ------------------------------------------------------------------------
[INFO]
[INFO] --- maven-clean-plugin:2.5:clean (default-clean) @ struts2-rest-showcase ---
[INFO]
[INFO] --- maven-antrun-plugin:1.7:run (copy-sources) @ struts2-rest-showcase ---
[WARNING] Parameter tasks is deprecated, use target instead
[INFO] Executing tasks

main:
     [copy] Copying 4 files to <https://builds.apache.org/job/Struts-JDK9-master/ws/apps/rest-showcase/target/struts2-rest-showcase/WEB-INF/src/java>
     [copy] Copying 3 files to <https://builds.apache.org/job/Struts-JDK9-master/ws/apps/rest-showcase/target/struts2-rest-showcase/WEB-INF/src/java>
[INFO] Executed tasks
[INFO]
[INFO] --- maven-remote-resources-plugin:1.5:process (default) @ struts2-rest-showcase ---
[INFO]
[INFO] --- maven-resources-plugin:2.6:resources (default-resources) @ struts2-rest-showcase ---
[INFO] Using 'UTF-8' encoding to copy filtered resources.
[INFO] Copying 3 resources
[INFO] Copying 3 resources
[INFO]
[INFO] --- maven-compiler-plugin:3.3:compile (default-compile) @ struts2-rest-showcase ---
[INFO] Changes detected - recompiling the module!
[INFO] Compiling 4 source files to <https://builds.apache.org/job/Struts-JDK9-master/ws/apps/rest-showcase/target/classes>
[INFO] -------------------------------------------------------------
[ERROR] COMPILATION ERROR :
[INFO] -------------------------------------------------------------
[ERROR] Source option 1.5 is no longer supported. Use 1.6 or later.
[ERROR] Target option 1.5 is no longer supported. Use 1.6 or later.
[INFO] 2 errors
[INFO] -------------------------------------------------------------
[INFO] ------------------------------------------------------------------------
[INFO] Reactor Summary:
[INFO]
[INFO] Struts 2 Bill of Materials ......................... SUCCESS [  3.438 s]
[INFO] Struts 2 ........................................... SUCCESS [  2.607 s]
[INFO] Struts 2 Core ...................................... SUCCESS [01:22 min]
[INFO] Struts Plugins ..................................... SUCCESS [  1.262 s]
[INFO] Struts 2 Configuration Browser Plugin .............. SUCCESS [  2.811 s]
[INFO] Struts 2 Sitemesh Plugin ........................... SUCCESS [  2.142 s]
[INFO] Struts 2 Tiles Plugin .............................. SUCCESS [  4.697 s]
[INFO] Struts 2 DWR Plugin ................................ SUCCESS [  1.509 s]
[INFO] Struts 2 Spring Plugin ............................. SUCCESS [  4.519 s]
[INFO] Struts 2 Convention Plugin ......................... SUCCESS [  9.023 s]
[INFO] Struts 2 JUnit Plugin .............................. SUCCESS [ 12.801 s]
[INFO] Struts 2 JSON Plugin ............................... SUCCESS [ 12.217 s]
[INFO] Struts 2 Bean Validation Plugin .................... SUCCESS [  5.323 s]
[INFO] Struts 2 Webapps ................................... SUCCESS [  1.391 s]
[INFO] Struts 2 Showcase Webapp ........................... SUCCESS [  9.651 s]
[INFO] Struts 2 REST Plugin ............................... SUCCESS [  7.762 s]
[INFO] Struts 2 Rest Showcase Webapp ...................... FAILURE [  1.074 s]
[INFO] Struts 2 CDI Plugin ................................ SKIPPED
[INFO] Struts 2 Embedded JSP Plugin ....................... SKIPPED
[INFO] Struts 2 GXP Plugin ................................ SKIPPED
[INFO] Struts 2 Jasper Reports Plugin ..................... SKIPPED
[INFO] Struts 2 Java Templates Plugin ..................... SKIPPED
[INFO] Struts 2 JFreeChart Plugin ......................... SKIPPED
[INFO] Struts 2 OSGi Plugin ............................... SKIPPED
[INFO] Struts 2 OVal Plugin ............................... SKIPPED
[INFO] Struts 2 Pell Multipart Plugin ..................... SKIPPED
[INFO] Struts 2 Plexus Plugin ............................. SKIPPED
[INFO] Struts 2 Portlet Plugin ............................ SKIPPED
[INFO] Struts 2 Portlet Tiles Plugin ...................... SKIPPED
[INFO] Struts 2 Sitegraph Plugin .......................... SKIPPED
[INFO] Struts 2 TestNG Plugin ............................. SKIPPED
[INFO] Struts OSGi Bundles ................................ SKIPPED
[INFO] Struts 2 OSGi Admin Bundle ......................... SKIPPED
[INFO] Struts 2 OSGi Demo Bundle .......................... SKIPPED
[INFO] Struts 2 Assembly .................................. SKIPPED
[INFO] ------------------------------------------------------------------------
[INFO] BUILD FAILURE
[INFO] ------------------------------------------------------------------------
[INFO] Total time: 03:06 min
[INFO] Finished at: 2016-08-07T20:49:12+00:00
[INFO] Final Memory: 71M/235M
[INFO] ------------------------------------------------------------------------
[ERROR] Failed to execute goal org.apache.maven.plugins:maven-compiler-plugin:3.3:compile (default-compile) on project struts2-rest-showcase: Compilation failure: Compilation failure:
[ERROR] Source option 1.5 is no longer supported. Use 1.6 or later.
[ERROR] Target option 1.5 is no longer supported. Use 1.6 or later.
[ERROR] -> [Help 1]
[ERROR]
[ERROR] To see the full stack trace of the errors, re-run Maven with the -e switch.
[ERROR] Re-run Maven using the -X switch to enable full debug logging.
[ERROR]
[ERROR] For more information about the errors and possible solutions, please read the following articles:
[ERROR] [Help 1] http://cwiki.apache.org/confluence/display/MAVEN/MojoFailureException
[ERROR]
[ERROR] After correcting the problems, you can resume the build with the command
[ERROR]   mvn <goals> -rf :struts2-rest-showcase
[JENKINS] Archiving <https://builds.apache.org/job/Struts-JDK9-master/ws/plugins/pell-multipart/pom.xml> to org.apache.struts/struts2-pell-multipart-plugin/2.5.3-SNAPSHOT/struts2-pell-multipart-plugin-2.5.3-SNAPSHOT.pom
No prior successful build to compare, so performing full copy of artifacts
[JENKINS] Archiving <https://builds.apache.org/job/Struts-JDK9-master/ws/plugins/plexus/pom.xml> to org.apache.struts/struts2-plexus-plugin/2.5.3-SNAPSHOT/struts2-plexus-plugin-2.5.3-SNAPSHOT.pom
No prior successful build to compare, so performing full copy of artifacts
[JENKINS] Archiving <https://builds.apache.org/job/Struts-JDK9-master/ws/plugins/jfreechart/pom.xml> to org.apache.struts/struts2-jfreechart-plugin/2.5.3-SNAPSHOT/struts2-jfreechart-plugin-2.5.3-SNAPSHOT.pom
No prior successful build to compare, so performing full copy of artifacts
[JENKINS] Archiving <https://builds.apache.org/job/Struts-JDK9-master/ws/plugins/sitemesh/pom.xml> to org.apache.struts/struts2-sitemesh-plugin/2.5.3-SNAPSHOT/struts2-sitemesh-plugin-2.5.3-SNAPSHOT.pom
[JENKINS] Archiving <https://builds.apache.org/job/Struts-JDK9-master/ws/plugins/sitemesh/target/struts2-sitemesh-plugin-2.5.3-SNAPSHOT.jar> to org.apache.struts/struts2-sitemesh-plugin/2.5.3-SNAPSHOT/struts2-sitemesh-plugin-2.5.3-SNAPSHOT.jar
[JENKINS] Archiving <https://builds.apache.org/job/Struts-JDK9-master/ws/plugins/sitemesh/target/struts2-sitemesh-plugin-2.5.3-SNAPSHOT-sources.jar> to org.apache.struts/struts2-sitemesh-plugin/2.5.3-SNAPSHOT/struts2-sitemesh-plugin-2.5.3-SNAPSHOT-sources.jar
No prior successful build to compare, so performing full copy of artifacts
[JENKINS] Archiving <https://builds.apache.org/job/Struts-JDK9-master/ws/plugins/config-browser/pom.xml> to org.apache.struts/struts2-config-browser-plugin/2.5.3-SNAPSHOT/struts2-config-browser-plugin-2.5.3-SNAPSHOT.pom
[JENKINS] Archiving <https://builds.apache.org/job/Struts-JDK9-master/ws/plugins/config-browser/target/struts2-config-browser-plugin-2.5.3-SNAPSHOT.jar> to org.apache.struts/struts2-config-browser-plugin/2.5.3-SNAPSHOT/struts2-config-browser-plugin-2.5.3-SNAPSHOT.jar
[JENKINS] Archiving <https://builds.apache.org/job/Struts-JDK9-master/ws/plugins/config-browser/target/struts2-config-browser-plugin-2.5.3-SNAPSHOT-sources.jar> to org.apache.struts/struts2-config-browser-plugin/2.5.3-SNAPSHOT/struts2-config-browser-plugin-2.5.3-SNAPSHOT-sources.jar
No prior successful build to compare, so performing full copy of artifacts
[JENKINS] Archiving <https://builds.apache.org/job/Struts-JDK9-master/ws/bundles/demo/pom.xml> to org.apache.struts/struts2-osgi-demo-bundle/2.5.3-SNAPSHOT/struts2-osgi-demo-bundle-2.5.3-SNAPSHOT.pom
No prior successful build to compare, so performing full copy of artifacts
[JENKINS] Archiving <https://builds.apache.org/job/Struts-JDK9-master/ws/plugins/portlet-tiles/pom.xml> to org.apache.struts/struts2-portlet-tiles-plugin/2.5.3-SNAPSHOT/struts2-portlet-tiles-plugin-2.5.3-SNAPSHOT.pom
No prior successful build to compare, so performing full copy of artifacts
[JENKINS] Archiving <https://builds.apache.org/job/Struts-JDK9-master/ws/plugins/jasperreports/pom.xml> to org.apache.struts/struts2-jasperreports-plugin/2.5.3-SNAPSHOT/struts2-jasperreports-plugin-2.5.3-SNAPSHOT.pom
No prior successful build to compare, so performing full copy of artifacts
[JENKINS] Archiving <https://builds.apache.org/job/Struts-JDK9-master/ws/plugins/oval/pom.xml> to org.apache.struts/struts2-oval-plugin/2.5.3-SNAPSHOT/struts2-oval-plugin-2.5.3-SNAPSHOT.pom
No prior successful build to compare, so performing full copy of artifacts
[JENKINS] Archiving <https://builds.apache.org/job/Struts-JDK9-master/ws/plugins/gxp/pom.xml> to org.apache.struts/struts2-gxp-plugin/2.5.3-SNAPSHOT/struts2-gxp-plugin-2.5.3-SNAPSHOT.pom
No prior successful build to compare, so performing full copy of artifacts
[JENKINS] Archiving <https://builds.apache.org/job/Struts-JDK9-master/ws/plugins/convention/pom.xml> to org.apache.struts/struts2-convention-plugin/2.5.3-SNAPSHOT/struts2-convention-plugin-2.5.3-SNAPSHOT.pom
[JENKINS] Archiving <https://builds.apache.org/job/Struts-JDK9-master/ws/plugins/convention/target/struts2-convention-plugin-2.5.3-SNAPSHOT.jar> to org.apache.struts/struts2-convention-plugin/2.5.3-SNAPSHOT/struts2-convention-plugin-2.5.3-SNAPSHOT.jar
[JENKINS] Archiving <https://builds.apache.org/job/Struts-JDK9-master/ws/plugins/convention/target/struts2-convention-plugin-2.5.3-SNAPSHOT-sources.jar> to org.apache.struts/struts2-convention-plugin/2.5.3-SNAPSHOT/struts2-convention-plugin-2.5.3-SNAPSHOT-sources.jar
No prior successful build to compare, so performing full copy of artifacts
[JENKINS] Archiving <https://builds.apache.org/job/Struts-JDK9-master/ws/bundles/pom.xml> to org.apache.struts/struts2-osgi-bundles/2.5.3-SNAPSHOT/struts2-osgi-bundles-2.5.3-SNAPSHOT.pom
No prior successful build to compare, so performing full copy of artifacts
[JENKINS] Archiving <https://builds.apache.org/job/Struts-JDK9-master/ws/pom.xml> to org.apache.struts/struts2-parent/2.5.3-SNAPSHOT/struts2-parent-2.5.3-SNAPSHOT.pom
[JENKINS] Archiving <https://builds.apache.org/job/Struts-JDK9-master/ws/target/struts2-parent-2.5.3-SNAPSHOT-site.xml> to org.apache.struts/struts2-parent/2.5.3-SNAPSHOT/struts2-parent-2.5.3-SNAPSHOT-site.xml
No prior successful build to compare, so performing full copy of artifacts
[JENKINS] Archiving <https://builds.apache.org/job/Struts-JDK9-master/ws/plugins/osgi/pom.xml> to org.apache.struts/struts2-osgi-plugin/2.5.3-SNAPSHOT/struts2-osgi-plugin-2.5.3-SNAPSHOT.pom
No prior successful build to compare, so performing full copy of artifacts
[JENKINS] Archiving <https://builds.apache.org/job/Struts-JDK9-master/ws/assembly/pom.xml> to org.apache.struts/struts2-assembly/2.5.3-SNAPSHOT/struts2-assembly-2.5.3-SNAPSHOT.pom
No prior successful build to compare, so performing full copy of artifacts
[JENKINS] Archiving <https://builds.apache.org/job/Struts-JDK9-master/ws/apps/showcase/pom.xml> to org.apache.struts/struts2-showcase/2.5.3-SNAPSHOT/struts2-showcase-2.5.3-SNAPSHOT.pom
[JENKINS] Archiving <https://builds.apache.org/job/Struts-JDK9-master/ws/apps/showcase/target/struts2-showcase.war> to org.apache.struts/struts2-showcase/2.5.3-SNAPSHOT/struts2-showcase-2.5.3-SNAPSHOT.war
[JENKINS] Archiving <https://builds.apache.org/job/Struts-JDK9-master/ws/apps/showcase/target/struts2-showcase-sources.jar> to org.apache.struts/struts2-showcase/2.5.3-SNAPSHOT/struts2-showcase-2.5.3-SNAPSHOT-sources.jar
No prior successful build to compare, so performing full copy of artifacts
[JENKINS] Archiving <https://builds.apache.org/job/Struts-JDK9-master/ws/plugins/cdi/pom.xml> to org.apache.struts/struts2-cdi-plugin/2.5.3-SNAPSHOT/struts2-cdi-plugin-2.5.3-SNAPSHOT.pom
No prior successful build to compare, so performing full copy of artifacts
[JENKINS] Archiving <https://builds.apache.org/job/Struts-JDK9-master/ws/plugins/rest/pom.xml> to org.apache.struts/struts2-rest-plugin/2.5.3-SNAPSHOT/struts2-rest-plugin-2.5.3-SNAPSHOT.pom
[JENKINS] Archiving <https://builds.apache.org/job/Struts-JDK9-master/ws/plugins/rest/target/struts2-rest-plugin-2.5.3-SNAPSHOT.jar> to org.apache.struts/struts2-rest-plugin/2.5.3-SNAPSHOT/struts2-rest-plugin-2.5.3-SNAPSHOT.jar
[JENKINS] Archiving <https://builds.apache.org/job/Struts-JDK9-master/ws/plugins/rest/target/struts2-rest-plugin-2.5.3-SNAPSHOT-sources.jar> to org.apache.struts/struts2-rest-plugin/2.5.3-SNAPSHOT/struts2-rest-plugin-2.5.3-SNAPSHOT-sources.jar
No prior successful build to compare, so performing full copy of artifacts
[JENKINS] Archiving <https://builds.apache.org/job/Struts-JDK9-master/ws/core/pom.xml> to org.apache.struts/struts2-core/2.5.3-SNAPSHOT/struts2-core-2.5.3-SNAPSHOT.pom
[JENKINS] Archiving <https://builds.apache.org/job/Struts-JDK9-master/ws/core/target/struts2-core-2.5.3-SNAPSHOT.jar> to org.apache.struts/struts2-core/2.5.3-SNAPSHOT/struts2-core-2.5.3-SNAPSHOT.jar
[JENKINS] Archiving <https://builds.apache.org/job/Struts-JDK9-master/ws/core/target/struts2-core-2.5.3-SNAPSHOT-sources.jar> to org.apache.struts/struts2-core/2.5.3-SNAPSHOT/struts2-core-2.5.3-SNAPSHOT-sources.jar
No prior successful build to compare, so performing full copy of artifacts
[JENKINS] Archiving <https://builds.apache.org/job/Struts-JDK9-master/ws/plugins/tiles/pom.xml> to org.apache.struts/struts2-tiles-plugin/2.5.3-SNAPSHOT/struts2-tiles-plugin-2.5.3-SNAPSHOT.pom
[JENKINS] Archiving <https://builds.apache.org/job/Struts-JDK9-master/ws/plugins/tiles/target/struts2-tiles-plugin-2.5.3-SNAPSHOT.jar> to org.apache.struts/struts2-tiles-plugin/2.5.3-SNAPSHOT/struts2-tiles-plugin-2.5.3-SNAPSHOT.jar
[JENKINS] Archiving <https://builds.apache.org/job/Struts-JDK9-master/ws/plugins/tiles/target/struts2-tiles-plugin-2.5.3-SNAPSHOT-sources.jar> to org.apache.struts/struts2-tiles-plugin/2.5.3-SNAPSHOT/struts2-tiles-plugin-2.5.3-SNAPSHOT-sources.jar
No prior successful build to compare, so performing full copy of artifacts
[JENKINS] Archiving <https://builds.apache.org/job/Struts-JDK9-master/ws/bom/pom.xml> to org.apache.struts/struts2-bom/2.5.3-SNAPSHOT/struts2-bom-2.5.3-SNAPSHOT.pom
No prior successful build to compare, so performing full copy of artifacts
[JENKINS] Archiving <https://builds.apache.org/job/Struts-JDK9-master/ws/plugins/embeddedjsp/pom.xml> to org.apache.struts/struts2-embeddedjsp-plugin/2.5.3-SNAPSHOT/struts2-embeddedjsp-plugin-2.5.3-SNAPSHOT.pom
No prior successful build to compare, so performing full copy of artifacts
[JENKINS] Archiving <https://builds.apache.org/job/Struts-JDK9-master/ws/plugins/pom.xml> to org.apache.struts/struts2-plugins/2.5.3-SNAPSHOT/struts2-plugins-2.5.3-SNAPSHOT.pom
[JENKINS] Archiving <https://builds.apache.org/job/Struts-JDK9-master/ws/plugins/target/struts2-plugins-2.5.3-SNAPSHOT-site.xml> to org.apache.struts/struts2-plugins/2.5.3-SNAPSHOT/struts2-plugins-2.5.3-SNAPSHOT-site.xml
No prior successful build to compare, so performing full copy of artifacts
[JENKINS] Archiving <https://builds.apache.org/job/Struts-JDK9-master/ws/apps/rest-showcase/pom.xml> to org.apache.struts/struts2-rest-showcase/2.5.3-SNAPSHOT/struts2-rest-showcase-2.5.3-SNAPSHOT.pom
No prior successful build to compare, so performing full copy of artifacts
[JENKINS] Archiving <https://builds.apache.org/job/Struts-JDK9-master/ws/plugins/javatemplates/pom.xml> to org.apache.struts/struts2-javatemplates-plugin/2.5.3-SNAPSHOT/struts2-javatemplates-plugin-2.5.3-SNAPSHOT.pom
No prior successful build to compare, so performing full copy of artifacts
[JENKINS] Archiving <https://builds.apache.org/job/Struts-JDK9-master/ws/bundles/admin/pom.xml> to org.apache.struts/struts2-osgi-admin-bundle/2.5.3-SNAPSHOT/struts2-osgi-admin-bundle-2.5.3-SNAPSHOT.pom
No prior successful build to compare, so performing full copy of artifacts
[JENKINS] Archiving <https://builds.apache.org/job/Struts-JDK9-master/ws/apps/pom.xml> to org.apache.struts/struts2-apps/2.5.3-SNAPSHOT/struts2-apps-2.5.3-SNAPSHOT.pom
No prior successful build to compare, so performing full copy of artifacts
[JENKINS] Archiving <https://builds.apache.org/job/Struts-JDK9-master/ws/plugins/sitegraph/pom.xml> to org.apache.struts/struts2-sitegraph-plugin/2.5.3-SNAPSHOT/struts2-sitegraph-plugin-2.5.3-SNAPSHOT.pom
No prior successful build to compare, so performing full copy of artifacts
[JENKINS] Archiving <https://builds.apache.org/job/Struts-JDK9-master/ws/plugins/testng/pom.xml> to org.apache.struts/struts2-testng-plugin/2.5.3-SNAPSHOT/struts2-testng-plugin-2.5.3-SNAPSHOT.pom
No prior successful build to compare, so performing full copy of artifacts
[JENKINS] Archiving <https://builds.apache.org/job/Struts-JDK9-master/ws/plugins/json/pom.xml> to org.apache.struts/struts2-json-plugin/2.5.3-SNAPSHOT/struts2-json-plugin-2.5.3-SNAPSHOT.pom
[JENKINS] Archiving <https://builds.apache.org/job/Struts-JDK9-master/ws/plugins/json/target/struts2-json-plugin-2.5.3-SNAPSHOT.jar> to org.apache.struts/struts2-json-plugin/2.5.3-SNAPSHOT/struts2-json-plugin-2.5.3-SNAPSHOT.jar
[JENKINS] Archiving <https://builds.apache.org/job/Struts-JDK9-master/ws/plugins/json/target/struts2-json-plugin-2.5.3-SNAPSHOT-sources.jar> to org.apache.struts/struts2-json-plugin/2.5.3-SNAPSHOT/struts2-json-plugin-2.5.3-SNAPSHOT-sources.jar
No prior successful build to compare, so performing full copy of artifacts
[JENKINS] Archiving <https://builds.apache.org/job/Struts-JDK9-master/ws/plugins/junit/pom.xml> to org.apache.struts/struts2-junit-plugin/2.5.3-SNAPSHOT/struts2-junit-plugin-2.5.3-SNAPSHOT.pom
[JENKINS] Archiving <https://builds.apache.org/job/Struts-JDK9-master/ws/plugins/junit/target/struts2-junit-plugin-2.5.3-SNAPSHOT.jar> to org.apache.struts/struts2-junit-plugin/2.5.3-SNAPSHOT/struts2-junit-plugin-2.5.3-SNAPSHOT.jar
[JENKINS] Archiving <https://builds.apache.org/job/Struts-JDK9-master/ws/plugins/junit/target/struts2-junit-plugin-2.5.3-SNAPSHOT-sources.jar> to org.apache.struts/struts2-junit-plugin/2.5.3-SNAPSHOT/struts2-junit-plugin-2.5.3-SNAPSHOT-sources.jar
No prior successful build to compare, so performing full copy of artifacts
[JENKINS] Archiving <https://builds.apache.org/job/Struts-JDK9-master/ws/plugins/dwr/pom.xml> to org.apache.struts/struts2-dwr-plugin/2.5.3-SNAPSHOT/struts2-dwr-plugin-2.5.3-SNAPSHOT.pom
[JENKINS] Archiving <https://builds.apache.org/job/Struts-JDK9-master/ws/plugins/dwr/target/struts2-dwr-plugin-2.5.3-SNAPSHOT.jar> to org.apache.struts/struts2-dwr-plugin/2.5.3-SNAPSHOT/struts2-dwr-plugin-2.5.3-SNAPSHOT.jar
[JENKINS] Archiving <https://builds.apache.org/job/Struts-JDK9-master/ws/plugins/dwr/target/struts2-dwr-plugin-2.5.3-SNAPSHOT-sources.jar> to org.apache.struts/struts2-dwr-plugin/2.5.3-SNAPSHOT/struts2-dwr-plugin-2.5.3-SNAPSHOT-sources.jar
No prior successful build to compare, so performing full copy of artifacts
[JENKINS] Archiving <https://builds.apache.org/job/Struts-JDK9-master/ws/plugins/bean-validation/pom.xml> to org.apache.struts/struts2-bean-validation-plugin/2.5.3-SNAPSHOT/struts2-bean-validation-plugin-2.5.3-SNAPSHOT.pom
[JENKINS] Archiving <https://builds.apache.org/job/Struts-JDK9-master/ws/plugins/bean-validation/target/struts2-bean-validation-plugin-2.5.3-SNAPSHOT.jar> to org.apache.struts/struts2-bean-validation-plugin/2.5.3-SNAPSHOT/struts2-bean-validation-plugin-2.5.3-SNAPSHOT.jar
[JENKINS] Archiving <https://builds.apache.org/job/Struts-JDK9-master/ws/plugins/bean-validation/target/struts2-bean-validation-plugin-2.5.3-SNAPSHOT-sources.jar> to org.apache.struts/struts2-bean-validation-plugin/2.5.3-SNAPSHOT/struts2-bean-validation-plugin-2.5.3-SNAPSHOT-sources.jar
No prior successful build to compare, so performing full copy of artifacts
[JENKINS] Archiving <https://builds.apache.org/job/Struts-JDK9-master/ws/plugins/portlet/pom.xml> to org.apache.struts/struts2-portlet-plugin/2.5.3-SNAPSHOT/struts2-portlet-plugin-2.5.3-SNAPSHOT.pom
No prior successful build to compare, so performing full copy of artifacts
[JENKINS] Archiving <https://builds.apache.org/job/Struts-JDK9-master/ws/plugins/spring/pom.xml> to org.apache.struts/struts2-spring-plugin/2.5.3-SNAPSHOT/struts2-spring-plugin-2.5.3-SNAPSHOT.pom
[JENKINS] Archiving <https://builds.apache.org/job/Struts-JDK9-master/ws/plugins/spring/target/struts2-spring-plugin-2.5.3-SNAPSHOT.jar> to org.apache.struts/struts2-spring-plugin/2.5.3-SNAPSHOT/struts2-spring-plugin-2.5.3-SNAPSHOT.jar
[JENKINS] Archiving <https://builds.apache.org/job/Struts-JDK9-master/ws/plugins/spring/target/struts2-spring-plugin-2.5.3-SNAPSHOT-sources.jar> to org.apache.struts/struts2-spring-plugin/2.5.3-SNAPSHOT/struts2-spring-plugin-2.5.3-SNAPSHOT-sources.jar
No prior successful build to compare, so performing full copy of artifacts
[locks-and-latches] Releasing all the locks
[locks-and-latches] All the locks released
channel stopped

---------------------------------------------------------------------
To unsubscribe, e-mail: [hidden email]
For additional commands, e-mail: [hidden email]

Reply | Threaded
Open this post in threaded view
|

Jenkins build is unstable: Struts-JDK9-master #7

Apache Jenkins Server-2
See <https://builds.apache.org/job/Struts-JDK9-master/7/changes>


---------------------------------------------------------------------
To unsubscribe, e-mail: [hidden email]
For additional commands, e-mail: [hidden email]

Reply | Threaded
Open this post in threaded view
|

Jenkins build is still unstable: Struts-JDK9-master #8

Apache Jenkins Server-2
See <https://builds.apache.org/job/Struts-JDK9-master/changes>


---------------------------------------------------------------------
To unsubscribe, e-mail: [hidden email]
For additional commands, e-mail: [hidden email]

Reply | Threaded
Open this post in threaded view
|

Jenkins build is still unstable: Struts-JDK9-master #9

Apache Jenkins Server-2
See <https://builds.apache.org/job/Struts-JDK9-master/changes>


---------------------------------------------------------------------
To unsubscribe, e-mail: [hidden email]
For additional commands, e-mail: [hidden email]

Reply | Threaded
Open this post in threaded view
|

Jenkins build is still unstable: Struts-JDK9-master #10

Apache Jenkins Server-2
See <https://builds.apache.org/job/Struts-JDK9-master/changes>


---------------------------------------------------------------------
To unsubscribe, e-mail: [hidden email]
For additional commands, e-mail: [hidden email]

Reply | Threaded
Open this post in threaded view
|

Jenkins build is still unstable: Struts-JDK9-master #11

Apache Jenkins Server-2
See <https://builds.apache.org/job/Struts-JDK9-master/changes>


---------------------------------------------------------------------
To unsubscribe, e-mail: [hidden email]
For additional commands, e-mail: [hidden email]

Reply | Threaded
Open this post in threaded view
|

Jenkins build is still unstable: Struts-JDK9-master #12

Apache Jenkins Server-2
See <https://builds.apache.org/job/Struts-JDK9-master/changes>


---------------------------------------------------------------------
To unsubscribe, e-mail: [hidden email]
For additional commands, e-mail: [hidden email]

Reply | Threaded
Open this post in threaded view
|

Jenkins build is still unstable: Struts-JDK9-master #13

Apache Jenkins Server-2
See <https://builds.apache.org/job/Struts-JDK9-master/changes>


---------------------------------------------------------------------
To unsubscribe, e-mail: [hidden email]
For additional commands, e-mail: [hidden email]

Reply | Threaded
Open this post in threaded view
|

Jenkins build is still unstable: Struts-JDK9-master #14

Apache Jenkins Server-2
See <https://builds.apache.org/job/Struts-JDK9-master/changes>


---------------------------------------------------------------------
To unsubscribe, e-mail: [hidden email]
For additional commands, e-mail: [hidden email]

Reply | Threaded
Open this post in threaded view
|

Jenkins build is still unstable: Struts-JDK9-master #15

Apache Jenkins Server-2
See <https://builds.apache.org/job/Struts-JDK9-master/changes>


---------------------------------------------------------------------
To unsubscribe, e-mail: [hidden email]
For additional commands, e-mail: [hidden email]

Reply | Threaded
Open this post in threaded view
|

Jenkins build is still unstable: Struts-JDK9-master #16

Apache Jenkins Server-2
See <https://builds.apache.org/job/Struts-JDK9-master/changes>


---------------------------------------------------------------------
To unsubscribe, e-mail: [hidden email]
For additional commands, e-mail: [hidden email]

Reply | Threaded
Open this post in threaded view
|

Jenkins build is still unstable: Struts-JDK9-master #17

Apache Jenkins Server-2
See <https://builds.apache.org/job/Struts-JDK9-master/changes>


---------------------------------------------------------------------
To unsubscribe, e-mail: [hidden email]
For additional commands, e-mail: [hidden email]

Reply | Threaded
Open this post in threaded view
|

Jenkins build is still unstable: Struts-JDK9-master #18

Apache Jenkins Server-2
See <https://builds.apache.org/job/Struts-JDK9-master/changes>


---------------------------------------------------------------------
To unsubscribe, e-mail: [hidden email]
For additional commands, e-mail: [hidden email]

Reply | Threaded
Open this post in threaded view
|

Jenkins build is still unstable: Struts-JDK9-master #19

Apache Jenkins Server-2
See <https://builds.apache.org/job/Struts-JDK9-master/changes>


---------------------------------------------------------------------
To unsubscribe, e-mail: [hidden email]
For additional commands, e-mail: [hidden email]

Reply | Threaded
Open this post in threaded view
|

Jenkins build is still unstable: Struts-JDK9-master #20

Apache Jenkins Server-2
See <https://builds.apache.org/job/Struts-JDK9-master/changes>


---------------------------------------------------------------------
To unsubscribe, e-mail: [hidden email]
For additional commands, e-mail: [hidden email]

12345