Quantcast

Build failed in Jenkins: Struts-JDK7-pull-request #284

classic Classic list List threaded Threaded
2 messages Options
Reply | Threaded
Open this post in threaded view
|  
Report Content as Inappropriate

Build failed in Jenkins: Struts-JDK7-pull-request #284

Apache Jenkins Server-2
See <https://builds.apache.org/job/Struts-JDK7-pull-request/284/display/redirect?page=changes>

Changes:

[Lukasz Lenart] WW-4749 Implements buffered write

[Lukasz Lenart] Moves documentation to wiki

[Lukasz Lenart] WW-4749 Defines setter to allow specify useBufferedWriter

[Lukasz Lenart] WW-4749 Drops writeIfCompleted and uses Boolean instead String

[Lukasz Lenart] WW-4749 Uses ordinary boolean instead of Boolean

------------------------------------------
[...truncated 1.46 KB...]
 > git rev-parse refs/tags/changes/284^{commit} # timeout=10
 > git merge bbcd9dc2514b286065a16657d58418aa9ef4be75 # timeout=10
 > git rev-parse master^{commit} # timeout=10
Checking out Revision f32fd58543f18440e4c0491c74da42b3e2ceb8c9 (master)
 > git config core.sparsecheckout # timeout=10
 > git checkout -f f32fd58543f18440e4c0491c74da42b3e2ceb8c9
 > git rev-parse origin/master^{commit} # timeout=10
 > git rev-list bbd4a9e8c567265c0eb376c0f8a3445f4d9a5fdf # timeout=10
[locks-and-latches] Checking to see if we really have the locks
[locks-and-latches] Have all the locks, build can start
Parsing POMs
Modules changed, recalculating dependency graph
Established TCP socket on 37128
maven33-agent.jar already up to date
maven33-interceptor.jar already up to date
maven3-interceptor-commons.jar already up to date
[Struts-JDK7-pull-request] $ /home/jenkins/tools/java/latest1.7/bin/java -Xms128m -Xmx768m -XX:MaxPermSize=256m -XX:PermSize=128m -cp /home/jenkins/jenkins-slave/maven33-agent.jar:/home/jenkins/tools/maven/latest3/boot/plexus-classworlds-2.5.2.jar:/home/jenkins/tools/maven/latest3/conf/logging jenkins.maven3.agent.Maven33Main /home/jenkins/tools/maven/latest3/ /home/jenkins/jenkins-slave/slave.jar /home/jenkins/jenkins-slave/maven33-interceptor.jar /home/jenkins/jenkins-slave/maven3-interceptor-commons.jar 37128
<===[JENKINS REMOTING CAPACITY]===>   channel started
Executing Maven:  -B -f <https://builds.apache.org/job/Struts-JDK7-pull-request/ws/pom.xml> -Dmaven.repo.local=/home/jenkins/jenkins-slave/maven-repositories/0 package -DskipAssembly
[INFO] Scanning for projects...
[INFO] ------------------------------------------------------------------------
[INFO] Reactor Build Order:
[INFO]
[INFO] Struts 2 Bill of Materials
[INFO] Struts 2
[INFO] Struts 2 Core
[INFO] Struts Plugins
[INFO] Struts 2 Configuration Browser Plugin
[INFO] Struts 2 Sitemesh Plugin
[INFO] Struts 2 Tiles Plugin
[INFO] Struts 2 DWR Plugin
[INFO] Struts 2 Spring Plugin
[INFO] Struts 2 Convention Plugin
[INFO] Struts 2 JUnit Plugin
[INFO] Struts 2 JSON Plugin
[INFO] Struts 2 Bean Validation Plugin
[INFO] Struts 2 Webapps
[INFO] Struts 2 Showcase Webapp
[INFO] Struts 2 REST Plugin
[INFO] Struts 2 Rest Showcase Webapp
[INFO] Struts 2 CDI Plugin
[INFO] Struts 2 Embedded JSP Plugin
[INFO] Struts 2 GXP Plugin
[INFO] Struts 2 Jasper Reports Plugin
[INFO] Struts 2 Java Templates Plugin
[INFO] Struts 2 JFreeChart Plugin
[INFO] Struts 2 OSGi Plugin
[INFO] Struts 2 OVal Plugin
[INFO] Struts 2 Pell Multipart Plugin
[INFO] Struts 2 Plexus Plugin
[INFO] Struts 2 Portlet Plugin
[INFO] Struts 2 Portlet Tiles Plugin
[INFO] DEPRECATED: Struts 2 Sitegraph Plugin
[INFO] Struts 2 TestNG Plugin
[INFO] Struts OSGi Bundles
[INFO] Struts 2 OSGi Admin Bundle
[INFO] Struts 2 OSGi Demo Bundle
[INFO]                                                                        
[INFO] ------------------------------------------------------------------------
[INFO] Building Struts 2 Bill of Materials 2.5.11-SNAPSHOT
[INFO] ------------------------------------------------------------------------
[INFO]
[INFO] --- maven-remote-resources-plugin:1.2.1:process (default) @ struts2-bom ---
[INFO]
[INFO] --- maven-site-plugin:3.0:attach-descriptor (attach-descriptor) @ struts2-bom ---
[INFO]                                                                        
[INFO] ------------------------------------------------------------------------
[INFO] Building Struts 2 2.5.11-SNAPSHOT
[INFO] ------------------------------------------------------------------------
[INFO]
[INFO] --- maven-remote-resources-plugin:1.5:process (default) @ struts2-parent ---
[INFO]
[INFO] --- maven-bundle-plugin:2.1.0:manifest (bundle-manifest) @ struts2-parent ---
[WARNING] Ignoring project type pom - supportedProjectTypes = [jar, bundle]
[INFO]
[INFO] >>> maven-source-plugin:2.3:jar (attach-sources) > generate-sources @ struts2-parent >>>
[WARNING] Failed to getClass for org.apache.maven.plugin.source.SourceJarMojo
[INFO]
[INFO] <<< maven-source-plugin:2.3:jar (attach-sources) < generate-sources @ struts2-parent <<<
[INFO]
[INFO] --- maven-source-plugin:2.3:jar (attach-sources) @ struts2-parent ---
[INFO]
[INFO] --- maven-site-plugin:3.4:attach-descriptor (attach-descriptor) @ struts2-parent ---
[INFO]                                                                        
[INFO] ------------------------------------------------------------------------
[INFO] Building Struts 2 Core 2.5.11-SNAPSHOT
[INFO] ------------------------------------------------------------------------
[INFO]
[INFO] --- maven-remote-resources-plugin:1.5:process (default) @ struts2-core ---
[INFO]
[INFO] --- maven-resources-plugin:2.6:resources (default-resources) @ struts2-core ---
[INFO] Using 'UTF-8' encoding to copy filtered resources.
[INFO] Copying 198 resources
[INFO] Copying 3 resources
[INFO]
[INFO] --- maven-compiler-plugin:3.1:compile (default-compile) @ struts2-core ---
[INFO] Changes detected - recompiling the module!
[INFO] Compiling 757 source files to <https://builds.apache.org/job/Struts-JDK7-pull-request/ws/core/target/classes>
[WARNING] <https://builds.apache.org/job/Struts-JDK7-pull-request/ws/core/src/main/java/com/opensymphony/xwork2/util/logging/jdk/JdkLoggerFactory.java>: Some input files use or override a deprecated API.
[WARNING] <https://builds.apache.org/job/Struts-JDK7-pull-request/ws/core/src/main/java/com/opensymphony/xwork2/util/logging/jdk/JdkLoggerFactory.java>: Recompile with -Xlint:deprecation for details.
[WARNING] <https://builds.apache.org/job/Struts-JDK7-pull-request/ws/core/src/main/java/com/opensymphony/xwork2/ognl/accessor/XWorkCollectionPropertyAccessor.java>: Some input files use unchecked or unsafe operations.
[WARNING] <https://builds.apache.org/job/Struts-JDK7-pull-request/ws/core/src/main/java/com/opensymphony/xwork2/ognl/accessor/XWorkCollectionPropertyAccessor.java>: Recompile with -Xlint:unchecked for details.
[INFO]
[INFO] --- jshint-maven-plugin:1.6.0:lint (default) @ struts2-core ---
[INFO] using jshint version 2.5.6
[INFO] Using configuration file: <https://builds.apache.org/job/Struts-JDK7-pull-request/ws/core/src/main/resources/jshint.conf.js>
[WARNING] Excluding <https://builds.apache.org/job/Struts-JDK7-pull-request/ws/core/src/main/resources/org/apache/struts2/static/domTT.js>
[INFO]   <https://builds.apache.org/job/Struts-JDK7-pull-request/ws/core/src/main/resources/template/xhtml/validation.js>
[INFO]   <https://builds.apache.org/job/Struts-JDK7-pull-request/ws/core/src/main/resources/template/css_xhtml/validation.js>
[INFO]   <https://builds.apache.org/job/Struts-JDK7-pull-request/ws/core/src/main/resources/jshint.conf.js>
[INFO]   <https://builds.apache.org/job/Struts-JDK7-pull-request/ws/core/src/main/resources/org/apache/struts2/static/utils.js>
[INFO]   <https://builds.apache.org/job/Struts-JDK7-pull-request/ws/core/src/main/resources/org/apache/struts2/static/optiontransferselect.js>
[INFO]   <https://builds.apache.org/job/Struts-JDK7-pull-request/ws/core/src/main/resources/org/apache/struts2/static/inputtransferselect.js>
[INFO]   <https://builds.apache.org/job/Struts-JDK7-pull-request/ws/core/src/main/resources/org/apache/struts2/interceptor/debugging/webconsole.js>
[INFO]
[INFO] --- maven-compiler-plugin:3.1:compile (default) @ struts2-core ---
[INFO] Changes detected - recompiling the module!
[INFO] Compiling 757 source files to <https://builds.apache.org/job/Struts-JDK7-pull-request/ws/core/target/classes>
[WARNING] <https://builds.apache.org/job/Struts-JDK7-pull-request/ws/core/src/main/java/com/opensymphony/xwork2/util/logging/jdk/JdkLoggerFactory.java>: Some input files use or override a deprecated API.
[WARNING] <https://builds.apache.org/job/Struts-JDK7-pull-request/ws/core/src/main/java/com/opensymphony/xwork2/util/logging/jdk/JdkLoggerFactory.java>: Recompile with -Xlint:deprecation for details.
[WARNING] <https://builds.apache.org/job/Struts-JDK7-pull-request/ws/core/src/main/java/com/opensymphony/xwork2/ognl/accessor/XWorkCollectionPropertyAccessor.java>: Some input files use unchecked or unsafe operations.
[WARNING] <https://builds.apache.org/job/Struts-JDK7-pull-request/ws/core/src/main/java/com/opensymphony/xwork2/ognl/accessor/XWorkCollectionPropertyAccessor.java>: Recompile with -Xlint:unchecked for details.
[INFO]
[INFO] --- maven-bundle-plugin:2.1.0:manifest (bundle-manifest) @ struts2-core ---
[WARNING] Warning in manifest for org.apache.struts:struts2-core:jar:2.5.11-SNAPSHOT : Superfluous export-package instructions: [com, template.archive, org.apache, template, com.opensymphony, org.apache.struts2.util.tomcat, org]
[INFO]
[INFO] --- maven-resources-plugin:2.6:testResources (default-testResources) @ struts2-core ---
[INFO] Using 'UTF-8' encoding to copy filtered resources.
[INFO] Copying 337 resources
[INFO] Copying 3 resources
[INFO]
[INFO] --- maven-compiler-plugin:3.1:testCompile (default-testCompile) @ struts2-core ---
[INFO] Changes detected - recompiling the module!
[INFO] Compiling 399 source files to <https://builds.apache.org/job/Struts-JDK7-pull-request/ws/core/target/test-classes>
[INFO] -------------------------------------------------------------
[WARNING] COMPILATION WARNING :
[INFO] -------------------------------------------------------------
[WARNING] <https://builds.apache.org/job/Struts-JDK7-pull-request/ws/core/src/test/java/org/apache/struts2/StrutsInternalTestCase.java>: Some input files use or override a deprecated API.
[WARNING] <https://builds.apache.org/job/Struts-JDK7-pull-request/ws/core/src/test/java/org/apache/struts2/StrutsInternalTestCase.java>: Recompile with -Xlint:deprecation for details.
[WARNING] <https://builds.apache.org/job/Struts-JDK7-pull-request/ws/core/src/test/java/org/apache/struts2/interceptor/ClearSessionInterceptorTest.java>: Some input files use unchecked or unsafe operations.
[WARNING] <https://builds.apache.org/job/Struts-JDK7-pull-request/ws/core/src/test/java/org/apache/struts2/interceptor/ClearSessionInterceptorTest.java>: Recompile with -Xlint:unchecked for details.
[INFO] 4 warnings
[INFO] -------------------------------------------------------------
[INFO] -------------------------------------------------------------
[ERROR] COMPILATION ERROR :
[INFO] -------------------------------------------------------------
[ERROR] <https://builds.apache.org/job/Struts-JDK7-pull-request/ws/core/src/test/java/org/apache/struts2/views/freemarker/FreeMarkerResultTest.java>:[73,15] cannot find symbol
  symbol:   method setWriteIfCompleted(boolean)
  location: variable result of type org.apache.struts2.views.freemarker.FreemarkerResult
[INFO] 1 error
[INFO] -------------------------------------------------------------
[INFO] ------------------------------------------------------------------------
[INFO] Reactor Summary:
[INFO]
[INFO] Struts 2 Bill of Materials ......................... SUCCESS [  2.674 s]
[INFO] Struts 2 ........................................... SUCCESS [  2.443 s]
[INFO] Struts 2 Core ...................................... FAILURE [ 24.658 s]
[INFO] Struts Plugins ..................................... SKIPPED
[INFO] Struts 2 Configuration Browser Plugin .............. SKIPPED
[INFO] Struts 2 Sitemesh Plugin ........................... SKIPPED
[INFO] Struts 2 Tiles Plugin .............................. SKIPPED
[INFO] Struts 2 DWR Plugin ................................ SKIPPED
[INFO] Struts 2 Spring Plugin ............................. SKIPPED
[INFO] Struts 2 Convention Plugin ......................... SKIPPED
[INFO] Struts 2 JUnit Plugin .............................. SKIPPED
[INFO] Struts 2 JSON Plugin ............................... SKIPPED
[INFO] Struts 2 Bean Validation Plugin .................... SKIPPED
[INFO] Struts 2 Webapps ................................... SKIPPED
[INFO] Struts 2 Showcase Webapp ........................... SKIPPED
[INFO] Struts 2 REST Plugin ............................... SKIPPED
[INFO] Struts 2 Rest Showcase Webapp ...................... SKIPPED
[INFO] Struts 2 CDI Plugin ................................ SKIPPED
[INFO] Struts 2 Embedded JSP Plugin ....................... SKIPPED
[INFO] Struts 2 GXP Plugin ................................ SKIPPED
[INFO] Struts 2 Jasper Reports Plugin ..................... SKIPPED
[INFO] Struts 2 Java Templates Plugin ..................... SKIPPED
[INFO] Struts 2 JFreeChart Plugin ......................... SKIPPED
[INFO] Struts 2 OSGi Plugin ............................... SKIPPED
[INFO] Struts 2 OVal Plugin ............................... SKIPPED
[INFO] Struts 2 Pell Multipart Plugin ..................... SKIPPED
[INFO] Struts 2 Plexus Plugin ............................. SKIPPED
[INFO] Struts 2 Portlet Plugin ............................ SKIPPED
[INFO] Struts 2 Portlet Tiles Plugin ...................... SKIPPED
[INFO] DEPRECATED: Struts 2 Sitegraph Plugin .............. SKIPPED
[INFO] Struts 2 TestNG Plugin ............................. SKIPPED
[INFO] Struts OSGi Bundles ................................ SKIPPED
[INFO] Struts 2 OSGi Admin Bundle ......................... SKIPPED
[INFO] Struts 2 OSGi Demo Bundle .......................... SKIPPED
[INFO] ------------------------------------------------------------------------
[INFO] BUILD FAILURE
[INFO] ------------------------------------------------------------------------
[INFO] Total time: 39.734 s
[INFO] Finished at: 2017-04-28T07:36:06+00:00
[INFO] Final Memory: 51M/406M
[INFO] ------------------------------------------------------------------------
[ERROR] Failed to execute goal org.apache.maven.plugins:maven-compiler-plugin:3.1:testCompile (default-testCompile) on project struts2-core: Compilation failure
[ERROR] <https://builds.apache.org/job/Struts-JDK7-pull-request/ws/core/src/test/java/org/apache/struts2/views/freemarker/FreeMarkerResultTest.java>:[73,15] cannot find symbol
[ERROR] symbol:   method setWriteIfCompleted(boolean)
[ERROR] location: variable result of type org.apache.struts2.views.freemarker.FreemarkerResult
[ERROR] -> [Help 1]
[ERROR]
[ERROR] To see the full stack trace of the errors, re-run Maven with the -e switch.
[ERROR] Re-run Maven using the -X switch to enable full debug logging.
[ERROR]
[ERROR] For more information about the errors and possible solutions, please read the following articles:
[ERROR] [Help 1] http://cwiki.apache.org/confluence/display/MAVEN/MojoFailureException
[ERROR]
[ERROR] After correcting the problems, you can resume the build with the command
[ERROR]   mvn <goals> -rf :struts2-core
[JENKINS] Archiving <https://builds.apache.org/job/Struts-JDK7-pull-request/ws/plugins/portlet/pom.xml> to org.apache.struts/struts2-portlet-plugin/2.5.11-SNAPSHOT/struts2-portlet-plugin-2.5.11-SNAPSHOT.pom
[JENKINS] Archiving <https://builds.apache.org/job/Struts-JDK7-pull-request/ws/plugins/portlet-tiles/pom.xml> to org.apache.struts/struts2-portlet-tiles-plugin/2.5.11-SNAPSHOT/struts2-portlet-tiles-plugin-2.5.11-SNAPSHOT.pom
[JENKINS] Archiving <https://builds.apache.org/job/Struts-JDK7-pull-request/ws/core/pom.xml> to org.apache.struts/struts2-core/2.5.11-SNAPSHOT/struts2-core-2.5.11-SNAPSHOT.pom
[JENKINS] Archiving <https://builds.apache.org/job/Struts-JDK7-pull-request/ws/plugins/osgi/pom.xml> to org.apache.struts/struts2-osgi-plugin/2.5.11-SNAPSHOT/struts2-osgi-plugin-2.5.11-SNAPSHOT.pom
[JENKINS] Archiving <https://builds.apache.org/job/Struts-JDK7-pull-request/ws/plugins/dwr/pom.xml> to org.apache.struts/struts2-dwr-plugin/2.5.11-SNAPSHOT/struts2-dwr-plugin-2.5.11-SNAPSHOT.pom
[JENKINS] Archiving <https://builds.apache.org/job/Struts-JDK7-pull-request/ws/apps/rest-showcase/pom.xml> to org.apache.struts/struts2-rest-showcase/2.5.11-SNAPSHOT/struts2-rest-showcase-2.5.11-SNAPSHOT.pom
[JENKINS] Archiving <https://builds.apache.org/job/Struts-JDK7-pull-request/ws/plugins/gxp/pom.xml> to org.apache.struts/struts2-gxp-plugin/2.5.11-SNAPSHOT/struts2-gxp-plugin-2.5.11-SNAPSHOT.pom
[JENKINS] Archiving <https://builds.apache.org/job/Struts-JDK7-pull-request/ws/plugins/javatemplates/pom.xml> to org.apache.struts/struts2-javatemplates-plugin/2.5.11-SNAPSHOT/struts2-javatemplates-plugin-2.5.11-SNAPSHOT.pom
[JENKINS] Archiving <https://builds.apache.org/job/Struts-JDK7-pull-request/ws/plugins/testng/pom.xml> to org.apache.struts/struts2-testng-plugin/2.5.11-SNAPSHOT/struts2-testng-plugin-2.5.11-SNAPSHOT.pom
[JENKINS] Archiving <https://builds.apache.org/job/Struts-JDK7-pull-request/ws/apps/pom.xml> to org.apache.struts/struts2-apps/2.5.11-SNAPSHOT/struts2-apps-2.5.11-SNAPSHOT.pom
[JENKINS] Archiving <https://builds.apache.org/job/Struts-JDK7-pull-request/ws/bom/pom.xml> to org.apache.struts/struts2-bom/2.5.11-SNAPSHOT/struts2-bom-2.5.11-SNAPSHOT.pom
[JENKINS] Archiving <https://builds.apache.org/job/Struts-JDK7-pull-request/ws/plugins/oval/pom.xml> to org.apache.struts/struts2-oval-plugin/2.5.11-SNAPSHOT/struts2-oval-plugin-2.5.11-SNAPSHOT.pom
[JENKINS] Archiving <https://builds.apache.org/job/Struts-JDK7-pull-request/ws/plugins/convention/pom.xml> to org.apache.struts/struts2-convention-plugin/2.5.11-SNAPSHOT/struts2-convention-plugin-2.5.11-SNAPSHOT.pom
[JENKINS] Archiving <https://builds.apache.org/job/Struts-JDK7-pull-request/ws/pom.xml> to org.apache.struts/struts2-parent/2.5.11-SNAPSHOT/struts2-parent-2.5.11-SNAPSHOT.pom
[JENKINS] Archiving <https://builds.apache.org/job/Struts-JDK7-pull-request/ws/target/struts2-parent-2.5.11-SNAPSHOT-site.xml> to org.apache.struts/struts2-parent/2.5.11-SNAPSHOT/struts2-parent-2.5.11-SNAPSHOT-site.xml
Compressed 39.29 KB of artifacts by 81.4% relative to #283
[JENKINS] Archiving <https://builds.apache.org/job/Struts-JDK7-pull-request/ws/apps/showcase/pom.xml> to org.apache.struts/struts2-showcase/2.5.11-SNAPSHOT/struts2-showcase-2.5.11-SNAPSHOT.pom
[JENKINS] Archiving <https://builds.apache.org/job/Struts-JDK7-pull-request/ws/plugins/jasperreports/pom.xml> to org.apache.struts/struts2-jasperreports-plugin/2.5.11-SNAPSHOT/struts2-jasperreports-plugin-2.5.11-SNAPSHOT.pom
[JENKINS] Archiving <https://builds.apache.org/job/Struts-JDK7-pull-request/ws/plugins/rest/pom.xml> to org.apache.struts/struts2-rest-plugin/2.5.11-SNAPSHOT/struts2-rest-plugin-2.5.11-SNAPSHOT.pom
[JENKINS] Archiving <https://builds.apache.org/job/Struts-JDK7-pull-request/ws/bundles/pom.xml> to org.apache.struts/struts2-osgi-bundles/2.5.11-SNAPSHOT/struts2-osgi-bundles-2.5.11-SNAPSHOT.pom
[JENKINS] Archiving <https://builds.apache.org/job/Struts-JDK7-pull-request/ws/plugins/config-browser/pom.xml> to org.apache.struts/struts2-config-browser-plugin/2.5.11-SNAPSHOT/struts2-config-browser-plugin-2.5.11-SNAPSHOT.pom
[JENKINS] Archiving <https://builds.apache.org/job/Struts-JDK7-pull-request/ws/plugins/pell-multipart/pom.xml> to org.apache.struts/struts2-pell-multipart-plugin/2.5.11-SNAPSHOT/struts2-pell-multipart-plugin-2.5.11-SNAPSHOT.pom
[JENKINS] Archiving <https://builds.apache.org/job/Struts-JDK7-pull-request/ws/bundles/admin/pom.xml> to org.apache.struts/struts2-osgi-admin-bundle/2.5.11-SNAPSHOT/struts2-osgi-admin-bundle-2.5.11-SNAPSHOT.pom
[JENKINS] Archiving <https://builds.apache.org/job/Struts-JDK7-pull-request/ws/plugins/sitemesh/pom.xml> to org.apache.struts/struts2-sitemesh-plugin/2.5.11-SNAPSHOT/struts2-sitemesh-plugin-2.5.11-SNAPSHOT.pom
[JENKINS] Archiving <https://builds.apache.org/job/Struts-JDK7-pull-request/ws/plugins/pom.xml> to org.apache.struts/struts2-plugins/2.5.11-SNAPSHOT/struts2-plugins-2.5.11-SNAPSHOT.pom
[JENKINS] Archiving <https://builds.apache.org/job/Struts-JDK7-pull-request/ws/plugins/bean-validation/pom.xml> to org.apache.struts/struts2-bean-validation-plugin/2.5.11-SNAPSHOT/struts2-bean-validation-plugin-2.5.11-SNAPSHOT.pom
[JENKINS] Archiving <https://builds.apache.org/job/Struts-JDK7-pull-request/ws/plugins/plexus/pom.xml> to org.apache.struts/struts2-plexus-plugin/2.5.11-SNAPSHOT/struts2-plexus-plugin-2.5.11-SNAPSHOT.pom
[JENKINS] Archiving <https://builds.apache.org/job/Struts-JDK7-pull-request/ws/plugins/sitegraph/pom.xml> to org.apache.struts/struts2-sitegraph-plugin/2.5.11-SNAPSHOT/struts2-sitegraph-plugin-2.5.11-SNAPSHOT.pom
[JENKINS] Archiving <https://builds.apache.org/job/Struts-JDK7-pull-request/ws/plugins/cdi/pom.xml> to org.apache.struts/struts2-cdi-plugin/2.5.11-SNAPSHOT/struts2-cdi-plugin-2.5.11-SNAPSHOT.pom
[JENKINS] Archiving <https://builds.apache.org/job/Struts-JDK7-pull-request/ws/plugins/json/pom.xml> to org.apache.struts/struts2-json-plugin/2.5.11-SNAPSHOT/struts2-json-plugin-2.5.11-SNAPSHOT.pom
[JENKINS] Archiving <https://builds.apache.org/job/Struts-JDK7-pull-request/ws/plugins/tiles/pom.xml> to org.apache.struts/struts2-tiles-plugin/2.5.11-SNAPSHOT/struts2-tiles-plugin-2.5.11-SNAPSHOT.pom
[JENKINS] Archiving <https://builds.apache.org/job/Struts-JDK7-pull-request/ws/plugins/spring/pom.xml> to org.apache.struts/struts2-spring-plugin/2.5.11-SNAPSHOT/struts2-spring-plugin-2.5.11-SNAPSHOT.pom
[JENKINS] Archiving <https://builds.apache.org/job/Struts-JDK7-pull-request/ws/plugins/jfreechart/pom.xml> to org.apache.struts/struts2-jfreechart-plugin/2.5.11-SNAPSHOT/struts2-jfreechart-plugin-2.5.11-SNAPSHOT.pom
[JENKINS] Archiving <https://builds.apache.org/job/Struts-JDK7-pull-request/ws/bundles/demo/pom.xml> to org.apache.struts/struts2-osgi-demo-bundle/2.5.11-SNAPSHOT/struts2-osgi-demo-bundle-2.5.11-SNAPSHOT.pom
[JENKINS] Archiving <https://builds.apache.org/job/Struts-JDK7-pull-request/ws/plugins/embeddedjsp/pom.xml> to org.apache.struts/struts2-embeddedjsp-plugin/2.5.11-SNAPSHOT/struts2-embeddedjsp-plugin-2.5.11-SNAPSHOT.pom
[JENKINS] Archiving <https://builds.apache.org/job/Struts-JDK7-pull-request/ws/plugins/junit/pom.xml> to org.apache.struts/struts2-junit-plugin/2.5.11-SNAPSHOT/struts2-junit-plugin-2.5.11-SNAPSHOT.pom
[locks-and-latches] Releasing all the locks
[locks-and-latches] All the locks released
channel stopped
Putting comment on the pull request

---------------------------------------------------------------------
To unsubscribe, e-mail: [hidden email]
For additional commands, e-mail: [hidden email]

Reply | Threaded
Open this post in threaded view
|  
Report Content as Inappropriate

Jenkins build is back to normal : Struts-JDK7-pull-request #285

Apache Jenkins Server-2
See <https://builds.apache.org/job/Struts-JDK7-pull-request/285/display/redirect?page=changes>


---------------------------------------------------------------------
To unsubscribe, e-mail: [hidden email]
For additional commands, e-mail: [hidden email]

Loading...