Build failed in Jenkins: Struts-JDK7-pull-request #249

classic Classic list List threaded Threaded
2 messages Options
Reply | Threaded
Open this post in threaded view
|  
Report Content as Inappropriate

Build failed in Jenkins: Struts-JDK7-pull-request #249

Apache Jenkins Server-2
See <https://builds.apache.org/job/Struts-JDK7-pull-request/249/display/redirect?page=changes>

Changes:

[Lukasz Lenart] Moves documentation to wiki

[Lukasz Lenart] Uses OGNL without #context magical key

[Lukasz Lenart] Adjusts OGNL usage to avoid modify immutable context

------------------------------------------
GitHub pull request #125 to apache/struts
[EnvInject] - Loading node environment variables.
Building remotely on H18 (ubuntu) in workspace <https://builds.apache.org/job/Struts-JDK7-pull-request/ws/>
 > git rev-parse --is-inside-work-tree # timeout=10
Fetching changes from the remote Git repository
 > git config remote.origin.url git://github.com/apache/struts.git # timeout=10
Cleaning workspace
 > git rev-parse --verify HEAD # timeout=10
Resetting working tree
 > git reset --hard # timeout=10
 > git clean -fdx # timeout=10
Pruning obsolete local branches
Fetching upstream changes from git://github.com/apache/struts.git
 > git --version # timeout=10
 > git fetch --tags --progress git://github.com/apache/struts.git +refs/heads/*:refs/remotes/origin/* --prune
 > git config core.sparsecheckout # timeout=10
 > git checkout -f origin/master
 > git branch -a -v --no-abbrev # timeout=10
 > git branch -D master # timeout=10
 > git checkout -b master origin/master
  Opening connection
    Done: 0
  Counting objects
    Done: 30
  Finding sources
    Done: 30
  Getting sizes
    Done: 24
  Compressing objects
    Done: 129422
  Writing objects
    Done: 30
  remote: Resolving deltas
  remote: Updating references
Merging refs/tags/changes/249
 > git rev-parse refs/tags/changes/249^{commit} # timeout=10
 > git merge dc2f122d9e4bb66605e4ea9f8cd2c9683c8c0819 # timeout=10
 > git rev-parse master^{commit} # timeout=10
Checking out Revision dc2f122d9e4bb66605e4ea9f8cd2c9683c8c0819 (master)
 > git config core.sparsecheckout # timeout=10
 > git checkout -f dc2f122d9e4bb66605e4ea9f8cd2c9683c8c0819
 > git rev-parse origin/master^{commit} # timeout=10
 > git rev-list 350c77aba8776bec0c11ebdd6e331cb6028e0972 # timeout=10
[locks-and-latches] Checking to see if we really have the locks
[locks-and-latches] Have all the locks, build can start
Parsing POMs
Modules changed, recalculating dependency graph
Established TCP socket on 34010
maven33-agent.jar already up to date
maven33-interceptor.jar already up to date
maven3-interceptor-commons.jar already up to date
[Struts-JDK7-pull-request] $ /home/jenkins/tools/java/latest1.7/bin/java -Xms128m -Xmx768m -XX:MaxPermSize=256m -XX:PermSize=128m -cp /home/jenkins/jenkins-slave/maven33-agent.jar:/home/jenkins/tools/maven/latest3/boot/plexus-classworlds-2.5.2.jar:/home/jenkins/tools/maven/latest3/conf/logging jenkins.maven3.agent.Maven33Main /home/jenkins/tools/maven/latest3/ /home/jenkins/jenkins-slave/slave.jar /home/jenkins/jenkins-slave/maven33-interceptor.jar /home/jenkins/jenkins-slave/maven3-interceptor-commons.jar 34010
<===[JENKINS REMOTING CAPACITY]===>   channel started
Executing Maven:  -B -f <https://builds.apache.org/job/Struts-JDK7-pull-request/ws/pom.xml> -Dmaven.repo.local=/home/jenkins/jenkins-slave/maven-repositories/0 package -DskipAssembly
[INFO] Scanning for projects...
[INFO] ------------------------------------------------------------------------
[INFO] Reactor Build Order:
[INFO]
[INFO] Struts 2 Bill of Materials
[INFO] Struts 2
[INFO] Struts 2 Core
[INFO] Struts Plugins
[INFO] Struts 2 Configuration Browser Plugin
[INFO] Struts 2 Sitemesh Plugin
[INFO] Struts 2 Tiles Plugin
[INFO] Struts 2 DWR Plugin
[INFO] Struts 2 Spring Plugin
[INFO] Struts 2 Convention Plugin
[INFO] Struts 2 JUnit Plugin
[INFO] Struts 2 JSON Plugin
[INFO] Struts 2 Bean Validation Plugin
[INFO] Struts 2 Webapps
[INFO] Struts 2 Showcase Webapp
[INFO] Struts 2 REST Plugin
[INFO] Struts 2 Rest Showcase Webapp
[INFO] Struts 2 CDI Plugin
[INFO] Struts 2 Embedded JSP Plugin
[INFO] Struts 2 GXP Plugin
[INFO] Struts 2 Jasper Reports Plugin
[INFO] Struts 2 Java Templates Plugin
[INFO] Struts 2 JFreeChart Plugin
[INFO] Struts 2 OSGi Plugin
[INFO] Struts 2 OVal Plugin
[INFO] Struts 2 Pell Multipart Plugin
[INFO] Struts 2 Plexus Plugin
[INFO] Struts 2 Portlet Plugin
[INFO] Struts 2 Portlet Tiles Plugin
[INFO] Struts 2 Sitegraph Plugin
[INFO] Struts 2 TestNG Plugin
[INFO] Struts OSGi Bundles
[INFO] Struts 2 OSGi Admin Bundle
[INFO] Struts 2 OSGi Demo Bundle
[INFO]                                                                        
[INFO] ------------------------------------------------------------------------
[INFO] Building Struts 2 Bill of Materials 2.5.11-SNAPSHOT
[INFO] ------------------------------------------------------------------------
[INFO]
[INFO] --- maven-remote-resources-plugin:1.2.1:process (default) @ struts2-bom ---
[INFO]
[INFO] --- maven-site-plugin:3.0:attach-descriptor (attach-descriptor) @ struts2-bom ---
[INFO]                                                                        
[INFO] ------------------------------------------------------------------------
[INFO] Building Struts 2 2.5.11-SNAPSHOT
[INFO] ------------------------------------------------------------------------
[INFO]
[INFO] --- maven-remote-resources-plugin:1.5:process (default) @ struts2-parent ---
[INFO]
[INFO] --- maven-bundle-plugin:2.1.0:manifest (bundle-manifest) @ struts2-parent ---
[WARNING] Ignoring project type pom - supportedProjectTypes = [jar, bundle]
[INFO]
[INFO] >>> maven-source-plugin:2.3:jar (attach-sources) > generate-sources @ struts2-parent >>>
[WARNING] Failed to getClass for org.apache.maven.plugin.source.SourceJarMojo
[INFO]
[INFO] <<< maven-source-plugin:2.3:jar (attach-sources) < generate-sources @ struts2-parent <<<
[INFO]
[INFO] --- maven-source-plugin:2.3:jar (attach-sources) @ struts2-parent ---
[INFO]
[INFO] --- maven-site-plugin:3.4:attach-descriptor (attach-descriptor) @ struts2-parent ---
[INFO]                                                                        
[INFO] ------------------------------------------------------------------------
[INFO] Building Struts 2 Core 2.5.11-SNAPSHOT
[INFO] ------------------------------------------------------------------------
[INFO] Downloading: http://repository.apache.org/snapshots/ognl/ognl/3.2.1-SNAPSHOT/maven-metadata.xml
[INFO] Downloading: http://repository.apache.org/snapshots/ognl/ognl/3.2.1-SNAPSHOT/ognl-3.2.1-SNAPSHOT.pom
[WARNING] The POM for ognl:ognl:jar:3.2.1-SNAPSHOT is missing, no dependency information available
[INFO] Downloading: http://repository.apache.org/snapshots/ognl/ognl/3.2.1-SNAPSHOT/ognl-3.2.1-SNAPSHOT.jar
[INFO] ------------------------------------------------------------------------
[INFO] Reactor Summary:
[INFO]
[INFO] Struts 2 Bill of Materials ......................... SUCCESS [  3.643 s]
[INFO] Struts 2 ........................................... SUCCESS [  2.987 s]
[INFO] Struts 2 Core ...................................... FAILURE [  5.029 s]
[INFO] Struts Plugins ..................................... SKIPPED
[INFO] Struts 2 Configuration Browser Plugin .............. SKIPPED
[INFO] Struts 2 Sitemesh Plugin ........................... SKIPPED
[INFO] Struts 2 Tiles Plugin .............................. SKIPPED
[INFO] Struts 2 DWR Plugin ................................ SKIPPED
[INFO] Struts 2 Spring Plugin ............................. SKIPPED
[INFO] Struts 2 Convention Plugin ......................... SKIPPED
[INFO] Struts 2 JUnit Plugin .............................. SKIPPED
[INFO] Struts 2 JSON Plugin ............................... SKIPPED
[INFO] Struts 2 Bean Validation Plugin .................... SKIPPED
[INFO] Struts 2 Webapps ................................... SKIPPED
[INFO] Struts 2 Showcase Webapp ........................... SKIPPED
[INFO] Struts 2 REST Plugin ............................... SKIPPED
[INFO] Struts 2 Rest Showcase Webapp ...................... SKIPPED
[INFO] Struts 2 CDI Plugin ................................ SKIPPED
[INFO] Struts 2 Embedded JSP Plugin ....................... SKIPPED
[INFO] Struts 2 GXP Plugin ................................ SKIPPED
[INFO] Struts 2 Jasper Reports Plugin ..................... SKIPPED
[INFO] Struts 2 Java Templates Plugin ..................... SKIPPED
[INFO] Struts 2 JFreeChart Plugin ......................... SKIPPED
[INFO] Struts 2 OSGi Plugin ............................... SKIPPED
[INFO] Struts 2 OVal Plugin ............................... SKIPPED
[INFO] Struts 2 Pell Multipart Plugin ..................... SKIPPED
[INFO] Struts 2 Plexus Plugin ............................. SKIPPED
[INFO] Struts 2 Portlet Plugin ............................ SKIPPED
[INFO] Struts 2 Portlet Tiles Plugin ...................... SKIPPED
[INFO] Struts 2 Sitegraph Plugin .......................... SKIPPED
[INFO] Struts 2 TestNG Plugin ............................. SKIPPED
[INFO] Struts OSGi Bundles ................................ SKIPPED
[INFO] Struts 2 OSGi Admin Bundle ......................... SKIPPED
[INFO] Struts 2 OSGi Demo Bundle .......................... SKIPPED
[INFO] ------------------------------------------------------------------------
[INFO] BUILD FAILURE
[INFO] ------------------------------------------------------------------------
[INFO] Total time: 44.168 s
[INFO] Finished at: 2017-03-24T10:27:04+00:00
[INFO] Final Memory: 42M/310M
[INFO] ------------------------------------------------------------------------
Waiting for Jenkins to finish collecting data
[ERROR] Failed to execute goal on project struts2-core: Could not resolve dependencies for project org.apache.struts:struts2-core:jar:2.5.11-SNAPSHOT: Could not find artifact ognl:ognl:jar:3.2.1-SNAPSHOT in Nexus (http://repository.apache.org/snapshots) -> [Help 1]
[ERROR]
[ERROR] To see the full stack trace of the errors, re-run Maven with the -e switch.
[ERROR] Re-run Maven using the -X switch to enable full debug logging.
[ERROR]
[ERROR] For more information about the errors and possible solutions, please read the following articles:
[ERROR] [Help 1] http://cwiki.apache.org/confluence/display/MAVEN/DependencyResolutionException
[ERROR]
[ERROR] After correcting the problems, you can resume the build with the command
[ERROR]   mvn <goals> -rf :struts2-core
[JENKINS] Archiving <https://builds.apache.org/job/Struts-JDK7-pull-request/ws/plugins/portlet/pom.xml> to org.apache.struts/struts2-portlet-plugin/2.5.11-SNAPSHOT/struts2-portlet-plugin-2.5.11-SNAPSHOT.pom
[JENKINS] Archiving <https://builds.apache.org/job/Struts-JDK7-pull-request/ws/plugins/portlet-tiles/pom.xml> to org.apache.struts/struts2-portlet-tiles-plugin/2.5.11-SNAPSHOT/struts2-portlet-tiles-plugin-2.5.11-SNAPSHOT.pom
[JENKINS] Archiving <https://builds.apache.org/job/Struts-JDK7-pull-request/ws/core/pom.xml> to org.apache.struts/struts2-core/2.5.11-SNAPSHOT/struts2-core-2.5.11-SNAPSHOT.pom
[JENKINS] Archiving <https://builds.apache.org/job/Struts-JDK7-pull-request/ws/plugins/osgi/pom.xml> to org.apache.struts/struts2-osgi-plugin/2.5.11-SNAPSHOT/struts2-osgi-plugin-2.5.11-SNAPSHOT.pom
[JENKINS] Archiving <https://builds.apache.org/job/Struts-JDK7-pull-request/ws/plugins/dwr/pom.xml> to org.apache.struts/struts2-dwr-plugin/2.5.11-SNAPSHOT/struts2-dwr-plugin-2.5.11-SNAPSHOT.pom
[JENKINS] Archiving <https://builds.apache.org/job/Struts-JDK7-pull-request/ws/apps/rest-showcase/pom.xml> to org.apache.struts/struts2-rest-showcase/2.5.11-SNAPSHOT/struts2-rest-showcase-2.5.11-SNAPSHOT.pom
[JENKINS] Archiving <https://builds.apache.org/job/Struts-JDK7-pull-request/ws/plugins/gxp/pom.xml> to org.apache.struts/struts2-gxp-plugin/2.5.11-SNAPSHOT/struts2-gxp-plugin-2.5.11-SNAPSHOT.pom
[JENKINS] Archiving <https://builds.apache.org/job/Struts-JDK7-pull-request/ws/plugins/javatemplates/pom.xml> to org.apache.struts/struts2-javatemplates-plugin/2.5.11-SNAPSHOT/struts2-javatemplates-plugin-2.5.11-SNAPSHOT.pom
[JENKINS] Archiving <https://builds.apache.org/job/Struts-JDK7-pull-request/ws/plugins/testng/pom.xml> to org.apache.struts/struts2-testng-plugin/2.5.11-SNAPSHOT/struts2-testng-plugin-2.5.11-SNAPSHOT.pom
[JENKINS] Archiving <https://builds.apache.org/job/Struts-JDK7-pull-request/ws/apps/pom.xml> to org.apache.struts/struts2-apps/2.5.11-SNAPSHOT/struts2-apps-2.5.11-SNAPSHOT.pom
[JENKINS] Archiving <https://builds.apache.org/job/Struts-JDK7-pull-request/ws/bom/pom.xml> to org.apache.struts/struts2-bom/2.5.11-SNAPSHOT/struts2-bom-2.5.11-SNAPSHOT.pom
[JENKINS] Archiving <https://builds.apache.org/job/Struts-JDK7-pull-request/ws/plugins/oval/pom.xml> to org.apache.struts/struts2-oval-plugin/2.5.11-SNAPSHOT/struts2-oval-plugin-2.5.11-SNAPSHOT.pom
[JENKINS] Archiving <https://builds.apache.org/job/Struts-JDK7-pull-request/ws/plugins/convention/pom.xml> to org.apache.struts/struts2-convention-plugin/2.5.11-SNAPSHOT/struts2-convention-plugin-2.5.11-SNAPSHOT.pom
[JENKINS] Archiving <https://builds.apache.org/job/Struts-JDK7-pull-request/ws/pom.xml> to org.apache.struts/struts2-parent/2.5.11-SNAPSHOT/struts2-parent-2.5.11-SNAPSHOT.pom
[JENKINS] Archiving <https://builds.apache.org/job/Struts-JDK7-pull-request/ws/target/struts2-parent-2.5.11-SNAPSHOT-site.xml> to org.apache.struts/struts2-parent/2.5.11-SNAPSHOT/struts2-parent-2.5.11-SNAPSHOT-site.xml
[JENKINS] Archiving <https://builds.apache.org/job/Struts-JDK7-pull-request/ws/apps/showcase/pom.xml> to org.apache.struts/struts2-showcase/2.5.11-SNAPSHOT/struts2-showcase-2.5.11-SNAPSHOT.pom
[JENKINS] Archiving <https://builds.apache.org/job/Struts-JDK7-pull-request/ws/plugins/jasperreports/pom.xml> to org.apache.struts/struts2-jasperreports-plugin/2.5.11-SNAPSHOT/struts2-jasperreports-plugin-2.5.11-SNAPSHOT.pom
[JENKINS] Archiving <https://builds.apache.org/job/Struts-JDK7-pull-request/ws/plugins/rest/pom.xml> to org.apache.struts/struts2-rest-plugin/2.5.11-SNAPSHOT/struts2-rest-plugin-2.5.11-SNAPSHOT.pom
[JENKINS] Archiving <https://builds.apache.org/job/Struts-JDK7-pull-request/ws/bundles/pom.xml> to org.apache.struts/struts2-osgi-bundles/2.5.11-SNAPSHOT/struts2-osgi-bundles-2.5.11-SNAPSHOT.pom
[JENKINS] Archiving <https://builds.apache.org/job/Struts-JDK7-pull-request/ws/plugins/config-browser/pom.xml> to org.apache.struts/struts2-config-browser-plugin/2.5.11-SNAPSHOT/struts2-config-browser-plugin-2.5.11-SNAPSHOT.pom
[JENKINS] Archiving <https://builds.apache.org/job/Struts-JDK7-pull-request/ws/plugins/pell-multipart/pom.xml> to org.apache.struts/struts2-pell-multipart-plugin/2.5.11-SNAPSHOT/struts2-pell-multipart-plugin-2.5.11-SNAPSHOT.pom
[JENKINS] Archiving <https://builds.apache.org/job/Struts-JDK7-pull-request/ws/bundles/admin/pom.xml> to org.apache.struts/struts2-osgi-admin-bundle/2.5.11-SNAPSHOT/struts2-osgi-admin-bundle-2.5.11-SNAPSHOT.pom
[JENKINS] Archiving <https://builds.apache.org/job/Struts-JDK7-pull-request/ws/plugins/sitemesh/pom.xml> to org.apache.struts/struts2-sitemesh-plugin/2.5.11-SNAPSHOT/struts2-sitemesh-plugin-2.5.11-SNAPSHOT.pom
[JENKINS] Archiving <https://builds.apache.org/job/Struts-JDK7-pull-request/ws/plugins/pom.xml> to org.apache.struts/struts2-plugins/2.5.11-SNAPSHOT/struts2-plugins-2.5.11-SNAPSHOT.pom
[JENKINS] Archiving <https://builds.apache.org/job/Struts-JDK7-pull-request/ws/plugins/bean-validation/pom.xml> to org.apache.struts/struts2-bean-validation-plugin/2.5.11-SNAPSHOT/struts2-bean-validation-plugin-2.5.11-SNAPSHOT.pom
[JENKINS] Archiving <https://builds.apache.org/job/Struts-JDK7-pull-request/ws/plugins/plexus/pom.xml> to org.apache.struts/struts2-plexus-plugin/2.5.11-SNAPSHOT/struts2-plexus-plugin-2.5.11-SNAPSHOT.pom
[JENKINS] Archiving <https://builds.apache.org/job/Struts-JDK7-pull-request/ws/plugins/sitegraph/pom.xml> to org.apache.struts/struts2-sitegraph-plugin/2.5.11-SNAPSHOT/struts2-sitegraph-plugin-2.5.11-SNAPSHOT.pom
[JENKINS] Archiving <https://builds.apache.org/job/Struts-JDK7-pull-request/ws/plugins/cdi/pom.xml> to org.apache.struts/struts2-cdi-plugin/2.5.11-SNAPSHOT/struts2-cdi-plugin-2.5.11-SNAPSHOT.pom
[JENKINS] Archiving <https://builds.apache.org/job/Struts-JDK7-pull-request/ws/plugins/json/pom.xml> to org.apache.struts/struts2-json-plugin/2.5.11-SNAPSHOT/struts2-json-plugin-2.5.11-SNAPSHOT.pom
[JENKINS] Archiving <https://builds.apache.org/job/Struts-JDK7-pull-request/ws/plugins/tiles/pom.xml> to org.apache.struts/struts2-tiles-plugin/2.5.11-SNAPSHOT/struts2-tiles-plugin-2.5.11-SNAPSHOT.pom
[JENKINS] Archiving <https://builds.apache.org/job/Struts-JDK7-pull-request/ws/plugins/spring/pom.xml> to org.apache.struts/struts2-spring-plugin/2.5.11-SNAPSHOT/struts2-spring-plugin-2.5.11-SNAPSHOT.pom
[JENKINS] Archiving <https://builds.apache.org/job/Struts-JDK7-pull-request/ws/plugins/jfreechart/pom.xml> to org.apache.struts/struts2-jfreechart-plugin/2.5.11-SNAPSHOT/struts2-jfreechart-plugin-2.5.11-SNAPSHOT.pom
[JENKINS] Archiving <https://builds.apache.org/job/Struts-JDK7-pull-request/ws/bundles/demo/pom.xml> to org.apache.struts/struts2-osgi-demo-bundle/2.5.11-SNAPSHOT/struts2-osgi-demo-bundle-2.5.11-SNAPSHOT.pom
[JENKINS] Archiving <https://builds.apache.org/job/Struts-JDK7-pull-request/ws/plugins/embeddedjsp/pom.xml> to org.apache.struts/struts2-embeddedjsp-plugin/2.5.11-SNAPSHOT/struts2-embeddedjsp-plugin-2.5.11-SNAPSHOT.pom
[JENKINS] Archiving <https://builds.apache.org/job/Struts-JDK7-pull-request/ws/plugins/junit/pom.xml> to org.apache.struts/struts2-junit-plugin/2.5.11-SNAPSHOT/struts2-junit-plugin-2.5.11-SNAPSHOT.pom
[locks-and-latches] Releasing all the locks
[locks-and-latches] All the locks released
channel stopped
Putting comment on the pull request

---------------------------------------------------------------------
To unsubscribe, e-mail: [hidden email]
For additional commands, e-mail: [hidden email]

Reply | Threaded
Open this post in threaded view
|  
Report Content as Inappropriate

Jenkins build is back to normal : Struts-JDK7-pull-request #250

Apache Jenkins Server-2
See <https://builds.apache.org/job/Struts-JDK7-pull-request/250/display/redirect?page=changes>


---------------------------------------------------------------------
To unsubscribe, e-mail: [hidden email]
For additional commands, e-mail: [hidden email]

Loading...