Build failed in Jenkins: Struts-JDK6-support-2.3 #1054

classic Classic list List threaded Threaded
10 messages Options
Reply | Threaded
Open this post in threaded view
|  
Report Content as Inappropriate

Build failed in Jenkins: Struts-JDK6-support-2.3 #1054

Apache Jenkins Server-2
See <https://builds.apache.org/job/Struts-JDK6-support-2.3/1054/display/redirect?page=changes>

Changes:

[Lukasz Lenart] Uses default error key if specified key doesn't exist

[Lukasz Lenart] [maven-release-plugin] prepare release STRUTS_2_3_32

[Lukasz Lenart] [maven-release-plugin] prepare for next development iteration

------------------------------------------
Started by an SCM change
[EnvInject] - Loading node environment variables.
Building remotely on H23 (ubuntu) in workspace <https://builds.apache.org/job/Struts-JDK6-support-2.3/ws/>
Cloning the remote Git repository
Cloning repository http://git.apache.org/struts.git
 > git init <https://builds.apache.org/job/Struts-JDK6-support-2.3/ws/> # timeout=10
Fetching upstream changes from http://git.apache.org/struts.git
 > git --version # timeout=10
 > git fetch --tags --progress http://git.apache.org/struts.git +refs/heads/*:refs/remotes/origin/*
 > git config remote.origin.url http://git.apache.org/struts.git # timeout=10
 > git config --add remote.origin.fetch +refs/heads/*:refs/remotes/origin/* # timeout=10
 > git config remote.origin.url http://git.apache.org/struts.git # timeout=10
Fetching upstream changes from http://git.apache.org/struts.git
 > git fetch --tags --progress http://git.apache.org/struts.git +refs/heads/*:refs/remotes/origin/*
 > git rev-parse refs/remotes/origin/support-2-3^{commit} # timeout=10
 > git rev-parse refs/remotes/origin/refs/heads/support-2-3^{commit} # timeout=10
Checking out Revision 4d888a5ab6318288a771bacfdc879ee16270d937 (refs/remotes/origin/support-2-3)
 > git config core.sparsecheckout # timeout=10
 > git checkout -f 4d888a5ab6318288a771bacfdc879ee16270d937
 > git rev-list 54dff362f50a60084c9ff01ef59516686d26c9f1 # timeout=10
[locks-and-latches] Checking to see if we really have the locks
[locks-and-latches] Have all the locks, build can start
Parsing POMs
Downloaded artifact http://repo.maven.apache.org/maven2/org/apache/struts/struts-master/9/struts-master-9.pom
Modules changed, recalculating dependency graph
Established TCP socket on 43779
maven33-agent.jar already up to date
maven33-interceptor.jar already up to date
maven3-interceptor-commons.jar already up to date
[Struts-JDK6-support-2.3] $ /home/jenkins/tools/java/latest1.6/bin/java -Xms128m -Xmx768m -XX:MaxPermSize=256m -XX:PermSize=128m -cp /home/jenkins/jenkins-slave/maven33-agent.jar:/home/jenkins/tools/maven/latest3/boot/plexus-classworlds-2.5.2.jar:/home/jenkins/tools/maven/latest3/conf/logging jenkins.maven3.agent.Maven33Main /home/jenkins/tools/maven/latest3/ /home/jenkins/jenkins-slave/slave.jar /home/jenkins/jenkins-slave/maven33-interceptor.jar /home/jenkins/jenkins-slave/maven3-interceptor-commons.jar 43779
Native maven support requires Java 1.7 or later, but this Maven is using /usr/local/asfpackages/java/jdk1.6.0_45-64/jre
Please use the freestyle project.
[locks-and-latches] Releasing all the locks
[locks-and-latches] All the locks released
ERROR: Failed to launch Maven. Exit code = 1


---------------------------------------------------------------------
To unsubscribe, e-mail: [hidden email]
For additional commands, e-mail: [hidden email]

Reply | Threaded
Open this post in threaded view
|  
Report Content as Inappropriate

Build failed in Jenkins: Struts-JDK6-support-2.3 #1055

Apache Jenkins Server-2
See <https://builds.apache.org/job/Struts-JDK6-support-2.3/1055/display/redirect>

------------------------------------------
Started by an SCM change
[EnvInject] - Loading node environment variables.
Building remotely on H17 (ubuntu) in workspace <https://builds.apache.org/job/Struts-JDK6-support-2.3/ws/>
 > git rev-parse --is-inside-work-tree # timeout=10
Fetching changes from the remote Git repository
 > git config remote.origin.url http://git.apache.org/struts.git # timeout=10
Fetching upstream changes from http://git.apache.org/struts.git
 > git --version # timeout=10
 > git fetch --tags --progress http://git.apache.org/struts.git +refs/heads/*:refs/remotes/origin/*
 > git rev-parse refs/remotes/origin/support-2-3^{commit} # timeout=10
 > git rev-parse refs/remotes/origin/refs/heads/support-2-3^{commit} # timeout=10
Checking out Revision 4d888a5ab6318288a771bacfdc879ee16270d937 (refs/remotes/origin/support-2-3)
 > git config core.sparsecheckout # timeout=10
 > git checkout -f 4d888a5ab6318288a771bacfdc879ee16270d937
 > git rev-list 4d888a5ab6318288a771bacfdc879ee16270d937 # timeout=10
[locks-and-latches] Checking to see if we really have the locks
[locks-and-latches] Have all the locks, build can start
Parsing POMs
Downloaded artifact http://repo.maven.apache.org/maven2/org/apache/struts/struts-master/9/struts-master-9.pom
Modules changed, recalculating dependency graph
Established TCP socket on 35751
maven32-agent.jar already up to date
maven32-interceptor.jar already up to date
maven3-interceptor-commons.jar already up to date
[Struts-JDK6-support-2.3] $ /home/jenkins/tools/java/latest1.6/bin/java -Xms128m -Xmx768m -XX:MaxPermSize=256m -XX:PermSize=128m -cp /home/jenkins/jenkins-slave/maven32-agent.jar:/home/jenkins/tools/maven/apache-maven-3.2.5/boot/plexus-classworlds-2.5.2.jar:/home/jenkins/tools/maven/apache-maven-3.2.5/conf/logging jenkins.maven3.agent.Maven32Main /home/jenkins/tools/maven/apache-maven-3.2.5 /home/jenkins/jenkins-slave/slave.jar /home/jenkins/jenkins-slave/maven32-interceptor.jar /home/jenkins/jenkins-slave/maven3-interceptor-commons.jar 35751
Exception in thread "main" java.lang.UnsupportedClassVersionError: hudson/remoting/Launcher : Unsupported major.minor version 51.0
        at java.lang.ClassLoader.defineClass1(Native Method)
        at java.lang.ClassLoader.defineClassCond(ClassLoader.java:631)
        at java.lang.ClassLoader.defineClass(ClassLoader.java:615)
        at java.security.SecureClassLoader.defineClass(SecureClassLoader.java:141)
        at java.net.URLClassLoader.defineClass(URLClassLoader.java:283)
        at java.net.URLClassLoader.access$000(URLClassLoader.java:58)
        at java.net.URLClassLoader$1.run(URLClassLoader.java:197)
        at java.security.AccessController.doPrivileged(Native Method)
        at java.net.URLClassLoader.findClass(URLClassLoader.java:190)
        at org.codehaus.plexus.classworlds.realm.ClassRealm.loadClassFromSelf(ClassRealm.java:401)
        at org.codehaus.plexus.classworlds.strategy.SelfFirstStrategy.loadClass(SelfFirstStrategy.java:42)
        at org.codehaus.plexus.classworlds.realm.ClassRealm.unsynchronizedLoadClass(ClassRealm.java:271)
        at org.codehaus.plexus.classworlds.realm.ClassRealm.loadClass(ClassRealm.java:254)
        at org.codehaus.plexus.classworlds.realm.ClassRealm.loadClass(ClassRealm.java:239)
        at jenkins.maven3.agent.Maven32Main.main(Maven32Main.java:143)
        at jenkins.maven3.agent.Maven32Main.main(Maven32Main.java:74)
[locks-and-latches] Releasing all the locks
[locks-and-latches] All the locks released
ERROR: Failed to parse POMs
java.io.EOFException: unexpected stream termination
        at hudson.remoting.ChannelBuilder.negotiate(ChannelBuilder.java:365)
        at hudson.remoting.ChannelBuilder.build(ChannelBuilder.java:310)
        at hudson.slaves.Channels.forProcess(Channels.java:115)
        at hudson.maven.AbstractMavenProcessFactory.newProcess(AbstractMavenProcessFactory.java:294)
        at hudson.maven.ProcessCache.get(ProcessCache.java:236)
        at hudson.maven.MavenModuleSetBuild$MavenModuleSetBuildExecution.doRun(MavenModuleSetBuild.java:798)
        at hudson.model.AbstractBuild$AbstractBuildExecution.run(AbstractBuild.java:534)
        at hudson.model.Run.execute(Run.java:1728)
        at hudson.maven.MavenModuleSetBuild.run(MavenModuleSetBuild.java:544)
        at hudson.model.ResourceController.execute(ResourceController.java:98)
        at hudson.model.Executor.run(Executor.java:404)

---------------------------------------------------------------------
To unsubscribe, e-mail: [hidden email]
For additional commands, e-mail: [hidden email]

Reply | Threaded
Open this post in threaded view
|  
Report Content as Inappropriate

Build failed in Jenkins: Struts-JDK6-support-2.3 #1056

Apache Jenkins Server-2
See <https://builds.apache.org/job/Struts-JDK6-support-2.3/1056/display/redirect>

------------------------------------------
Started by user Lukasz Lenart
[EnvInject] - Loading node environment variables.
Building remotely on H14 (ubuntu) in workspace <https://builds.apache.org/job/Struts-JDK6-support-2.3/ws/>
Cloning the remote Git repository
Cloning repository http://git.apache.org/struts.git
 > git init <https://builds.apache.org/job/Struts-JDK6-support-2.3/ws/> # timeout=10
Fetching upstream changes from http://git.apache.org/struts.git
 > git --version # timeout=10
 > git fetch --tags --progress http://git.apache.org/struts.git +refs/heads/*:refs/remotes/origin/*
 > git config remote.origin.url http://git.apache.org/struts.git # timeout=10
 > git config --add remote.origin.fetch +refs/heads/*:refs/remotes/origin/* # timeout=10
 > git config remote.origin.url http://git.apache.org/struts.git # timeout=10
Fetching upstream changes from http://git.apache.org/struts.git
 > git fetch --tags --progress http://git.apache.org/struts.git +refs/heads/*:refs/remotes/origin/*
 > git rev-parse refs/remotes/origin/support-2-3^{commit} # timeout=10
 > git rev-parse refs/remotes/origin/refs/heads/support-2-3^{commit} # timeout=10
Checking out Revision 4d888a5ab6318288a771bacfdc879ee16270d937 (refs/remotes/origin/support-2-3)
 > git config core.sparsecheckout # timeout=10
 > git checkout -f 4d888a5ab6318288a771bacfdc879ee16270d937
 > git rev-list 4d888a5ab6318288a771bacfdc879ee16270d937 # timeout=10
[locks-and-latches] Checking to see if we really have the locks
[locks-and-latches] Have all the locks, build can start
Parsing POMs
Modules changed, recalculating dependency graph
Established TCP socket on 43466
maven32-agent.jar already up to date
maven32-interceptor.jar already up to date
maven3-interceptor-commons.jar already up to date
[Struts-JDK6-support-2.3] $ /home/jenkins/tools/java/latest1.6/bin/java -Xms128m -Xmx768m -XX:MaxPermSize=256m -XX:PermSize=128m -cp /home/jenkins/jenkins-slave/maven32-agent.jar:/home/jenkins/tools/maven/apache-maven-3.2.1/boot/plexus-classworlds-2.5.1.jar:/home/jenkins/tools/maven/apache-maven-3.2.1/conf/logging jenkins.maven3.agent.Maven32Main /home/jenkins/tools/maven/apache-maven-3.2.1 /home/jenkins/jenkins-slave/slave.jar /home/jenkins/jenkins-slave/maven32-interceptor.jar /home/jenkins/jenkins-slave/maven3-interceptor-commons.jar 43466
Exception in thread "main" java.lang.UnsupportedClassVersionError: hudson/remoting/Launcher : Unsupported major.minor version 51.0
        at java.lang.ClassLoader.defineClass1(Native Method)
        at java.lang.ClassLoader.defineClassCond(ClassLoader.java:631)
        at java.lang.ClassLoader.defineClass(ClassLoader.java:615)
        at java.security.SecureClassLoader.defineClass(SecureClassLoader.java:141)
        at java.net.URLClassLoader.defineClass(URLClassLoader.java:283)
        at java.net.URLClassLoader.access$000(URLClassLoader.java:58)
        at java.net.URLClassLoader$1.run(URLClassLoader.java:197)
        at java.security.AccessController.doPrivileged(Native Method)
        at java.net.URLClassLoader.findClass(URLClassLoader.java:190)
        at org.codehaus.plexus.classworlds.realm.ClassRealm.loadClassFromSelf(ClassRealm.java:389)
        at org.codehaus.plexus.classworlds.strategy.SelfFirstStrategy.loadClass(SelfFirstStrategy.java:42)
        at org.codehaus.plexus.classworlds.realm.ClassRealm.unsynchronizedLoadClass(ClassRealm.java:259)
        at org.codehaus.plexus.classworlds.realm.ClassRealm.loadClass(ClassRealm.java:242)
        at org.codehaus.plexus.classworlds.realm.ClassRealm.loadClass(ClassRealm.java:227)
        at jenkins.maven3.agent.Maven32Main.main(Maven32Main.java:143)
        at jenkins.maven3.agent.Maven32Main.main(Maven32Main.java:74)
[locks-and-latches] Releasing all the locks
[locks-and-latches] All the locks released
ERROR: Failed to parse POMs
java.io.EOFException: unexpected stream termination
        at hudson.remoting.ChannelBuilder.negotiate(ChannelBuilder.java:365)
        at hudson.remoting.ChannelBuilder.build(ChannelBuilder.java:310)
        at hudson.slaves.Channels.forProcess(Channels.java:115)
        at hudson.maven.AbstractMavenProcessFactory.newProcess(AbstractMavenProcessFactory.java:294)
        at hudson.maven.ProcessCache.get(ProcessCache.java:236)
        at hudson.maven.MavenModuleSetBuild$MavenModuleSetBuildExecution.doRun(MavenModuleSetBuild.java:798)
        at hudson.model.AbstractBuild$AbstractBuildExecution.run(AbstractBuild.java:534)
        at hudson.model.Run.execute(Run.java:1728)
        at hudson.maven.MavenModuleSetBuild.run(MavenModuleSetBuild.java:544)
        at hudson.model.ResourceController.execute(ResourceController.java:98)
        at hudson.model.Executor.run(Executor.java:404)

---------------------------------------------------------------------
To unsubscribe, e-mail: [hidden email]
For additional commands, e-mail: [hidden email]

Reply | Threaded
Open this post in threaded view
|  
Report Content as Inappropriate

Re: Build failed in Jenkins: Struts-JDK6-support-2.3 #1056

Lukasz Lenart
I think it's time to say Goodbye version 2.3.x ;-)


Regards
--
Ɓukasz
+ 48 606 323 122 http://www.lenart.org.pl/

2017-03-06 13:01 GMT+01:00 Apache Jenkins Server <[hidden email]>:

> See <https://builds.apache.org/job/Struts-JDK6-support-2.3/1056/display/redirect>
>
> ------------------------------------------
> Started by user Lukasz Lenart
> [EnvInject] - Loading node environment variables.
> Building remotely on H14 (ubuntu) in workspace <https://builds.apache.org/job/Struts-JDK6-support-2.3/ws/>
> Cloning the remote Git repository
> Cloning repository http://git.apache.org/struts.git
>  > git init <https://builds.apache.org/job/Struts-JDK6-support-2.3/ws/> # timeout=10
> Fetching upstream changes from http://git.apache.org/struts.git
>  > git --version # timeout=10
>  > git fetch --tags --progress http://git.apache.org/struts.git +refs/heads/*:refs/remotes/origin/*
>  > git config remote.origin.url http://git.apache.org/struts.git # timeout=10
>  > git config --add remote.origin.fetch +refs/heads/*:refs/remotes/origin/* # timeout=10
>  > git config remote.origin.url http://git.apache.org/struts.git # timeout=10
> Fetching upstream changes from http://git.apache.org/struts.git
>  > git fetch --tags --progress http://git.apache.org/struts.git +refs/heads/*:refs/remotes/origin/*
>  > git rev-parse refs/remotes/origin/support-2-3^{commit} # timeout=10
>  > git rev-parse refs/remotes/origin/refs/heads/support-2-3^{commit} # timeout=10
> Checking out Revision 4d888a5ab6318288a771bacfdc879ee16270d937 (refs/remotes/origin/support-2-3)
>  > git config core.sparsecheckout # timeout=10
>  > git checkout -f 4d888a5ab6318288a771bacfdc879ee16270d937
>  > git rev-list 4d888a5ab6318288a771bacfdc879ee16270d937 # timeout=10
> [locks-and-latches] Checking to see if we really have the locks
> [locks-and-latches] Have all the locks, build can start
> Parsing POMs
> Modules changed, recalculating dependency graph
> Established TCP socket on 43466
> maven32-agent.jar already up to date
> maven32-interceptor.jar already up to date
> maven3-interceptor-commons.jar already up to date
> [Struts-JDK6-support-2.3] $ /home/jenkins/tools/java/latest1.6/bin/java -Xms128m -Xmx768m -XX:MaxPermSize=256m -XX:PermSize=128m -cp /home/jenkins/jenkins-slave/maven32-agent.jar:/home/jenkins/tools/maven/apache-maven-3.2.1/boot/plexus-classworlds-2.5.1.jar:/home/jenkins/tools/maven/apache-maven-3.2.1/conf/logging jenkins.maven3.agent.Maven32Main /home/jenkins/tools/maven/apache-maven-3.2.1 /home/jenkins/jenkins-slave/slave.jar /home/jenkins/jenkins-slave/maven32-interceptor.jar /home/jenkins/jenkins-slave/maven3-interceptor-commons.jar 43466
> Exception in thread "main" java.lang.UnsupportedClassVersionError: hudson/remoting/Launcher : Unsupported major.minor version 51.0
>         at java.lang.ClassLoader.defineClass1(Native Method)
>         at java.lang.ClassLoader.defineClassCond(ClassLoader.java:631)
>         at java.lang.ClassLoader.defineClass(ClassLoader.java:615)
>         at java.security.SecureClassLoader.defineClass(SecureClassLoader.java:141)
>         at java.net.URLClassLoader.defineClass(URLClassLoader.java:283)
>         at java.net.URLClassLoader.access$000(URLClassLoader.java:58)
>         at java.net.URLClassLoader$1.run(URLClassLoader.java:197)
>         at java.security.AccessController.doPrivileged(Native Method)
>         at java.net.URLClassLoader.findClass(URLClassLoader.java:190)
>         at org.codehaus.plexus.classworlds.realm.ClassRealm.loadClassFromSelf(ClassRealm.java:389)
>         at org.codehaus.plexus.classworlds.strategy.SelfFirstStrategy.loadClass(SelfFirstStrategy.java:42)
>         at org.codehaus.plexus.classworlds.realm.ClassRealm.unsynchronizedLoadClass(ClassRealm.java:259)
>         at org.codehaus.plexus.classworlds.realm.ClassRealm.loadClass(ClassRealm.java:242)
>         at org.codehaus.plexus.classworlds.realm.ClassRealm.loadClass(ClassRealm.java:227)
>         at jenkins.maven3.agent.Maven32Main.main(Maven32Main.java:143)
>         at jenkins.maven3.agent.Maven32Main.main(Maven32Main.java:74)
> [locks-and-latches] Releasing all the locks
> [locks-and-latches] All the locks released
> ERROR: Failed to parse POMs
> java.io.EOFException: unexpected stream termination
>         at hudson.remoting.ChannelBuilder.negotiate(ChannelBuilder.java:365)
>         at hudson.remoting.ChannelBuilder.build(ChannelBuilder.java:310)
>         at hudson.slaves.Channels.forProcess(Channels.java:115)
>         at hudson.maven.AbstractMavenProcessFactory.newProcess(AbstractMavenProcessFactory.java:294)
>         at hudson.maven.ProcessCache.get(ProcessCache.java:236)
>         at hudson.maven.MavenModuleSetBuild$MavenModuleSetBuildExecution.doRun(MavenModuleSetBuild.java:798)
>         at hudson.model.AbstractBuild$AbstractBuildExecution.run(AbstractBuild.java:534)
>         at hudson.model.Run.execute(Run.java:1728)
>         at hudson.maven.MavenModuleSetBuild.run(MavenModuleSetBuild.java:544)
>         at hudson.model.ResourceController.execute(ResourceController.java:98)
>         at hudson.model.Executor.run(Executor.java:404)
>
> ---------------------------------------------------------------------
> To unsubscribe, e-mail: [hidden email]
> For additional commands, e-mail: [hidden email]
>

---------------------------------------------------------------------
To unsubscribe, e-mail: [hidden email]
For additional commands, e-mail: [hidden email]

Reply | Threaded
Open this post in threaded view
|  
Report Content as Inappropriate

Build failed in Jenkins: Struts-JDK6-support-2.3 #1057

Apache Jenkins Server-2
In reply to this post by Apache Jenkins Server-2
See <https://builds.apache.org/job/Struts-JDK6-support-2.3/1057/display/redirect>

------------------------------------------
Started by user Lukasz Lenart
[EnvInject] - Loading node environment variables.
Building remotely on H14 (ubuntu) in workspace <https://builds.apache.org/job/Struts-JDK6-support-2.3/ws/>
 > git rev-parse --is-inside-work-tree # timeout=10
Fetching changes from the remote Git repository
 > git config remote.origin.url http://git.apache.org/struts.git # timeout=10
Fetching upstream changes from http://git.apache.org/struts.git
 > git --version # timeout=10
 > git fetch --tags --progress http://git.apache.org/struts.git +refs/heads/*:refs/remotes/origin/*
 > git rev-parse refs/remotes/origin/support-2-3^{commit} # timeout=10
 > git rev-parse refs/remotes/origin/refs/heads/support-2-3^{commit} # timeout=10
Checking out Revision 4d888a5ab6318288a771bacfdc879ee16270d937 (refs/remotes/origin/support-2-3)
 > git config core.sparsecheckout # timeout=10
 > git checkout -f 4d888a5ab6318288a771bacfdc879ee16270d937
 > git rev-list 4d888a5ab6318288a771bacfdc879ee16270d937 # timeout=10
[locks-and-latches] Checking to see if we really have the locks
[locks-and-latches] Have all the locks, build can start
Parsing POMs
Modules changed, recalculating dependency graph
Established TCP socket on 35284
maven3-agent.jar already up to date
maven3-interceptor.jar already up to date
maven3-interceptor-commons.jar already up to date
[Struts-JDK6-support-2.3] $ /home/jenkins/tools/java/latest1.6/bin/java -Xms128m -Xmx768m -XX:MaxPermSize=256m -XX:PermSize=128m -cp /home/jenkins/jenkins-slave/maven3-agent.jar:/home/jenkins/tools/maven/apache-maven-3.0.4/boot/plexus-classworlds-2.4.jar org.jvnet.hudson.maven3.agent.Maven3Main /home/jenkins/tools/maven/apache-maven-3.0.4 /home/jenkins/jenkins-slave/slave.jar /home/jenkins/jenkins-slave/maven3-interceptor.jar /home/jenkins/jenkins-slave/maven3-interceptor-commons.jar 35284
Exception in thread "main" java.lang.UnsupportedClassVersionError: hudson/remoting/Launcher : Unsupported major.minor version 51.0
        at java.lang.ClassLoader.defineClass1(Native Method)
        at java.lang.ClassLoader.defineClassCond(ClassLoader.java:631)
        at java.lang.ClassLoader.defineClass(ClassLoader.java:615)
        at java.security.SecureClassLoader.defineClass(SecureClassLoader.java:141)
        at java.net.URLClassLoader.defineClass(URLClassLoader.java:283)
        at java.net.URLClassLoader.access$000(URLClassLoader.java:58)
        at java.net.URLClassLoader$1.run(URLClassLoader.java:197)
        at java.security.AccessController.doPrivileged(Native Method)
        at java.net.URLClassLoader.findClass(URLClassLoader.java:190)
        at org.codehaus.plexus.classworlds.realm.ClassRealm.loadClassFromSelf(ClassRealm.java:386)
        at org.codehaus.plexus.classworlds.strategy.SelfFirstStrategy.loadClass(SelfFirstStrategy.java:42)
        at org.codehaus.plexus.classworlds.realm.ClassRealm.loadClass(ClassRealm.java:244)
        at org.codehaus.plexus.classworlds.realm.ClassRealm.loadClass(ClassRealm.java:230)
        at org.jvnet.hudson.maven3.agent.Maven3Main.main(Maven3Main.java:138)
        at org.jvnet.hudson.maven3.agent.Maven3Main.main(Maven3Main.java:70)
[locks-and-latches] Releasing all the locks
[locks-and-latches] All the locks released
ERROR: Failed to parse POMs
java.io.EOFException: unexpected stream termination
        at hudson.remoting.ChannelBuilder.negotiate(ChannelBuilder.java:365)
        at hudson.remoting.ChannelBuilder.build(ChannelBuilder.java:310)
        at hudson.slaves.Channels.forProcess(Channels.java:115)
        at hudson.maven.AbstractMavenProcessFactory.newProcess(AbstractMavenProcessFactory.java:294)
        at hudson.maven.ProcessCache.get(ProcessCache.java:236)
        at hudson.maven.MavenModuleSetBuild$MavenModuleSetBuildExecution.doRun(MavenModuleSetBuild.java:798)
        at hudson.model.AbstractBuild$AbstractBuildExecution.run(AbstractBuild.java:534)
        at hudson.model.Run.execute(Run.java:1728)
        at hudson.maven.MavenModuleSetBuild.run(MavenModuleSetBuild.java:544)
        at hudson.model.ResourceController.execute(ResourceController.java:98)
        at hudson.model.Executor.run(Executor.java:404)

---------------------------------------------------------------------
To unsubscribe, e-mail: [hidden email]
For additional commands, e-mail: [hidden email]

Reply | Threaded
Open this post in threaded view
|  
Report Content as Inappropriate

Build failed in Jenkins: Struts-JDK6-support-2.3 #1058

Apache Jenkins Server-2
See <https://builds.apache.org/job/Struts-JDK6-support-2.3/1058/display/redirect?page=changes>

Changes:

[Lukasz Lenart] WW-4735 Ports more relax domain suffix validation

------------------------------------------
Started by an SCM change
[EnvInject] - Loading node environment variables.
Building remotely on H14 (ubuntu) in workspace <https://builds.apache.org/job/Struts-JDK6-support-2.3/ws/>
 > git rev-parse --is-inside-work-tree # timeout=10
Fetching changes from the remote Git repository
 > git config remote.origin.url http://git.apache.org/struts.git # timeout=10
Fetching upstream changes from http://git.apache.org/struts.git
 > git --version # timeout=10
 > git fetch --tags --progress http://git.apache.org/struts.git +refs/heads/*:refs/remotes/origin/*
 > git rev-parse refs/remotes/origin/support-2-3^{commit} # timeout=10
 > git rev-parse refs/remotes/origin/refs/heads/support-2-3^{commit} # timeout=10
Checking out Revision c349dfa5abb6f6072304eca3d679d6f2dd448f52 (refs/remotes/origin/support-2-3)
 > git config core.sparsecheckout # timeout=10
 > git checkout -f c349dfa5abb6f6072304eca3d679d6f2dd448f52
 > git rev-list 4d888a5ab6318288a771bacfdc879ee16270d937 # timeout=10
[locks-and-latches] Checking to see if we really have the locks
[locks-and-latches] Have all the locks, build can start
Parsing POMs
Modules changed, recalculating dependency graph
Established TCP socket on 37702
maven3-agent.jar already up to date
maven3-interceptor.jar already up to date
maven3-interceptor-commons.jar already up to date
[Struts-JDK6-support-2.3] $ /home/jenkins/tools/java/latest1.6/bin/java -Xms128m -Xmx768m -XX:MaxPermSize=256m -XX:PermSize=128m -cp /home/jenkins/jenkins-slave/maven3-agent.jar:/home/jenkins/tools/maven/apache-maven-3.0.4/boot/plexus-classworlds-2.4.jar org.jvnet.hudson.maven3.agent.Maven3Main /home/jenkins/tools/maven/apache-maven-3.0.4 /home/jenkins/jenkins-slave/slave.jar /home/jenkins/jenkins-slave/maven3-interceptor.jar /home/jenkins/jenkins-slave/maven3-interceptor-commons.jar 37702
Exception in thread "main" java.lang.UnsupportedClassVersionError: hudson/remoting/Launcher : Unsupported major.minor version 51.0
        at java.lang.ClassLoader.defineClass1(Native Method)
        at java.lang.ClassLoader.defineClassCond(ClassLoader.java:631)
        at java.lang.ClassLoader.defineClass(ClassLoader.java:615)
        at java.security.SecureClassLoader.defineClass(SecureClassLoader.java:141)
        at java.net.URLClassLoader.defineClass(URLClassLoader.java:283)
        at java.net.URLClassLoader.access$000(URLClassLoader.java:58)
        at java.net.URLClassLoader$1.run(URLClassLoader.java:197)
        at java.security.AccessController.doPrivileged(Native Method)
        at java.net.URLClassLoader.findClass(URLClassLoader.java:190)
        at org.codehaus.plexus.classworlds.realm.ClassRealm.loadClassFromSelf(ClassRealm.java:386)
        at org.codehaus.plexus.classworlds.strategy.SelfFirstStrategy.loadClass(SelfFirstStrategy.java:42)
        at org.codehaus.plexus.classworlds.realm.ClassRealm.loadClass(ClassRealm.java:244)
        at org.codehaus.plexus.classworlds.realm.ClassRealm.loadClass(ClassRealm.java:230)
        at org.jvnet.hudson.maven3.agent.Maven3Main.main(Maven3Main.java:138)
        at org.jvnet.hudson.maven3.agent.Maven3Main.main(Maven3Main.java:70)
[locks-and-latches] Releasing all the locks
[locks-and-latches] All the locks released
ERROR: Failed to parse POMs
java.io.EOFException: unexpected stream termination
        at hudson.remoting.ChannelBuilder.negotiate(ChannelBuilder.java:365)
        at hudson.remoting.ChannelBuilder.build(ChannelBuilder.java:310)
        at hudson.slaves.Channels.forProcess(Channels.java:115)
        at hudson.maven.AbstractMavenProcessFactory.newProcess(AbstractMavenProcessFactory.java:294)
        at hudson.maven.ProcessCache.get(ProcessCache.java:236)
        at hudson.maven.MavenModuleSetBuild$MavenModuleSetBuildExecution.doRun(MavenModuleSetBuild.java:798)
        at hudson.model.AbstractBuild$AbstractBuildExecution.run(AbstractBuild.java:534)
        at hudson.model.Run.execute(Run.java:1728)
        at hudson.maven.MavenModuleSetBuild.run(MavenModuleSetBuild.java:544)
        at hudson.model.ResourceController.execute(ResourceController.java:98)
        at hudson.model.Executor.run(Executor.java:404)
[JIRA] Updating issue WW-4735

---------------------------------------------------------------------
To unsubscribe, e-mail: [hidden email]
For additional commands, e-mail: [hidden email]

Reply | Threaded
Open this post in threaded view
|  
Report Content as Inappropriate

Build failed in Jenkins: Struts-JDK6-support-2.3 #1059

Apache Jenkins Server-2
See <https://builds.apache.org/job/Struts-JDK6-support-2.3/1059/display/redirect>

------------------------------------------
Started by user Lukasz Lenart
[EnvInject] - Loading node environment variables.
Building remotely on H15 (ubuntu) in workspace <https://builds.apache.org/job/Struts-JDK6-support-2.3/ws/>
Cloning the remote Git repository
Cloning repository http://git.apache.org/struts.git
 > git init <https://builds.apache.org/job/Struts-JDK6-support-2.3/ws/> # timeout=10
Fetching upstream changes from http://git.apache.org/struts.git
 > git --version # timeout=10
 > git fetch --tags --progress http://git.apache.org/struts.git +refs/heads/*:refs/remotes/origin/*
 > git config remote.origin.url http://git.apache.org/struts.git # timeout=10
 > git config --add remote.origin.fetch +refs/heads/*:refs/remotes/origin/* # timeout=10
 > git config remote.origin.url http://git.apache.org/struts.git # timeout=10
Fetching upstream changes from http://git.apache.org/struts.git
 > git fetch --tags --progress http://git.apache.org/struts.git +refs/heads/*:refs/remotes/origin/*
 > git rev-parse refs/remotes/origin/support-2-3^{commit} # timeout=10
 > git rev-parse refs/remotes/origin/refs/heads/support-2-3^{commit} # timeout=10
Checking out Revision c349dfa5abb6f6072304eca3d679d6f2dd448f52 (refs/remotes/origin/support-2-3)
 > git config core.sparsecheckout # timeout=10
 > git checkout -f c349dfa5abb6f6072304eca3d679d6f2dd448f52
 > git rev-list c349dfa5abb6f6072304eca3d679d6f2dd448f52 # timeout=10
[locks-and-latches] Checking to see if we really have the locks
[locks-and-latches] Have all the locks, build can start
Parsing POMs
Modules changed, recalculating dependency graph
Established TCP socket on 42421
maven-agent.jar already up to date
classworlds.jar already up to date
maven-interceptor.jar already up to date
maven2.1-interceptor.jar already up to date
[Struts-JDK6-support-2.3] $ /home/jenkins/tools/java/latest1.6/bin/java -Xms128m -Xmx768m -XX:MaxPermSize=256m -XX:PermSize=128m -cp /home/jenkins/jenkins-slave/maven-agent.jar:/home/jenkins/jenkins-slave/classworlds.jar hudson.maven.agent.Main /home/jenkins/tools/maven/apache-maven-2.2.1 /home/jenkins/jenkins-slave/slave.jar /home/jenkins/jenkins-slave/maven-interceptor.jar 42421 /home/jenkins/jenkins-slave/maven2.1-interceptor.jar
Exception in thread "main" java.lang.UnsupportedClassVersionError: hudson/remoting/Launcher : Unsupported major.minor version 51.0
        at java.lang.ClassLoader.defineClass1(Native Method)
        at java.lang.ClassLoader.defineClassCond(ClassLoader.java:631)
        at java.lang.ClassLoader.defineClass(ClassLoader.java:615)
        at java.security.SecureClassLoader.defineClass(SecureClassLoader.java:141)
        at java.net.URLClassLoader.defineClass(URLClassLoader.java:283)
        at java.net.URLClassLoader.access$000(URLClassLoader.java:58)
        at java.net.URLClassLoader$1.run(URLClassLoader.java:197)
        at java.security.AccessController.doPrivileged(Native Method)
        at java.net.URLClassLoader.findClass(URLClassLoader.java:190)
        at java.lang.ClassLoader.loadClass(ClassLoader.java:306)
        at org.codehaus.classworlds.RealmClassLoader.loadClassDirect(RealmClassLoader.java:195)
        at org.codehaus.classworlds.DefaultClassRealm.loadClass(DefaultClassRealm.java:255)
        at hudson.maven.agent.Main.main(Main.java:143)
        at hudson.maven.agent.Main.main(Main.java:68)
[locks-and-latches] Releasing all the locks
[locks-and-latches] All the locks released
ERROR: Failed to parse POMs
java.io.EOFException: unexpected stream termination
        at hudson.remoting.ChannelBuilder.negotiate(ChannelBuilder.java:365)
        at hudson.remoting.ChannelBuilder.build(ChannelBuilder.java:310)
        at hudson.slaves.Channels.forProcess(Channels.java:115)
        at hudson.maven.AbstractMavenProcessFactory.newProcess(AbstractMavenProcessFactory.java:294)
        at hudson.maven.ProcessCache.get(ProcessCache.java:236)
        at hudson.maven.MavenModuleSetBuild$MavenModuleSetBuildExecution.doRun(MavenModuleSetBuild.java:798)
        at hudson.model.AbstractBuild$AbstractBuildExecution.run(AbstractBuild.java:534)
        at hudson.model.Run.execute(Run.java:1728)
        at hudson.maven.MavenModuleSetBuild.run(MavenModuleSetBuild.java:544)
        at hudson.model.ResourceController.execute(ResourceController.java:98)
        at hudson.model.Executor.run(Executor.java:404)

---------------------------------------------------------------------
To unsubscribe, e-mail: [hidden email]
For additional commands, e-mail: [hidden email]

Reply | Threaded
Open this post in threaded view
|  
Report Content as Inappropriate

Re: Build failed in Jenkins: Struts-JDK6-support-2.3 #1059

Lukasz Lenart
I have switched this build to JDK7 as running on JDK6 doesn't work
anymore ... time to say goodbye 2.3.x series :)

2017-03-24 17:02 GMT+01:00 Apache Jenkins Server <[hidden email]>:

> See <https://builds.apache.org/job/Struts-JDK6-support-2.3/1059/display/redirect>
>
> ------------------------------------------
> Started by user Lukasz Lenart
> [EnvInject] - Loading node environment variables.
> Building remotely on H15 (ubuntu) in workspace <https://builds.apache.org/job/Struts-JDK6-support-2.3/ws/>
> Cloning the remote Git repository
> Cloning repository http://git.apache.org/struts.git
>  > git init <https://builds.apache.org/job/Struts-JDK6-support-2.3/ws/> # timeout=10
> Fetching upstream changes from http://git.apache.org/struts.git
>  > git --version # timeout=10
>  > git fetch --tags --progress http://git.apache.org/struts.git +refs/heads/*:refs/remotes/origin/*
>  > git config remote.origin.url http://git.apache.org/struts.git # timeout=10
>  > git config --add remote.origin.fetch +refs/heads/*:refs/remotes/origin/* # timeout=10
>  > git config remote.origin.url http://git.apache.org/struts.git # timeout=10
> Fetching upstream changes from http://git.apache.org/struts.git
>  > git fetch --tags --progress http://git.apache.org/struts.git +refs/heads/*:refs/remotes/origin/*
>  > git rev-parse refs/remotes/origin/support-2-3^{commit} # timeout=10
>  > git rev-parse refs/remotes/origin/refs/heads/support-2-3^{commit} # timeout=10
> Checking out Revision c349dfa5abb6f6072304eca3d679d6f2dd448f52 (refs/remotes/origin/support-2-3)
>  > git config core.sparsecheckout # timeout=10
>  > git checkout -f c349dfa5abb6f6072304eca3d679d6f2dd448f52
>  > git rev-list c349dfa5abb6f6072304eca3d679d6f2dd448f52 # timeout=10
> [locks-and-latches] Checking to see if we really have the locks
> [locks-and-latches] Have all the locks, build can start
> Parsing POMs
> Modules changed, recalculating dependency graph
> Established TCP socket on 42421
> maven-agent.jar already up to date
> classworlds.jar already up to date
> maven-interceptor.jar already up to date
> maven2.1-interceptor.jar already up to date
> [Struts-JDK6-support-2.3] $ /home/jenkins/tools/java/latest1.6/bin/java -Xms128m -Xmx768m -XX:MaxPermSize=256m -XX:PermSize=128m -cp /home/jenkins/jenkins-slave/maven-agent.jar:/home/jenkins/jenkins-slave/classworlds.jar hudson.maven.agent.Main /home/jenkins/tools/maven/apache-maven-2.2.1 /home/jenkins/jenkins-slave/slave.jar /home/jenkins/jenkins-slave/maven-interceptor.jar 42421 /home/jenkins/jenkins-slave/maven2.1-interceptor.jar
> Exception in thread "main" java.lang.UnsupportedClassVersionError: hudson/remoting/Launcher : Unsupported major.minor version 51.0
>         at java.lang.ClassLoader.defineClass1(Native Method)
>         at java.lang.ClassLoader.defineClassCond(ClassLoader.java:631)
>         at java.lang.ClassLoader.defineClass(ClassLoader.java:615)
>         at java.security.SecureClassLoader.defineClass(SecureClassLoader.java:141)
>         at java.net.URLClassLoader.defineClass(URLClassLoader.java:283)
>         at java.net.URLClassLoader.access$000(URLClassLoader.java:58)
>         at java.net.URLClassLoader$1.run(URLClassLoader.java:197)
>         at java.security.AccessController.doPrivileged(Native Method)
>         at java.net.URLClassLoader.findClass(URLClassLoader.java:190)
>         at java.lang.ClassLoader.loadClass(ClassLoader.java:306)
>         at org.codehaus.classworlds.RealmClassLoader.loadClassDirect(RealmClassLoader.java:195)
>         at org.codehaus.classworlds.DefaultClassRealm.loadClass(DefaultClassRealm.java:255)
>         at hudson.maven.agent.Main.main(Main.java:143)
>         at hudson.maven.agent.Main.main(Main.java:68)
> [locks-and-latches] Releasing all the locks
> [locks-and-latches] All the locks released
> ERROR: Failed to parse POMs
> java.io.EOFException: unexpected stream termination
>         at hudson.remoting.ChannelBuilder.negotiate(ChannelBuilder.java:365)
>         at hudson.remoting.ChannelBuilder.build(ChannelBuilder.java:310)
>         at hudson.slaves.Channels.forProcess(Channels.java:115)
>         at hudson.maven.AbstractMavenProcessFactory.newProcess(AbstractMavenProcessFactory.java:294)
>         at hudson.maven.ProcessCache.get(ProcessCache.java:236)
>         at hudson.maven.MavenModuleSetBuild$MavenModuleSetBuildExecution.doRun(MavenModuleSetBuild.java:798)
>         at hudson.model.AbstractBuild$AbstractBuildExecution.run(AbstractBuild.java:534)
>         at hudson.model.Run.execute(Run.java:1728)
>         at hudson.maven.MavenModuleSetBuild.run(MavenModuleSetBuild.java:544)
>         at hudson.model.ResourceController.execute(ResourceController.java:98)
>         at hudson.model.Executor.run(Executor.java:404)
>
> ---------------------------------------------------------------------
> To unsubscribe, e-mail: [hidden email]
> For additional commands, e-mail: [hidden email]
>

---------------------------------------------------------------------
To unsubscribe, e-mail: [hidden email]
For additional commands, e-mail: [hidden email]

Reply | Threaded
Open this post in threaded view
|  
Report Content as Inappropriate

Jenkins build is unstable: Struts-JDK6-support-2.3 #1060

Apache Jenkins Server-2
In reply to this post by Apache Jenkins Server-2
See <https://builds.apache.org/job/Struts-JDK6-support-2.3/1060/display/redirect>


---------------------------------------------------------------------
To unsubscribe, e-mail: [hidden email]
For additional commands, e-mail: [hidden email]

Reply | Threaded
Open this post in threaded view
|  
Report Content as Inappropriate

Jenkins build is still unstable: Struts-JDK6-support-2.3 #1061

Apache Jenkins Server-2
See <https://builds.apache.org/job/Struts-JDK6-support-2.3/1061/display/redirect?page=changes>


---------------------------------------------------------------------
To unsubscribe, e-mail: [hidden email]
For additional commands, e-mail: [hidden email]

Loading...